{
  "data_features": {
    "feature": [
      {
        "data_type": "nominal",
        "index": "0",
        "is_ignore": "false",
        "is_row_identifier": "true",
        "is_target": "false",
        "name": "molecule_id",
        "nominal_value": [
          "CHEMBL10",
          "CHEMBL100305",
          "CHEMBL100523",
          "CHEMBL100542",
          "CHEMBL100734",
          "CHEMBL100735",
          "CHEMBL100736",
          "CHEMBL100804",
          "CHEMBL100841",
          "CHEMBL100852",
          "CHEMBL100982",
          "CHEMBL101113",
          "CHEMBL101127",
          "CHEMBL101224",
          "CHEMBL101227",
          "CHEMBL101253",
          "CHEMBL101311",
          "CHEMBL102210",
          "CHEMBL102301",
          "CHEMBL102330",
          "CHEMBL102346",
          "CHEMBL102383",
          "CHEMBL102427",
          "CHEMBL102554",
          "CHEMBL102686",
          "CHEMBL102908",
          "CHEMBL102911",
          "CHEMBL103003",
          "CHEMBL103012",
          "CHEMBL103066",
          "CHEMBL103082",
          "CHEMBL103179",
          "CHEMBL103326",
          "CHEMBL103447",
          "CHEMBL103456",
          "CHEMBL103487",
          "CHEMBL103490",
          "CHEMBL103599",
          "CHEMBL103667",
          "CHEMBL103690",
          "CHEMBL103702",
          "CHEMBL103776",
          "CHEMBL103861",
          "CHEMBL103870",
          "CHEMBL104067",
          "CHEMBL104090",
          "CHEMBL104094",
          "CHEMBL104206",
          "CHEMBL104325",
          "CHEMBL104339",
          "CHEMBL104427",
          "CHEMBL104466",
          "CHEMBL104862",
          "CHEMBL104896",
          "CHEMBL104922",
          "CHEMBL104924",
          "CHEMBL104964",
          "CHEMBL105032",
          "CHEMBL105107",
          "CHEMBL105183",
          "CHEMBL105227",
          "CHEMBL105239",
          "CHEMBL105259",
          "CHEMBL105280",
          "CHEMBL105409",
          "CHEMBL105442",
          "CHEMBL105622",
          "CHEMBL105689",
          "CHEMBL105702",
          "CHEMBL105711",
          "CHEMBL106068",
          "CHEMBL106332",
          "CHEMBL106494",
          "CHEMBL106966",
          "CHEMBL106967",
          "CHEMBL107599",
          "CHEMBL107901",
          "CHEMBL1079545",
          "CHEMBL1080580",
          "CHEMBL1081198",
          "CHEMBL1081312",
          "CHEMBL1081509",
          "CHEMBL1084546",
          "CHEMBL1093099",
          "CHEMBL1093100",
          "CHEMBL1094423",
          "CHEMBL1095130",
          "CHEMBL1095464",
          "CHEMBL1095465",
          "CHEMBL1095761",
          "CHEMBL1095776",
          "CHEMBL1164180",
          "CHEMBL1172957",
          "CHEMBL1173482",
          "CHEMBL1173655",
          "CHEMBL117697",
          "CHEMBL118440",
          "CHEMBL119385",
          "CHEMBL119910",
          "CHEMBL120077",
          "CHEMBL120634",
          "CHEMBL120862",
          "CHEMBL121161",
          "CHEMBL1215218",
          "CHEMBL1215346",
          "CHEMBL121829",
          "CHEMBL122528",
          "CHEMBL122572",
          "CHEMBL1230020",
          "CHEMBL1233887",
          "CHEMBL1236107",
          "CHEMBL123667",
          "CHEMBL123928",
          "CHEMBL124035",
          "CHEMBL1240703",
          "CHEMBL124073",
          "CHEMBL124089",
          "CHEMBL1241674",
          "CHEMBL124243",
          "CHEMBL124313",
          "CHEMBL124369",
          "CHEMBL124439",
          "CHEMBL124487",
          "CHEMBL124660",
          "CHEMBL124827",
          "CHEMBL124872",
          "CHEMBL124895",
          "CHEMBL124949",
          "CHEMBL124983",
          "CHEMBL125028",
          "CHEMBL125141",
          "CHEMBL125146",
          "CHEMBL125171",
          "CHEMBL125252",
          "CHEMBL125277",
          "CHEMBL125304",
          "CHEMBL125367",
          "CHEMBL1254007",
          "CHEMBL1254285",
          "CHEMBL1254286",
          "CHEMBL125431",
          "CHEMBL1254363",
          "CHEMBL1254444",
          "CHEMBL125445",
          "CHEMBL125451",
          "CHEMBL125717",
          "CHEMBL125721",
          "CHEMBL125761",
          "CHEMBL125805",
          "CHEMBL125811",
          "CHEMBL1258603",
          "CHEMBL125898",
          "CHEMBL125994",
          "CHEMBL126173",
          "CHEMBL126699",
          "CHEMBL1269858",
          "CHEMBL127429",
          "CHEMBL127581",
          "CHEMBL127635",
          "CHEMBL1276890",
          "CHEMBL1276891",
          "CHEMBL1276980",
          "CHEMBL1276981",
          "CHEMBL1277071",
          "CHEMBL1277072",
          "CHEMBL1277161",
          "CHEMBL127731",
          "CHEMBL127748",
          "CHEMBL127753",
          "CHEMBL127786",
          "CHEMBL1278146",
          "CHEMBL1278147",
          "CHEMBL1278233",
          "CHEMBL1278234",
          "CHEMBL127886",
          "CHEMBL1287853",
          "CHEMBL1288582",
          "CHEMBL1289926",
          "CHEMBL13354",
          "CHEMBL1336",
          "CHEMBL13485",
          "CHEMBL13608",
          "CHEMBL13629",
          "CHEMBL13976",
          "CHEMBL13983",
          "CHEMBL141247",
          "CHEMBL1421",
          "CHEMBL1421720",
          "CHEMBL143703",
          "CHEMBL143892",
          "CHEMBL143986",
          "CHEMBL144054",
          "CHEMBL144076",
          "CHEMBL144077",
          "CHEMBL144078",
          "CHEMBL144109",
          "CHEMBL144279",
          "CHEMBL144296",
          "CHEMBL144307",
          "CHEMBL144340",
          "CHEMBL144368",
          "CHEMBL144369",
          "CHEMBL144390",
          "CHEMBL144433",
          "CHEMBL144574",
          "CHEMBL144593",
          "CHEMBL144622",
          "CHEMBL144687",
          "CHEMBL144725",
          "CHEMBL144749",
          "CHEMBL1448",
          "CHEMBL144816",
          "CHEMBL144860",
          "CHEMBL144862",
          "CHEMBL144990",
          "CHEMBL145179",
          "CHEMBL145259",
          "CHEMBL146020",
          "CHEMBL146078",
          "CHEMBL146114",
          "CHEMBL146694",
          "CHEMBL146697",
          "CHEMBL146876",
          "CHEMBL146993",
          "CHEMBL147001",
          "CHEMBL147052",
          "CHEMBL147056",
          "CHEMBL147112",
          "CHEMBL147277",
          "CHEMBL147325",
          "CHEMBL14762",
          "CHEMBL147761",
          "CHEMBL147837",
          "CHEMBL147841",
          "CHEMBL147916",
          "CHEMBL147917",
          "CHEMBL148047",
          "CHEMBL148084",
          "CHEMBL148221",
          "CHEMBL148225",
          "CHEMBL148259",
          "CHEMBL148382",
          "CHEMBL148514",
          "CHEMBL148744",
          "CHEMBL148984",
          "CHEMBL149073",
          "CHEMBL149201",
          "CHEMBL149243",
          "CHEMBL150151",
          "CHEMBL150177",
          "CHEMBL150894",
          "CHEMBL153843",
          "CHEMBL1614701",
          "CHEMBL1614725",
          "CHEMBL1615278",
          "CHEMBL162",
          "CHEMBL1630107",
          "CHEMBL1630108",
          "CHEMBL1630109",
          "CHEMBL1630110",
          "CHEMBL1630111",
          "CHEMBL1630112",
          "CHEMBL1630113",
          "CHEMBL1630114",
          "CHEMBL1630115",
          "CHEMBL1630116",
          "CHEMBL1630117",
          "CHEMBL1630118",
          "CHEMBL1651523",
          "CHEMBL1668411",
          "CHEMBL1668414",
          "CHEMBL1668418",
          "CHEMBL1668419",
          "CHEMBL1668420",
          "CHEMBL1721885",
          "CHEMBL1727312",
          "CHEMBL175596",
          "CHEMBL1784637",
          "CHEMBL1784725",
          "CHEMBL1789941",
          "CHEMBL1794070",
          "CHEMBL180022",
          "CHEMBL1813632",
          "CHEMBL1825138",
          "CHEMBL182515",
          "CHEMBL1835870",
          "CHEMBL183731",
          "CHEMBL183923",
          "CHEMBL183929",
          "CHEMBL183987",
          "CHEMBL184078",
          "CHEMBL184082",
          "CHEMBL184118",
          "CHEMBL184129",
          "CHEMBL184180",
          "CHEMBL184188",
          "CHEMBL184227",
          "CHEMBL184231",
          "CHEMBL184235",
          "CHEMBL184244",
          "CHEMBL184254",
          "CHEMBL184352",
          "CHEMBL184382",
          "CHEMBL184392",
          "CHEMBL184414",
          "CHEMBL184575",
          "CHEMBL184642",
          "CHEMBL184699",
          "CHEMBL184753",
          "CHEMBL184906",
          "CHEMBL184913",
          "CHEMBL184948",
          "CHEMBL185391",
          "CHEMBL185510",
          "CHEMBL185597",
          "CHEMBL185605",
          "CHEMBL185921",
          "CHEMBL186550",
          "CHEMBL186612",
          "CHEMBL186618",
          "CHEMBL186645",
          "CHEMBL186658",
          "CHEMBL186682",
          "CHEMBL186698",
          "CHEMBL186718",
          "CHEMBL186719",
          "CHEMBL186767",
          "CHEMBL186850",
          "CHEMBL186851",
          "CHEMBL186889",
          "CHEMBL186905",
          "CHEMBL186922",
          "CHEMBL186923",
          "CHEMBL187144",
          "CHEMBL187280",
          "CHEMBL187688",
          "CHEMBL1879463",
          "CHEMBL187960",
          "CHEMBL189963",
          "CHEMBL1908391",
          "CHEMBL1908392",
          "CHEMBL1908393",
          "CHEMBL1908394",
          "CHEMBL1908395",
          "CHEMBL1908396",
          "CHEMBL1908397",
          "CHEMBL191003",
          "CHEMBL1916359",
          "CHEMBL1929238",
          "CHEMBL1929552",
          "CHEMBL1929555",
          "CHEMBL1929557",
          "CHEMBL1934327",
          "CHEMBL1934626",
          "CHEMBL1940103",
          "CHEMBL1940104",
          "CHEMBL1940105",
          "CHEMBL1940106",
          "CHEMBL1940107",
          "CHEMBL1940108",
          "CHEMBL1940109",
          "CHEMBL1940110",
          "CHEMBL1940111",
          "CHEMBL1940112",
          "CHEMBL1940113",
          "CHEMBL1940114",
          "CHEMBL1940115",
          "CHEMBL1940116",
          "CHEMBL1940117",
          "CHEMBL1940118",
          "CHEMBL1940259",
          "CHEMBL1940260",
          "CHEMBL1940261",
          "CHEMBL1940262",
          "CHEMBL1940263",
          "CHEMBL1940264",
          "CHEMBL1940265",
          "CHEMBL1940266",
          "CHEMBL1940267",
          "CHEMBL1940268",
          "CHEMBL1940269",
          "CHEMBL1940270",
          "CHEMBL1940271",
          "CHEMBL1940272",
          "CHEMBL1940273",
          "CHEMBL1940274",
          "CHEMBL1940275",
          "CHEMBL194498",
          "CHEMBL1945170",
          "CHEMBL1945171",
          "CHEMBL1945172",
          "CHEMBL1945173",
          "CHEMBL1945497",
          "CHEMBL1945498",
          "CHEMBL1945499",
          "CHEMBL1945501",
          "CHEMBL1945502",
          "CHEMBL1945801",
          "CHEMBL1945803",
          "CHEMBL1945804",
          "CHEMBL1949855",
          "CHEMBL195218",
          "CHEMBL1956068",
          "CHEMBL1956885",
          "CHEMBL1956886",
          "CHEMBL1956887",
          "CHEMBL1956890",
          "CHEMBL1956893",
          "CHEMBL1956898",
          "CHEMBL1957190",
          "CHEMBL195903",
          "CHEMBL196363",
          "CHEMBL1964382",
          "CHEMBL1964441",
          "CHEMBL1964718",
          "CHEMBL1964902",
          "CHEMBL1964948",
          "CHEMBL1965033",
          "CHEMBL1965169",
          "CHEMBL1965170",
          "CHEMBL1965387",
          "CHEMBL1966175",
          "CHEMBL1967211",
          "CHEMBL1967252",
          "CHEMBL1967336",
          "CHEMBL1967513",
          "CHEMBL1967878",
          "CHEMBL1967992",
          "CHEMBL1968130",
          "CHEMBL1968394",
          "CHEMBL1968606",
          "CHEMBL1968868",
          "CHEMBL1969151",
          "CHEMBL1969156",
          "CHEMBL1969664",
          "CHEMBL1969942",
          "CHEMBL1970290",
          "CHEMBL1970340",
          "CHEMBL1970352",
          "CHEMBL1970873",
          "CHEMBL1971289",
          "CHEMBL1971519",
          "CHEMBL1971534",
          "CHEMBL1972220",
          "CHEMBL1972355",
          "CHEMBL1972454",
          "CHEMBL1972934",
          "CHEMBL1973013",
          "CHEMBL1973138",
          "CHEMBL1973359",
          "CHEMBL1973363",
          "CHEMBL1973399",
          "CHEMBL1973720",
          "CHEMBL1973793",
          "CHEMBL1973795",
          "CHEMBL1973868",
          "CHEMBL1973961",
          "CHEMBL1974328",
          "CHEMBL1974480",
          "CHEMBL1974617",
          "CHEMBL1974875",
          "CHEMBL1975121",
          "CHEMBL1975212",
          "CHEMBL1975503",
          "CHEMBL1975903",
          "CHEMBL1975921",
          "CHEMBL1975923",
          "CHEMBL1975927",
          "CHEMBL1976196",
          "CHEMBL1976290",
          "CHEMBL1976376",
          "CHEMBL1976420",
          "CHEMBL1976872",
          "CHEMBL1977134",
          "CHEMBL1977138",
          "CHEMBL1977749",
          "CHEMBL1977814",
          "CHEMBL1977931",
          "CHEMBL1978166",
          "CHEMBL1978167",
          "CHEMBL1978195",
          "CHEMBL1978371",
          "CHEMBL1978448",
          "CHEMBL1978562",
          "CHEMBL1978567",
          "CHEMBL1979690",
          "CHEMBL1979773",
          "CHEMBL1980167",
          "CHEMBL1980246",
          "CHEMBL1980297",
          "CHEMBL1980329",
          "CHEMBL1980376",
          "CHEMBL1980391",
          "CHEMBL1980407",
          "CHEMBL1980671",
          "CHEMBL1980763",
          "CHEMBL1980995",
          "CHEMBL1981047",
          "CHEMBL1981215",
          "CHEMBL1981492",
          "CHEMBL1981744",
          "CHEMBL1981792",
          "CHEMBL1982413",
          "CHEMBL1982660",
          "CHEMBL1982700",
          "CHEMBL1982711",
          "CHEMBL1983111",
          "CHEMBL1983268",
          "CHEMBL1983348",
          "CHEMBL1983393",
          "CHEMBL1983573",
          "CHEMBL1983575",
          "CHEMBL1983630",
          "CHEMBL1983640",
          "CHEMBL1983715",
          "CHEMBL1983923",
          "CHEMBL1983945",
          "CHEMBL1983980",
          "CHEMBL1984038",
          "CHEMBL1984236",
          "CHEMBL1984402",
          "CHEMBL1984686",
          "CHEMBL1984760",
          "CHEMBL1984842",
          "CHEMBL1985206",
          "CHEMBL1985367",
          "CHEMBL1985681",
          "CHEMBL1986143",
          "CHEMBL1986177",
          "CHEMBL1986265",
          "CHEMBL198642",
          "CHEMBL1986590",
          "CHEMBL1986756",
          "CHEMBL1986899",
          "CHEMBL1986943",
          "CHEMBL1987430",
          "CHEMBL1987535",
          "CHEMBL1987815",
          "CHEMBL1987998",
          "CHEMBL1988141",
          "CHEMBL1988437",
          "CHEMBL1988581",
          "CHEMBL1988622",
          "CHEMBL1988692",
          "CHEMBL1988805",
          "CHEMBL1989043",
          "CHEMBL1989267",
          "CHEMBL1989423",
          "CHEMBL1989471",
          "CHEMBL1989708",
          "CHEMBL1989834",
          "CHEMBL1990254",
          "CHEMBL1990496",
          "CHEMBL1990885",
          "CHEMBL1991678",
          "CHEMBL1991734",
          "CHEMBL1991782",
          "CHEMBL1991867",
          "CHEMBL1992042",
          "CHEMBL1992125",
          "CHEMBL1992371",
          "CHEMBL1992581",
          "CHEMBL1992673",
          "CHEMBL1992723",
          "CHEMBL1992937",
          "CHEMBL1993335",
          "CHEMBL1993374",
          "CHEMBL1993661",
          "CHEMBL1993877",
          "CHEMBL1993904",
          "CHEMBL1994159",
          "CHEMBL1994526",
          "CHEMBL1994555",
          "CHEMBL1994724",
          "CHEMBL1994808",
          "CHEMBL1995172",
          "CHEMBL1995765",
          "CHEMBL1995811",
          "CHEMBL1995916",
          "CHEMBL1996048",
          "CHEMBL1996176",
          "CHEMBL1996345",
          "CHEMBL1996500",
          "CHEMBL1996576",
          "CHEMBL1996646",
          "CHEMBL1996649",
          "CHEMBL1996702",
          "CHEMBL1996837",
          "CHEMBL1997007",
          "CHEMBL1997119",
          "CHEMBL1997193",
          "CHEMBL1997197",
          "CHEMBL1997275",
          "CHEMBL1997335",
          "CHEMBL1997892",
          "CHEMBL1998110",
          "CHEMBL1998680",
          "CHEMBL1999120",
          "CHEMBL1999414",
          "CHEMBL1999484",
          "CHEMBL2000029",
          "CHEMBL2000568",
          "CHEMBL2000879",
          "CHEMBL2001019",
          "CHEMBL2001584",
          "CHEMBL2001613",
          "CHEMBL2001641",
          "CHEMBL2001987",
          "CHEMBL2002099",
          "CHEMBL2002105",
          "CHEMBL2002432",
          "CHEMBL2002450",
          "CHEMBL2002586",
          "CHEMBL2002599",
          "CHEMBL2002690",
          "CHEMBL2002723",
          "CHEMBL2002992",
          "CHEMBL2003514",
          "CHEMBL2003785",
          "CHEMBL2004025",
          "CHEMBL2004033",
          "CHEMBL2004118",
          "CHEMBL2004159",
          "CHEMBL2004290",
          "CHEMBL2004438",
          "CHEMBL2004515",
          "CHEMBL2004637",
          "CHEMBL2005449",
          "CHEMBL2005478",
          "CHEMBL2005699",
          "CHEMBL2005792",
          "CHEMBL2006299",
          "CHEMBL2006564",
          "CHEMBL2006674",
          "CHEMBL2006765",
          "CHEMBL2007097",
          "CHEMBL2007124",
          "CHEMBL200726",
          "CHEMBL2007266",
          "CHEMBL200735",
          "CHEMBL2007375",
          "CHEMBL2007479",
          "CHEMBL2007559",
          "CHEMBL200774",
          "CHEMBL200976",
          "CHEMBL201511",
          "CHEMBL2017214",
          "CHEMBL201840",
          "CHEMBL201865",
          "CHEMBL202162",
          "CHEMBL202216",
          "CHEMBL202244",
          "CHEMBL2023115",
          "CHEMBL2023116",
          "CHEMBL2023117",
          "CHEMBL2023118",
          "CHEMBL2023119",
          "CHEMBL2023474",
          "CHEMBL2023475",
          "CHEMBL2023476",
          "CHEMBL2023477",
          "CHEMBL2023478",
          "CHEMBL2023479",
          "CHEMBL2023480",
          "CHEMBL2023481",
          "CHEMBL2023482",
          "CHEMBL2023483",
          "CHEMBL2023484",
          "CHEMBL2023485",
          "CHEMBL2023486",
          "CHEMBL2023487",
          "CHEMBL2023488",
          "CHEMBL2023489",
          "CHEMBL2023490",
          "CHEMBL2023491",
          "CHEMBL2023492",
          "CHEMBL2023493",
          "CHEMBL2023494",
          "CHEMBL2023495",
          "CHEMBL2023496",
          "CHEMBL2023800",
          "CHEMBL2023801",
          "CHEMBL2023802",
          "CHEMBL202721",
          "CHEMBL2029988",
          "CHEMBL203567",
          "CHEMBL2035810",
          "CHEMBL204426",
          "CHEMBL204427",
          "CHEMBL2046883",
          "CHEMBL2047241",
          "CHEMBL2047243",
          "CHEMBL2047244",
          "CHEMBL2047245",
          "CHEMBL2047246",
          "CHEMBL2047247",
          "CHEMBL2047249",
          "CHEMBL2047250",
          "CHEMBL2047251",
          "CHEMBL2047252",
          "CHEMBL2047253",
          "CHEMBL2048912",
          "CHEMBL2063926",
          "CHEMBL206915",
          "CHEMBL207858",
          "CHEMBL2086760",
          "CHEMBL210420",
          "CHEMBL21156",
          "CHEMBL2148053",
          "CHEMBL215152",
          "CHEMBL2152252",
          "CHEMBL2152253",
          "CHEMBL215803",
          "CHEMBL217092",
          "CHEMBL2180604",
          "CHEMBL2203434",
          "CHEMBL2204532",
          "CHEMBL2206277",
          "CHEMBL2206278",
          "CHEMBL2206666",
          "CHEMBL2208034",
          "CHEMBL221959",
          "CHEMBL223360",
          "CHEMBL225519",
          "CHEMBL230011",
          "CHEMBL230686",
          "CHEMBL2309006",
          "CHEMBL2309609",
          "CHEMBL2311806",
          "CHEMBL2311807",
          "CHEMBL2311808",
          "CHEMBL231526",
          "CHEMBL2332119",
          "CHEMBL2332840",
          "CHEMBL2333163",
          "CHEMBL2333365",
          "CHEMBL2335015",
          "CHEMBL2335376",
          "CHEMBL2337366",
          "CHEMBL2337367",
          "CHEMBL234085",
          "CHEMBL2347053",
          "CHEMBL2348417",
          "CHEMBL237570",
          "CHEMBL242865",
          "CHEMBL24828",
          "CHEMBL249697",
          "CHEMBL253292",
          "CHEMBL253968",
          "CHEMBL253969",
          "CHEMBL255863",
          "CHEMBL256893",
          "CHEMBL258694",
          "CHEMBL258805",
          "CHEMBL259084",
          "CHEMBL261592",
          "CHEMBL261849",
          "CHEMBL262249",
          "CHEMBL262623",
          "CHEMBL264182",
          "CHEMBL264382",
          "CHEMBL267293",
          "CHEMBL268731",
          "CHEMBL269594",
          "CHEMBL270084",
          "CHEMBL273198",
          "CHEMBL274654",
          "CHEMBL275117",
          "CHEMBL276711",
          "CHEMBL278041",
          "CHEMBL281872",
          "CHEMBL288441",
          "CHEMBL289959",
          "CHEMBL291759",
          "CHEMBL292864",
          "CHEMBL292930",
          "CHEMBL293068",
          "CHEMBL293712",
          "CHEMBL296185",
          "CHEMBL296468",
          "CHEMBL298566",
          "CHEMBL299032",
          "CHEMBL300138",
          "CHEMBL300767",
          "CHEMBL300853",
          "CHEMBL301018",
          "CHEMBL301271",
          "CHEMBL301639",
          "CHEMBL302552",
          "CHEMBL304271",
          "CHEMBL304971",
          "CHEMBL305194",
          "CHEMBL305246",
          "CHEMBL305782",
          "CHEMBL306295",
          "CHEMBL308645",
          "CHEMBL308672",
          "CHEMBL309331",
          "CHEMBL312826",
          "CHEMBL313259",
          "CHEMBL313433",
          "CHEMBL313500",
          "CHEMBL313578",
          "CHEMBL313746",
          "CHEMBL313821",
          "CHEMBL314021",
          "CHEMBL314146",
          "CHEMBL314217",
          "CHEMBL314798",
          "CHEMBL314995",
          "CHEMBL315546",
          "CHEMBL315701",
          "CHEMBL315753",
          "CHEMBL316008",
          "CHEMBL316009",
          "CHEMBL316020",
          "CHEMBL316268",
          "CHEMBL316770",
          "CHEMBL317106",
          "CHEMBL317401",
          "CHEMBL318345",
          "CHEMBL318358",
          "CHEMBL318581",
          "CHEMBL319024",
          "CHEMBL319235",
          "CHEMBL319242",
          "CHEMBL319255",
          "CHEMBL31965",
          "CHEMBL319894",
          "CHEMBL320645",
          "CHEMBL320864",
          "CHEMBL321286",
          "CHEMBL321323",
          "CHEMBL321504",
          "CHEMBL321990",
          "CHEMBL322209",
          "CHEMBL322464",
          "CHEMBL322659",
          "CHEMBL322922",
          "CHEMBL323336",
          "CHEMBL323372",
          "CHEMBL323559",
          "CHEMBL327300",
          "CHEMBL328029",
          "CHEMBL328452",
          "CHEMBL328710",
          "CHEMBL329367",
          "CHEMBL330321",
          "CHEMBL330863",
          "CHEMBL331760",
          "CHEMBL332083",
          "CHEMBL332375",
          "CHEMBL333648",
          "CHEMBL334169",
          "CHEMBL337920",
          "CHEMBL338330",
          "CHEMBL338597",
          "CHEMBL338619",
          "CHEMBL338623",
          "CHEMBL338827",
          "CHEMBL339403",
          "CHEMBL339685",
          "CHEMBL339974",
          "CHEMBL340137",
          "CHEMBL340144",
          "CHEMBL340157",
          "CHEMBL340200",
          "CHEMBL340234",
          "CHEMBL340235",
          "CHEMBL340284",
          "CHEMBL340431",
          "CHEMBL340439",
          "CHEMBL341239",
          "CHEMBL341258",
          "CHEMBL341489",
          "CHEMBL342280",
          "CHEMBL342515",
          "CHEMBL342999",
          "CHEMBL343209",
          "CHEMBL343241",
          "CHEMBL344091",
          "CHEMBL344319",
          "CHEMBL344561",
          "CHEMBL344962",
          "CHEMBL347074",
          "CHEMBL347537",
          "CHEMBL352308",
          "CHEMBL354676",
          "CHEMBL356129",
          "CHEMBL356245",
          "CHEMBL356715",
          "CHEMBL357673",
          "CHEMBL357803",
          "CHEMBL358728",
          "CHEMBL359007",
          "CHEMBL359194",
          "CHEMBL359204",
          "CHEMBL359229",
          "CHEMBL360190",
          "CHEMBL360756",
          "CHEMBL360847",
          "CHEMBL361517",
          "CHEMBL363057",
          "CHEMBL363083",
          "CHEMBL363085",
          "CHEMBL363723",
          "CHEMBL363901",
          "CHEMBL363922",
          "CHEMBL364601",
          "CHEMBL365199",
          "CHEMBL365271",
          "CHEMBL365318",
          "CHEMBL370266",
          "CHEMBL371910",
          "CHEMBL371949",
          "CHEMBL373882",
          "CHEMBL377193",
          "CHEMBL377300",
          "CHEMBL377345",
          "CHEMBL377734",
          "CHEMBL379218",
          "CHEMBL379975",
          "CHEMBL382735",
          "CHEMBL383030",
          "CHEMBL383417",
          "CHEMBL384304",
          "CHEMBL386051",
          "CHEMBL403661",
          "CHEMBL403776",
          "CHEMBL406375",
          "CHEMBL406845",
          "CHEMBL408565",
          "CHEMBL410659",
          "CHEMBL411229",
          "CHEMBL414001",
          "CHEMBL415049",
          "CHEMBL418301",
          "CHEMBL419682",
          "CHEMBL419785",
          "CHEMBL420411",
          "CHEMBL420609",
          "CHEMBL420645",
          "CHEMBL421206",
          "CHEMBL421404",
          "CHEMBL421548",
          "CHEMBL422897",
          "CHEMBL423752",
          "CHEMBL424129",
          "CHEMBL424502",
          "CHEMBL425536",
          "CHEMBL425751",
          "CHEMBL428690",
          "CHEMBL429743",
          "CHEMBL430090",
          "CHEMBL430155",
          "CHEMBL430849",
          "CHEMBL431006",
          "CHEMBL431025",
          "CHEMBL431996",
          "CHEMBL432219",
          "CHEMBL432491",
          "CHEMBL432903",
          "CHEMBL432941",
          "CHEMBL434262",
          "CHEMBL435098",
          "CHEMBL435227",
          "CHEMBL436137",
          "CHEMBL440084",
          "CHEMBL441272",
          "CHEMBL442402",
          "CHEMBL443268",
          "CHEMBL443296",
          "CHEMBL444064",
          "CHEMBL445636",
          "CHEMBL445813",
          "CHEMBL448729",
          "CHEMBL449593",
          "CHEMBL450338",
          "CHEMBL450622",
          "CHEMBL450786",
          "CHEMBL452965",
          "CHEMBL453593",
          "CHEMBL457985",
          "CHEMBL458997",
          "CHEMBL459850",
          "CHEMBL460702",
          "CHEMBL460746",
          "CHEMBL460989",
          "CHEMBL460990",
          "CHEMBL461876",
          "CHEMBL464552",
          "CHEMBL473825",
          "CHEMBL473826",
          "CHEMBL474015",
          "CHEMBL474046",
          "CHEMBL474208",
          "CHEMBL474538",
          "CHEMBL474863",
          "CHEMBL475051",
          "CHEMBL475251",
          "CHEMBL475796",
          "CHEMBL475817",
          "CHEMBL475820",
          "CHEMBL477772",
          "CHEMBL480356",
          "CHEMBL482489",
          "CHEMBL482538",
          "CHEMBL482715",
          "CHEMBL482767",
          "CHEMBL482967",
          "CHEMBL483158",
          "CHEMBL483321",
          "CHEMBL484108",
          "CHEMBL484109",
          "CHEMBL485320",
          "CHEMBL485321",
          "CHEMBL48760",
          "CHEMBL488271",
          "CHEMBL488646",
          "CHEMBL489083",
          "CHEMBL490555",
          "CHEMBL49120",
          "CHEMBL491473",
          "CHEMBL491686",
          "CHEMBL492809",
          "CHEMBL492956",
          "CHEMBL493315",
          "CHEMBL493358",
          "CHEMBL494089",
          "CHEMBL495529",
          "CHEMBL495530",
          "CHEMBL495735",
          "CHEMBL495749",
          "CHEMBL495762",
          "CHEMBL495763",
          "CHEMBL495961",
          "CHEMBL495962",
          "CHEMBL495983",
          "CHEMBL495984",
          "CHEMBL496150",
          "CHEMBL496172",
          "CHEMBL496173",
          "CHEMBL496762",
          "CHEMBL496763",
          "CHEMBL496764",
          "CHEMBL498013",
          "CHEMBL498205",
          "CHEMBL498206",
          "CHEMBL498214",
          "CHEMBL498347",
          "CHEMBL498348",
          "CHEMBL498551",
          "CHEMBL499067",
          "CHEMBL499344",
          "CHEMBL499345",
          "CHEMBL502015",
          "CHEMBL502835",
          "CHEMBL504075",
          "CHEMBL505637",
          "CHEMBL505830",
          "CHEMBL50894",
          "CHEMBL509032",
          "CHEMBL509435",
          "CHEMBL511337",
          "CHEMBL513909",
          "CHEMBL514014",
          "CHEMBL514351",
          "CHEMBL514499",
          "CHEMBL514511",
          "CHEMBL515109",
          "CHEMBL515258",
          "CHEMBL515432",
          "CHEMBL521552",
          "CHEMBL521652",
          "CHEMBL521851",
          "CHEMBL522732",
          "CHEMBL522785",
          "CHEMBL522892",
          "CHEMBL523071",
          "CHEMBL523374",
          "CHEMBL523571",
          "CHEMBL523684",
          "CHEMBL523745",
          "CHEMBL52513",
          "CHEMBL525191",
          "CHEMBL526285",
          "CHEMBL526507",
          "CHEMBL526658",
          "CHEMBL526836",
          "CHEMBL529663",
          "CHEMBL533849",
          "CHEMBL535",
          "CHEMBL54283",
          "CHEMBL546797",
          "CHEMBL550418",
          "CHEMBL553",
          "CHEMBL554",
          "CHEMBL55496",
          "CHEMBL558752",
          "CHEMBL56109",
          "CHEMBL565612",
          "CHEMBL56569",
          "CHEMBL569880",
          "CHEMBL571040",
          "CHEMBL57143",
          "CHEMBL57256",
          "CHEMBL572878",
          "CHEMBL572881",
          "CHEMBL573339",
          "CHEMBL57446",
          "CHEMBL574588",
          "CHEMBL574613",
          "CHEMBL574738",
          "CHEMBL575925",
          "CHEMBL576982",
          "CHEMBL58224",
          "CHEMBL58483",
          "CHEMBL59042",
          "CHEMBL59073",
          "CHEMBL59110",
          "CHEMBL592030",
          "CHEMBL593221",
          "CHEMBL593245",
          "CHEMBL593274",
          "CHEMBL593275",
          "CHEMBL593292",
          "CHEMBL593294",
          "CHEMBL593306",
          "CHEMBL593760",
          "CHEMBL593770",
          "CHEMBL593860",
          "CHEMBL593905",
          "CHEMBL593908",
          "CHEMBL593909",
          "CHEMBL593910",
          "CHEMBL593911",
          "CHEMBL593971",
          "CHEMBL593987",
          "CHEMBL594228",
          "CHEMBL594339",
          "CHEMBL594661",
          "CHEMBL595142",
          "CHEMBL595143",
          "CHEMBL595373",
          "CHEMBL595374",
          "CHEMBL595406",
          "CHEMBL595497",
          "CHEMBL595615",
          "CHEMBL596087",
          "CHEMBL596292",
          "CHEMBL59735",
          "CHEMBL597492",
          "CHEMBL597592",
          "CHEMBL598626",
          "CHEMBL601719",
          "CHEMBL602123",
          "CHEMBL604483",
          "CHEMBL604485",
          "CHEMBL604893",
          "CHEMBL604992",
          "CHEMBL60541",
          "CHEMBL605957",
          "CHEMBL606168",
          "CHEMBL606466",
          "CHEMBL607707",
          "CHEMBL608154",
          "CHEMBL610181",
          "CHEMBL6246",
          "CHEMBL65848",
          "CHEMBL66570",
          "CHEMBL67003",
          "CHEMBL67057",
          "CHEMBL68258",
          "CHEMBL68920",
          "CHEMBL69071",
          "CHEMBL69106",
          "CHEMBL69358",
          "CHEMBL69629",
          "CHEMBL69709",
          "CHEMBL69960",
          "CHEMBL69964",
          "CHEMBL69966",
          "CHEMBL74197",
          "CHEMBL7432",
          "CHEMBL74587",
          "CHEMBL74646",
          "CHEMBL75034",
          "CHEMBL75196",
          "CHEMBL75232",
          "CHEMBL75462",
          "CHEMBL7572",
          "CHEMBL7600",
          "CHEMBL7724",
          "CHEMBL7735",
          "CHEMBL77555",
          "CHEMBL77933",
          "CHEMBL78257",
          "CHEMBL78303",
          "CHEMBL85021",
          "CHEMBL85403",
          "CHEMBL86326",
          "CHEMBL86432",
          "CHEMBL86480",
          "CHEMBL86531",
          "CHEMBL86631",
          "CHEMBL86755",
          "CHEMBL86837",
          "CHEMBL86921",
          "CHEMBL86943",
          "CHEMBL86944",
          "CHEMBL86945",
          "CHEMBL87080",
          "CHEMBL87208",
          "CHEMBL87324",
          "CHEMBL87325",
          "CHEMBL87402",
          "CHEMBL87746",
          "CHEMBL87783",
          "CHEMBL87810",
          "CHEMBL88405",
          "CHEMBL88462",
          "CHEMBL88483",
          "CHEMBL88606",
          "CHEMBL88771",
          "CHEMBL89010",
          "CHEMBL89040",
          "CHEMBL89363",
          "CHEMBL89483",
          "CHEMBL89505",
          "CHEMBL89646",
          "CHEMBL89697",
          "CHEMBL89721",
          "CHEMBL89723",
          "CHEMBL89809",
          "CHEMBL90277",
          "CHEMBL91250",
          "CHEMBL91815",
          "CHEMBL91829",
          "CHEMBL939",
          "CHEMBL941",
          "CHEMBL99635",
          "CHEMBL99729",
          "CHEMBL99743"
        ],
        "number_of_missing_values": "0"
      },
      {
        "data_type": "numeric",
        "index": "1",
        "is_ignore": "false",
        "is_row_identifier": "false",
        "is_target": "false",
        "name": "nBM",
        "number_of_missing_values": "0"
      },
      {
        "data_type": "numeric",
        "index": "2",
        "is_ignore": "false",
        "is_row_identifier": "false",
        "is_target": "false",
        "name": "RBN",
        "number_of_missing_values": "0"
      },
      {
        "data_type": "numeric",
        "index": "3",
        "is_ignore": "false",
        "is_row_identifier": "false",
        "is_target": "false",
        "name": "nSK",
        "number_of_missing_values": "0"
      },
      {
        "data_type": "numeric",
        "index": "4",
        "is_ignore": "false",
        "is_row_identifier": "false",
        "is_target": "false",
        "name": "RBF",
        "number_of_missing_values": "0"
      },
      {
        "data_type": "numeric",
        "index": "5",
        "is_ignore": "false",
        "is_row_identifier": "false",
        "is_target": "false",
        "name": "nAB",
        "number_of_missing_values": "0"
      },
      {
        "data_type": "numeric",
        "index": "6",
        "is_ignore": "false",
        "is_row_identifier": "false",
        "is_target": "false",
        "name": "Mp",
        "number_of_missing_values": "0"
      },
      {
        "data_type": "numeric",
        "index": "7",
        "is_ignore": "false",
        "is_row_identifier": "false",
        "is_target": "false",
        "name": "Si",
        "number_of_missing_values": "0"
      },
      {
        "data_type": "numeric",
        "index": "8",
        "is_ignore": "false",
        "is_row_identifier": "false",
        "is_target": "false",
        "name": "nN",
        "number_of_missing_values": "0"
      },
      {
        "data_type": "numeric",
        "index": "9",
        "is_ignore": "false",
        "is_row_identifier": "false",
        "is_target": "false",
        "name": "Se",
        "number_of_missing_values": "0"
      },
      {
        "data_type": "numeric",
        "index": "10",
        "is_ignore": "false",
        "is_row_identifier": "false",
        "is_target": "false",
        "name": "Sv",
        "number_of_missing_values": "0"
      },
      {
        "data_type": "numeric",
        "index": "11",
        "is_ignore": "false",
        "is_row_identifier": "false",
        "is_target": "false",
        "name": "MW",
        "number_of_missing_values": "0"
      },
      {
        "data_type": "numeric",
        "index": "12",
        "is_ignore": "false",
        "is_row_identifier": "false",
        "is_target": "false",
        "name": "nBT",
        "number_of_missing_values": "0"
      },
      {
        "data_type": "numeric",
        "index": "13",
        "is_ignore": "false",
        "is_row_identifier": "false",
        "is_target": "false",
        "name": "nAT",
        "number_of_missing_values": "0"
      },
      {
        "data_type": "numeric",
        "index": "14",
        "is_ignore": "false",
        "is_row_identifier": "false",
        "is_target": "false",
        "name": "nBO",
        "number_of_missing_values": "0"
      },
      {
        "data_type": "numeric",
        "index": "15",
        "is_ignore": "false",
        "is_row_identifier": "false",
        "is_target": "false",
        "name": "Sp",
        "number_of_missing_values": "0"
      },
      {
        "data_type": "numeric",
        "index": "16",
        "is_ignore": "false",
        "is_row_identifier": "false",
        "is_target": "false",
        "name": "SCBO",
        "number_of_missing_values": "0"
      },
      {
        "data_type": "numeric",
        "index": "17",
        "is_ignore": "false",
        "is_row_identifier": "false",
        "is_target": "false",
        "name": "nHet",
        "number_of_missing_values": "0"
      },
      {
        "data_type": "numeric",
        "index": "18",
        "is_ignore": "false",
        "is_row_identifier": "false",
        "is_target": "false",
        "name": "C.",
        "number_of_missing_values": "0"
      },
      {
        "data_type": "numeric",
        "index": "19",
        "is_ignore": "false",
        "is_row_identifier": "false",
        "is_target": "false",
        "name": "Mv",
        "number_of_missing_values": "0"
      },
      {
        "data_type": "numeric",
        "index": "20",
        "is_ignore": "false",
        "is_row_identifier": "false",
        "is_target": "false",
        "name": "AMW",
        "number_of_missing_values": "0"
      },
      {
        "data_type": "numeric",
        "index": "21",
        "is_ignore": "false",
        "is_row_identifier": "false",
        "is_target": "false",
        "name": "nC",
        "number_of_missing_values": "0"
      },
      {
        "data_type": "numeric",
        "index": "22",
        "is_ignore": "false",
        "is_row_identifier": "false",
        "is_target": "false",
        "name": "nH",
        "number_of_missing_values": "0"
      },
      {
        "data_type": "numeric",
        "index": "23",
        "is_ignore": "false",
        "is_row_identifier": "false",
        "is_target": "true",
        "name": "pXC50",
        "number_of_missing_values": "0"
      }
    ]
  }
}