{
  "data_features": {
    "feature": [
      {
        "data_type": "nominal",
        "index": "0",
        "is_ignore": "false",
        "is_row_identifier": "true",
        "is_target": "false",
        "name": "molecule_id",
        "nominal_value": [
          "CHEMBL1077582",
          "CHEMBL1077583",
          "CHEMBL1077584",
          "CHEMBL1077585",
          "CHEMBL1077586",
          "CHEMBL1077589",
          "CHEMBL1077590",
          "CHEMBL1077591",
          "CHEMBL1077592",
          "CHEMBL1090913",
          "CHEMBL1093247",
          "CHEMBL1093530",
          "CHEMBL1094936",
          "CHEMBL1095252",
          "CHEMBL1095253",
          "CHEMBL1095254",
          "CHEMBL1095255",
          "CHEMBL1095913",
          "CHEMBL1095914",
          "CHEMBL1095916",
          "CHEMBL1095917",
          "CHEMBL1095918",
          "CHEMBL1096255",
          "CHEMBL1097214",
          "CHEMBL1097230",
          "CHEMBL1097589",
          "CHEMBL1097590",
          "CHEMBL1097593",
          "CHEMBL1097594",
          "CHEMBL1097595",
          "CHEMBL1097596",
          "CHEMBL1098906",
          "CHEMBL1098907",
          "CHEMBL1098908",
          "CHEMBL1098909",
          "CHEMBL1098910",
          "CHEMBL1098915",
          "CHEMBL1098916",
          "CHEMBL1099247",
          "CHEMBL1099248",
          "CHEMBL1099253",
          "CHEMBL1099254",
          "CHEMBL1160959",
          "CHEMBL117394",
          "CHEMBL1235787",
          "CHEMBL1275682",
          "CHEMBL1275683",
          "CHEMBL1275684",
          "CHEMBL1277438",
          "CHEMBL1277530",
          "CHEMBL1277531",
          "CHEMBL1277622",
          "CHEMBL1277623",
          "CHEMBL1277717",
          "CHEMBL1277718",
          "CHEMBL1277810",
          "CHEMBL1277811",
          "CHEMBL1277893",
          "CHEMBL140459",
          "CHEMBL140779",
          "CHEMBL140846",
          "CHEMBL142010",
          "CHEMBL143589",
          "CHEMBL151999",
          "CHEMBL153037",
          "CHEMBL153096",
          "CHEMBL1668623",
          "CHEMBL1668624",
          "CHEMBL1668626",
          "CHEMBL1668630",
          "CHEMBL1683506",
          "CHEMBL1782869",
          "CHEMBL1782881",
          "CHEMBL1782882",
          "CHEMBL1782883",
          "CHEMBL1782884",
          "CHEMBL1782885",
          "CHEMBL1782886",
          "CHEMBL1782887",
          "CHEMBL1782888",
          "CHEMBL1782889",
          "CHEMBL1782890",
          "CHEMBL1782891",
          "CHEMBL1782892",
          "CHEMBL1782893",
          "CHEMBL1819333",
          "CHEMBL1819443",
          "CHEMBL1821978",
          "CHEMBL182879",
          "CHEMBL1830651",
          "CHEMBL1852660",
          "CHEMBL2021931",
          "CHEMBL2022225",
          "CHEMBL2022226",
          "CHEMBL2022227",
          "CHEMBL2022228",
          "CHEMBL2022229",
          "CHEMBL2022230",
          "CHEMBL2022231",
          "CHEMBL2022232",
          "CHEMBL2022233",
          "CHEMBL2022234",
          "CHEMBL2022235",
          "CHEMBL2022236",
          "CHEMBL2022237",
          "CHEMBL2022238",
          "CHEMBL2022239",
          "CHEMBL2024266",
          "CHEMBL2024267",
          "CHEMBL2024268",
          "CHEMBL2024269",
          "CHEMBL2024270",
          "CHEMBL2024271",
          "CHEMBL2029394",
          "CHEMBL2029395",
          "CHEMBL2029396",
          "CHEMBL2029397",
          "CHEMBL2029399",
          "CHEMBL2036146",
          "CHEMBL2036147",
          "CHEMBL2036148",
          "CHEMBL2036152",
          "CHEMBL2153736",
          "CHEMBL2179975",
          "CHEMBL2204943",
          "CHEMBL2204945",
          "CHEMBL2204947",
          "CHEMBL2204949",
          "CHEMBL2204950",
          "CHEMBL2204951",
          "CHEMBL2204952",
          "CHEMBL2204953",
          "CHEMBL2204954",
          "CHEMBL2204959",
          "CHEMBL226861",
          "CHEMBL226862",
          "CHEMBL226863",
          "CHEMBL226864",
          "CHEMBL226911",
          "CHEMBL226912",
          "CHEMBL227283",
          "CHEMBL227289",
          "CHEMBL227290",
          "CHEMBL227340",
          "CHEMBL227341",
          "CHEMBL227343",
          "CHEMBL227345",
          "CHEMBL227347",
          "CHEMBL2332518",
          "CHEMBL2332519",
          "CHEMBL2332524",
          "CHEMBL2332525",
          "CHEMBL2332526",
          "CHEMBL2332527",
          "CHEMBL246122",
          "CHEMBL248592",
          "CHEMBL258452",
          "CHEMBL258480",
          "CHEMBL258494",
          "CHEMBL258642",
          "CHEMBL259019",
          "CHEMBL25915",
          "CHEMBL259382",
          "CHEMBL26032",
          "CHEMBL260622",
          "CHEMBL261120",
          "CHEMBL261417",
          "CHEMBL261422",
          "CHEMBL261731",
          "CHEMBL26376",
          "CHEMBL26382",
          "CHEMBL26989",
          "CHEMBL27040",
          "CHEMBL273851",
          "CHEMBL27519",
          "CHEMBL27656",
          "CHEMBL27824",
          "CHEMBL28124",
          "CHEMBL281321",
          "CHEMBL282364",
          "CHEMBL283227",
          "CHEMBL283880",
          "CHEMBL28650",
          "CHEMBL288458",
          "CHEMBL29292",
          "CHEMBL309130",
          "CHEMBL313952",
          "CHEMBL31962",
          "CHEMBL328470",
          "CHEMBL35092",
          "CHEMBL355434",
          "CHEMBL35627",
          "CHEMBL36081",
          "CHEMBL37281",
          "CHEMBL375268",
          "CHEMBL37572",
          "CHEMBL377198",
          "CHEMBL387949",
          "CHEMBL388096",
          "CHEMBL389936",
          "CHEMBL390151",
          "CHEMBL390323",
          "CHEMBL390324",
          "CHEMBL403717",
          "CHEMBL408132",
          "CHEMBL408871",
          "CHEMBL414393",
          "CHEMBL420321",
          "CHEMBL424612",
          "CHEMBL427940",
          "CHEMBL428457",
          "CHEMBL430903",
          "CHEMBL447726",
          "CHEMBL448184",
          "CHEMBL448717",
          "CHEMBL448920",
          "CHEMBL449526",
          "CHEMBL450452",
          "CHEMBL461004",
          "CHEMBL469483",
          "CHEMBL469484",
          "CHEMBL470072",
          "CHEMBL470415",
          "CHEMBL472727",
          "CHEMBL472905",
          "CHEMBL472906",
          "CHEMBL473521",
          "CHEMBL473522",
          "CHEMBL473523",
          "CHEMBL473524",
          "CHEMBL473731",
          "CHEMBL474325",
          "CHEMBL474326",
          "CHEMBL475343",
          "CHEMBL475344",
          "CHEMBL487435",
          "CHEMBL488627",
          "CHEMBL488992",
          "CHEMBL492461",
          "CHEMBL492462",
          "CHEMBL494522",
          "CHEMBL494523",
          "CHEMBL494524",
          "CHEMBL494805",
          "CHEMBL494919",
          "CHEMBL494920",
          "CHEMBL494975",
          "CHEMBL494976",
          "CHEMBL495109",
          "CHEMBL495234",
          "CHEMBL499539",
          "CHEMBL499779",
          "CHEMBL499984",
          "CHEMBL501326",
          "CHEMBL501693",
          "CHEMBL501757",
          "CHEMBL502913",
          "CHEMBL504736",
          "CHEMBL505141",
          "CHEMBL505724",
          "CHEMBL508517",
          "CHEMBL510287",
          "CHEMBL514308",
          "CHEMBL514309",
          "CHEMBL516042",
          "CHEMBL521693",
          "CHEMBL521853",
          "CHEMBL522494",
          "CHEMBL523218",
          "CHEMBL523223",
          "CHEMBL523828",
          "CHEMBL523871",
          "CHEMBL525225",
          "CHEMBL526329",
          "CHEMBL535180",
          "CHEMBL539611",
          "CHEMBL85320",
          "CHEMBL88474",
          "CHEMBL88953",
          "CHEMBL89318",
          "CHEMBL90430",
          "CHEMBL90558",
          "CHEMBL91474"
        ],
        "number_of_missing_values": "0"
      },
      {
        "data_type": "numeric",
        "index": "1",
        "is_ignore": "false",
        "is_row_identifier": "false",
        "is_target": "false",
        "name": "Me",
        "number_of_missing_values": "0"
      },
      {
        "data_type": "numeric",
        "index": "2",
        "is_ignore": "false",
        "is_row_identifier": "false",
        "is_target": "false",
        "name": "H.",
        "number_of_missing_values": "0"
      },
      {
        "data_type": "numeric",
        "index": "3",
        "is_ignore": "false",
        "is_row_identifier": "false",
        "is_target": "false",
        "name": "O.",
        "number_of_missing_values": "0"
      },
      {
        "data_type": "numeric",
        "index": "4",
        "is_ignore": "false",
        "is_row_identifier": "false",
        "is_target": "false",
        "name": "AMW",
        "number_of_missing_values": "0"
      },
      {
        "data_type": "numeric",
        "index": "5",
        "is_ignore": "false",
        "is_row_identifier": "false",
        "is_target": "false",
        "name": "C.",
        "number_of_missing_values": "0"
      },
      {
        "data_type": "numeric",
        "index": "6",
        "is_ignore": "false",
        "is_row_identifier": "false",
        "is_target": "false",
        "name": "Mi",
        "number_of_missing_values": "0"
      },
      {
        "data_type": "numeric",
        "index": "7",
        "is_ignore": "false",
        "is_row_identifier": "false",
        "is_target": "false",
        "name": "Mp",
        "number_of_missing_values": "0"
      },
      {
        "data_type": "numeric",
        "index": "8",
        "is_ignore": "false",
        "is_row_identifier": "false",
        "is_target": "false",
        "name": "Mv",
        "number_of_missing_values": "0"
      },
      {
        "data_type": "numeric",
        "index": "9",
        "is_ignore": "false",
        "is_row_identifier": "false",
        "is_target": "false",
        "name": "MW",
        "number_of_missing_values": "0"
      },
      {
        "data_type": "numeric",
        "index": "10",
        "is_ignore": "false",
        "is_row_identifier": "false",
        "is_target": "false",
        "name": "N.",
        "number_of_missing_values": "0"
      },
      {
        "data_type": "numeric",
        "index": "11",
        "is_ignore": "false",
        "is_row_identifier": "false",
        "is_target": "false",
        "name": "nAB",
        "number_of_missing_values": "0"
      },
      {
        "data_type": "numeric",
        "index": "12",
        "is_ignore": "false",
        "is_row_identifier": "false",
        "is_target": "true",
        "name": "pXC50",
        "number_of_missing_values": "0"
      }
    ]
  }
}