{
  "data_set_description": {
    "collection_date": "November 2013",
    "creator": "Dr Jeremy Besnard, Dr Ivan Olier, Dr Noureddin Sadawi, Dr Larisa Soldatova, Dr Crina Grosan, Prof Ross King, Dr Richard Bickerton, Prof Andrew Hopkins and Dr Willem van Hoorn",
    "default_target_attribute": "pXC50",
    "description": "This dataset contains QSAR data (from ChEMBL version 17) showing activity values (unit is pseudo-pCI50) of several compounds on drug target ChEMBL_ID: CHEMBL4265 (TID: 18010), and it has 15 rows and 43 features (not including molecule IDs and class feature: molecule_id and pXC50). The features represent Basic Molecular Descriptors which were generated from SMILES strings.  Missing value imputation was applied to this dataset (By choosing the Median).",
    "description_version": "1",
    "file_id": "3598961",
    "format": "ARFF",
    "id": "36870",
    "licence": "Public",
    "md5_checksum": "b97368e82eb89df50e27d7573fd23738",
    "minio_url": "https://data.openml.org/datasets/0003/36870/dataset_36870.pq",
    "name": "QSAR-DATASET-FOR-DRUG-TARGET-CHEMBL4265",
    "original_data_url": "https://www.ebi.ac.uk/chembl/target/inspect/CHEMBL4265",
    "parquet_url": "https://data.openml.org/datasets/0003/36870/dataset_36870.pq",
    "processing_date": "2018-10-04 05:05:48",
    "row_id_attribute": "molecule_id",
    "status": "deactivated",
    "tag": [
      "MetaQSAR",
      "study_13"
    ],
    "upload_date": "2016-07-15T22:42:43",
    "url": "https://api.openml.org/data/v1/download/3598961/QSAR-DATASET-FOR-DRUG-TARGET-CHEMBL4265.arff",
    "version": "10",
    "visibility": "public"
  }
}