"molecule_id","N.","AMW","pXC50"
{1 4.5,2 6.782,3 5.71}
{0 CHEMBL594193,1 5.3,2 6.536,3 5.12}
{0 CHEMBL595116,1 2.9,2 7.394,3 5.545}
{0 CHEMBL595791,1 4.8,2 7.057,3 5.49}
{0 CHEMBL595797,1 2.9,2 6.921,3 5.125}
{0 CHEMBL596237,1 6.1,2 7.04,3 7}
{0 CHEMBL596256,1 5.3,2 7.115,3 6.63}
{0 CHEMBL596257,1 3.2,2 7.138,3 7.1}
{0 CHEMBL596443,1 3.2,2 7.656,3 7.38}
{0 CHEMBL608417,1 4.9,2 6.936,3 5.215}
{0 CHEMBL608418,1 5.6,2 6.843,3 4.64}
{0 CHEMBL608710,1 4.9,2 6.936,3 7.47}
{0 CHEMBL610170,1 5.1,2 7.24,3 6.78}
{0 CHEMBL611364,1 5.7,2 6.695,3 4.815}
{0 CHEMBL611365,1 6.3,2 6.884,3 6.89}
