{
  "data_features": {
    "feature": [
      {
        "data_type": "nominal",
        "index": "0",
        "is_ignore": "false",
        "is_row_identifier": "true",
        "is_target": "false",
        "name": "molecule_id",
        "nominal_value": [
          "CHEMBL1299899",
          "CHEMBL1301360",
          "CHEMBL1301532",
          "CHEMBL1307293",
          "CHEMBL1320538",
          "CHEMBL1328085",
          "CHEMBL1333500",
          "CHEMBL1339034",
          "CHEMBL1342681",
          "CHEMBL1343842",
          "CHEMBL1347980",
          "CHEMBL1349120",
          "CHEMBL1352927",
          "CHEMBL1359982",
          "CHEMBL1361960",
          "CHEMBL1363884",
          "CHEMBL1364577",
          "CHEMBL1374929",
          "CHEMBL1377800",
          "CHEMBL1379867",
          "CHEMBL1382947",
          "CHEMBL1385175",
          "CHEMBL1385582",
          "CHEMBL1391307",
          "CHEMBL1393138",
          "CHEMBL1393269",
          "CHEMBL1393558",
          "CHEMBL1399691",
          "CHEMBL1400759",
          "CHEMBL1403552",
          "CHEMBL1410652",
          "CHEMBL1411189",
          "CHEMBL1415356",
          "CHEMBL1415628",
          "CHEMBL1416638",
          "CHEMBL1416797",
          "CHEMBL1417737",
          "CHEMBL1420376",
          "CHEMBL1420807",
          "CHEMBL1425472",
          "CHEMBL1425498",
          "CHEMBL1437453",
          "CHEMBL1438044",
          "CHEMBL1439562",
          "CHEMBL1445947",
          "CHEMBL1447378",
          "CHEMBL1450873",
          "CHEMBL1455859",
          "CHEMBL1460961",
          "CHEMBL1463327",
          "CHEMBL1467170",
          "CHEMBL1468113",
          "CHEMBL1469363",
          "CHEMBL1470739",
          "CHEMBL1471621",
          "CHEMBL1476843",
          "CHEMBL1478358",
          "CHEMBL1480176",
          "CHEMBL1481461",
          "CHEMBL1483025",
          "CHEMBL1483372",
          "CHEMBL1488166",
          "CHEMBL1488416",
          "CHEMBL1488463",
          "CHEMBL1495117",
          "CHEMBL1502024",
          "CHEMBL1504011",
          "CHEMBL1504048",
          "CHEMBL1505070",
          "CHEMBL1505782",
          "CHEMBL1508041",
          "CHEMBL1508132",
          "CHEMBL1509918",
          "CHEMBL1513224",
          "CHEMBL1516647",
          "CHEMBL1517640",
          "CHEMBL1521505",
          "CHEMBL1521983",
          "CHEMBL1523416",
          "CHEMBL1524461",
          "CHEMBL1528266",
          "CHEMBL1528926",
          "CHEMBL1530382",
          "CHEMBL1530636",
          "CHEMBL1538560",
          "CHEMBL1542489",
          "CHEMBL1545351",
          "CHEMBL1545747",
          "CHEMBL1545790",
          "CHEMBL1546207",
          "CHEMBL1546811",
          "CHEMBL1548712",
          "CHEMBL1548869",
          "CHEMBL1553362",
          "CHEMBL1555057",
          "CHEMBL1556594",
          "CHEMBL1556849",
          "CHEMBL1572520",
          "CHEMBL1578252",
          "CHEMBL1578372",
          "CHEMBL1578504",
          "CHEMBL1581004",
          "CHEMBL1583691",
          "CHEMBL1584651",
          "CHEMBL1586107",
          "CHEMBL1586752",
          "CHEMBL1587221",
          "CHEMBL1587736",
          "CHEMBL1588585",
          "CHEMBL1601762",
          "CHEMBL1602063",
          "CHEMBL1602399",
          "CHEMBL1606301",
          "CHEMBL1606901",
          "CHEMBL1607138",
          "CHEMBL1608302",
          "CHEMBL1613601",
          "CHEMBL1983083",
          "CHEMBL2004942",
          "CHEMBL591148"
        ],
        "number_of_missing_values": "0"
      },
      {
        "data_type": "numeric",
        "index": "1",
        "is_ignore": "false",
        "is_row_identifier": "false",
        "is_target": "false",
        "name": "AMW",
        "number_of_missing_values": "0"
      },
      {
        "data_type": "numeric",
        "index": "2",
        "is_ignore": "false",
        "is_row_identifier": "false",
        "is_target": "false",
        "name": "C.",
        "number_of_missing_values": "0"
      },
      {
        "data_type": "numeric",
        "index": "3",
        "is_ignore": "false",
        "is_row_identifier": "false",
        "is_target": "true",
        "name": "pXC50",
        "number_of_missing_values": "0"
      }
    ]
  }
}