{
  "data_set_description": {
    "collection_date": "November 2013",
    "creator": "Dr Jeremy Besnard, Dr Ivan Olier, Dr Noureddin Sadawi, Dr Larisa Soldatova, Dr Crina Grosan, Prof Ross King, Dr Richard Bickerton, Prof Andrew Hopkins and Dr Willem van Hoorn",
    "default_target_attribute": "pXC50",
    "description": "This dataset contains QSAR data (from ChEMBL version 17) showing activity values (unit is pseudo-pCI50) of several compounds on drug target ChEMBL_ID: CHEMBL2373 (TID: 12679), and it has 337 rows and 1308 features (not including molecule IDs and class feature: molecule_id and pXC50). The features represent Molecular Descriptors which were generated from SMILES strings. Missing value imputation was applied to this dataset (By choosing the Median).",
    "description_version": "1",
    "file_id": "3594809",
    "format": "ARFF",
    "id": "36712",
    "licence": "Public",
    "md5_checksum": "6f9341ed33769f46420cea29ef0561ec",
    "minio_url": "https://data.openml.org/datasets/0003/36712/dataset_36712.pq",
    "name": "QSAR-DATASET-FOR-DRUG-TARGET-CHEMBL2373",
    "original_data_url": "https://www.ebi.ac.uk/chembl/target/inspect/CHEMBL2373",
    "parquet_url": "https://data.openml.org/datasets/0003/36712/dataset_36712.pq",
    "processing_date": "2018-10-04 05:00:06",
    "row_id_attribute": "molecule_id",
    "status": "deactivated",
    "tag": [
      "MetaQSAR",
      "study_13"
    ],
    "upload_date": "2016-07-15T22:09:42",
    "url": "https://api.openml.org/data/v1/download/3594809/QSAR-DATASET-FOR-DRUG-TARGET-CHEMBL2373.arff",
    "version": "10",
    "visibility": "public"
  }
}