"molecule_id","FCFP4_1024b1","FCFP4_1024b10","FCFP4_1024b100","FCFP4_1024b1000","FCFP4_1024b1001","FCFP4_1024b1002","FCFP4_1024b1003","FCFP4_1024b1004","FCFP4_1024b1005","FCFP4_1024b1006","FCFP4_1024b1007","FCFP4_1024b1008","FCFP4_1024b1009","FCFP4_1024b101","FCFP4_1024b1010","FCFP4_1024b1011","FCFP4_1024b1012","FCFP4_1024b1013","FCFP4_1024b1014","FCFP4_1024b1015","FCFP4_1024b1016","FCFP4_1024b1017","FCFP4_1024b1018","FCFP4_1024b1019","FCFP4_1024b102","FCFP4_1024b1020","FCFP4_1024b1021","FCFP4_1024b1022","FCFP4_1024b1023","FCFP4_1024b1024","FCFP4_1024b103","FCFP4_1024b104","FCFP4_1024b105","FCFP4_1024b106","FCFP4_1024b107","FCFP4_1024b108","FCFP4_1024b109","FCFP4_1024b11","FCFP4_1024b110","FCFP4_1024b111","FCFP4_1024b112","FCFP4_1024b113","FCFP4_1024b114","FCFP4_1024b115","FCFP4_1024b116","FCFP4_1024b117","FCFP4_1024b118","FCFP4_1024b119","FCFP4_1024b12","FCFP4_1024b120","FCFP4_1024b121","pXC50"
{1 1,35 1,52 5}
{0 CHEMBL190022,1 1,52 5.208}
{0 CHEMBL192921,1 1,52 4.77}
{0 CHEMBL193212,1 1,35 1,52 5.092}
{0 CHEMBL193220,1 1,44 1,52 6.602}
{0 CHEMBL2086466,1 1,2 1,6 1,18 1,35 1,52 4.097}
{0 CHEMBL2086473,1 1,2 1,18 1,35 1,52 4.602}
{0 CHEMBL2086479,1 1,2 1,6 1,18 1,35 1,52 5.387}
{0 CHEMBL2086480,1 1,2 1,6 1,18 1,35 1,52 5.252}
{0 CHEMBL2086482,1 1,2 1,6 1,18 1,35 1,52 4.097}
{0 CHEMBL2086483,1 1,2 1,6 1,18 1,35 1,52 4.097}
{0 CHEMBL2086484,1 1,2 1,6 1,18 1,35 1,52 4.097}
{0 CHEMBL2086485,1 1,2 1,6 1,18 1,35 1,52 4.097}
{0 CHEMBL2086486,1 1,2 1,6 1,18 1,35 1,52 4.097}
{0 CHEMBL2086489,1 1,2 1,6 1,18 1,35 1,52 5.056}
{0 CHEMBL2086496,1 1,2 1,6 1,18 1,52 4.097}
{0 CHEMBL2086498,1 1,2 1,6 1,18 1,52 5.051}
{0 CHEMBL2086499,1 1,2 1,6 1,18 1,52 5.194}
{0 CHEMBL2086501,1 1,2 1,6 1,18 1,35 1,52 4.854}
{0 CHEMBL2086502,1 1,2 1,6 1,18 1,35 1,52 4.699}
{0 CHEMBL2086503,1 1,2 1,6 1,18 1,35 1,52 4.721}
{0 CHEMBL2086504,1 1,2 1,6 1,18 1,35 1,52 5.187}
{0 CHEMBL2086505,1 1,2 1,6 1,18 1,35 1,49 1,52 5.854}
{0 CHEMBL2086506,1 1,2 1,6 1,18 1,35 1,52 5.174}
{0 CHEMBL2086507,1 1,2 1,6 1,18 1,35 1,52 5.387}
{0 CHEMBL2086508,1 1,2 1,6 1,18 1,35 1,52 5.009}
{0 CHEMBL2086509,1 1,2 1,6 1,18 1,35 1,52 5.215}
{0 CHEMBL2086510,1 1,2 1,6 1,18 1,35 1,49 1,52 5.081}
{0 CHEMBL2086511,1 1,2 1,6 1,18 1,35 1,52 5}
{0 CHEMBL2086512,1 1,2 1,6 1,18 1,35 1,52 5.292}
{0 CHEMBL2086513,1 1,2 1,6 1,18 1,35 1,52 5.167}
{0 CHEMBL2086514,1 1,2 1,6 1,18 1,35 1,52 4.119}
{0 CHEMBL2086515,1 1,2 1,6 1,18 1,35 1,52 4.921}
{0 CHEMBL2086516,1 1,2 1,6 1,18 1,35 1,52 5.114}
{0 CHEMBL2086517,1 1,2 1,6 1,18 1,35 1,52 5.161}
{0 CHEMBL2086518,1 1,2 1,6 1,18 1,35 1,52 5.301}
{0 CHEMBL2086519,1 1,2 1,6 1,18 1,35 1,52 5.602}
{0 CHEMBL2086520,1 1,2 1,6 1,18 1,35 1,52 5}
{0 CHEMBL2086521,1 1,2 1,6 1,18 1,35 1,52 5.509}
{0 CHEMBL2086522,1 1,2 1,6 1,18 1,35 1,52 5.222}
{0 CHEMBL2086523,1 1,2 1,6 1,10 1,18 1,35 1,52 5.143}
{0 CHEMBL2086524,1 1,2 1,6 1,18 1,35 1,52 5.585}
{0 CHEMBL2086525,1 1,2 1,6 1,18 1,35 1,52 5.387}
{0 CHEMBL2086526,1 1,2 1,6 1,18 1,35 1,52 5.268}
{0 CHEMBL2086527,1 1,2 1,6 1,18 1,35 1,52 5.268}
{0 CHEMBL2086528,1 1,2 1,6 1,18 1,35 1,52 5.469}
{0 CHEMBL2086529,1 1,2 1,18 1,35 1,52 5.347}
{0 CHEMBL2086530,1 1,2 1,18 1,35 1,52 5.77}
{0 CHEMBL2086531,1 1,2 1,18 1,35 1,52 5.377}
{0 CHEMBL2086532,1 1,2 1,18 1,35 1,49 1,52 5.229}
{0 CHEMBL2086533,1 1,2 1,18 1,35 1,49 1,52 4.745}
{0 CHEMBL2086534,1 1,2 1,18 1,35 1,52 5.215}
{0 CHEMBL2086535,1 1,2 1,18 1,35 1,49 1,52 4.244}
{0 CHEMBL2086536,1 1,2 1,18 1,35 1,52 4.824}
{0 CHEMBL2086537,1 1,2 1,18 1,35 1,52 4.658}
{0 CHEMBL2086538,1 1,2 1,6 1,18 1,35 1,52 5.42}
{0 CHEMBL2086539,1 1,2 1,6 1,18 1,35 1,52 5.194}
{0 CHEMBL2086540,1 1,2 1,6 1,18 1,35 1,52 5.469}
{0 CHEMBL2086541,1 1,2 1,6 1,18 1,35 1,52 5.252}
{0 CHEMBL2086542,1 1,2 1,6 1,18 1,35 1,52 5.745}
{0 CHEMBL2086543,1 1,2 1,6 1,18 1,35 1,52 5.292}
{0 CHEMBL2086544,1 1,2 1,6 1,18 1,35 1,52 5.523}
{0 CHEMBL2086887,1 1,2 1,6 1,36 1,52 4.097}
{0 CHEMBL2086888,1 1,23 1,52 4.959}
{0 CHEMBL2086889,1 1,7 1,52 7.745}
{0 CHEMBL2086890,1 1,2 1,6 1,18 1,35 1,52 5.62}
{0 CHEMBL2086891,1 1,2 1,6 1,18 1,35 1,52 6.022}
{0 CHEMBL2089385,1 1,52 4.347}
{0 CHEMBL2089386,1 1,2 1,6 1,18 1,35 1,52 5.31}
{0 CHEMBL2089387,1 1,2 1,18 1,35 1,52 4.347}
{0 CHEMBL2089388,1 1,2 1,6 1,18 1,35 1,52 5.432}
{0 CHEMBL2089389,1 1,35 1,52 5.444}
{0 CHEMBL2089390,1 1,2 1,18 1,35 1,52 4.854}
{0 CHEMBL2089391,1 1,35 1,52 5.538}
{0 CHEMBL2089392,1 1,2 1,18 1,35 1,52 4.854}
{0 CHEMBL2089393,1 1,2 1,18 1,26 1,35 1,52 5.022}
{0 CHEMBL2089394,1 1,2 1,6 1,35 1,52 5.092}
{0 CHEMBL2089395,1 1,2 1,35 1,52 4.854}
{0 CHEMBL2089396,1 1,2 1,18 1,35 1,52 5.538}
{0 CHEMBL2089397,1 1,10 1,35 1,52 5.745}
{0 CHEMBL2089398,1 1,2 1,18 1,35 1,52 5.337}
{0 CHEMBL2089399,1 1,35 1,52 5.569}
{0 CHEMBL2089400,1 1,2 1,6 1,18 1,35 1,52 5.337}
{0 CHEMBL2152090,1 1,2 1,18 1,25 1,35 1,52 6.041}
{0 CHEMBL2152204,1 1,2 1,18 1,52 5.921}
{0 CHEMBL2203451,1 1,52 4.824}
{0 CHEMBL2203467,1 1,52 5.032}
{0 CHEMBL2203469,1 1,52 4.889}
{0 CHEMBL2203476,1 1,52 4.097}
{0 CHEMBL440383,1 1,52 4.495}
