{
  "data_features": {
    "feature": [
      {
        "data_type": "nominal",
        "index": "0",
        "is_ignore": "false",
        "is_row_identifier": "true",
        "is_target": "false",
        "name": "molecule_id",
        "nominal_value": [
          "CHEMBL122848",
          "CHEMBL123181",
          "CHEMBL123594",
          "CHEMBL123595",
          "CHEMBL124220",
          "CHEMBL196418",
          "CHEMBL196776",
          "CHEMBL199436",
          "CHEMBL199516",
          "CHEMBL199542",
          "CHEMBL199776",
          "CHEMBL199810",
          "CHEMBL199976",
          "CHEMBL200101",
          "CHEMBL200281",
          "CHEMBL200363",
          "CHEMBL200655",
          "CHEMBL200803",
          "CHEMBL200852",
          "CHEMBL201711",
          "CHEMBL203309",
          "CHEMBL249805",
          "CHEMBL250429",
          "CHEMBL250431",
          "CHEMBL250630",
          "CHEMBL250819",
          "CHEMBL250824",
          "CHEMBL331347",
          "CHEMBL332364",
          "CHEMBL333571",
          "CHEMBL333742",
          "CHEMBL372341",
          "CHEMBL381463",
          "CHEMBL381559",
          "CHEMBL381684",
          "CHEMBL382200",
          "CHEMBL382958",
          "CHEMBL383600",
          "CHEMBL383601",
          "CHEMBL399043",
          "CHEMBL399477",
          "CHEMBL445555",
          "CHEMBL451059",
          "CHEMBL454282",
          "CHEMBL455414",
          "CHEMBL460104",
          "CHEMBL462205",
          "CHEMBL462374",
          "CHEMBL462375",
          "CHEMBL462376",
          "CHEMBL462553",
          "CHEMBL491752",
          "CHEMBL501551",
          "CHEMBL509952",
          "CHEMBL512926"
        ],
        "number_of_missing_values": "0"
      },
      {
        "data_type": "numeric",
        "index": "1",
        "is_ignore": "false",
        "is_row_identifier": "false",
        "is_target": "false",
        "name": "O.",
        "number_of_missing_values": "0"
      },
      {
        "data_type": "numeric",
        "index": "2",
        "is_ignore": "false",
        "is_row_identifier": "false",
        "is_target": "false",
        "name": "H.",
        "number_of_missing_values": "0"
      },
      {
        "data_type": "numeric",
        "index": "3",
        "is_ignore": "false",
        "is_row_identifier": "false",
        "is_target": "false",
        "name": "nO",
        "number_of_missing_values": "0"
      },
      {
        "data_type": "numeric",
        "index": "4",
        "is_ignore": "false",
        "is_row_identifier": "false",
        "is_target": "false",
        "name": "nCsp3",
        "number_of_missing_values": "0"
      },
      {
        "data_type": "numeric",
        "index": "5",
        "is_ignore": "false",
        "is_row_identifier": "false",
        "is_target": "false",
        "name": "nBM",
        "number_of_missing_values": "0"
      },
      {
        "data_type": "numeric",
        "index": "6",
        "is_ignore": "false",
        "is_row_identifier": "false",
        "is_target": "false",
        "name": "nAB",
        "number_of_missing_values": "0"
      },
      {
        "data_type": "numeric",
        "index": "7",
        "is_ignore": "false",
        "is_row_identifier": "false",
        "is_target": "false",
        "name": "nCsp2",
        "number_of_missing_values": "0"
      },
      {
        "data_type": "numeric",
        "index": "8",
        "is_ignore": "false",
        "is_row_identifier": "false",
        "is_target": "false",
        "name": "Mv",
        "number_of_missing_values": "0"
      },
      {
        "data_type": "numeric",
        "index": "9",
        "is_ignore": "false",
        "is_row_identifier": "false",
        "is_target": "false",
        "name": "nHet",
        "number_of_missing_values": "0"
      },
      {
        "data_type": "numeric",
        "index": "10",
        "is_ignore": "false",
        "is_row_identifier": "false",
        "is_target": "true",
        "name": "pXC50",
        "number_of_missing_values": "0"
      }
    ]
  }
}