"molecule_id","AMW","C.","H.","Me","Mi","Mp","Mv","MW","N.","nAB","nAT","nB","nBM","nBO","nBR","nBT","nC","nCL","nCsp","nCsp2","nCsp3","nDB","nF","nH","nHet","nHM","nI","nN","nO","nP","nS","nSK","nTB","nX","O.","RBF","RBN","SCBO","Se","Si","Sp","Sv","X.","pXC50"
{1 7.863,2 31.7,3 43.9,4 1.03,5 1.154,6 0.62,7 0.613,8 322.37,9 14.6,10 10,11 41,13 11,14 25,16 43,17 13,20 6,21 7,22 1,24 18,25 10,28 6,29 4,32 23,35 9.8,36 0.093,37 4,38 31,39 42.222,40 47.319,41 25.421,42 25.148,44 7.509}
{0 CHEMBL129903,1 8.084,2 30,3 42.5,4 1.036,5 1.16,6 0.617,7 0.616,8 323.36,9 17.5,10 10,11 40,13 11,14 25,16 42,17 12,20 6,21 6,22 1,24 17,25 11,28 7,29 4,32 23,35 10,36 0.095,37 4,38 31,39 41.44,40 46.402,41 24.665,42 24.643,44 6.777}
{0 CHEMBL1791423,1 8.568,2 35.3,3 38.2,4 1.04,5 1.147,6 0.644,7 0.649,8 291.3,9 14.7,10 10,11 34,13 11,14 23,16 36,17 12,19 2,20 5,21 5,24 13,25 9,28 5,29 4,32 21,33 1,35 11.8,36 0.056,37 2,38 30,39 35.353,40 38.99,41 21.892,42 22.073,44 7.699}
{0 CHEMBL2070507,1 7.961,2 33.3,3 42.9,4 1.029,5 1.15,6 0.629,7 0.623,8 334.38,9 14.3,10 10,11 42,13 11,14 27,16 45,17 14,20 6,21 8,22 1,24 18,25 10,28 6,29 4,32 24,35 9.5,36 0.067,37 3,38 33,39 43.222,40 48.319,41 26.421,42 26.148,44 7.056}
{0 CHEMBL2070508,1 7.742,2 33.3,3 44.4,4 1.025,5 1.15,6 0.626,7 0.615,8 348.41,9 13.3,10 10,11 45,13 11,14 28,16 48,17 15,20 6,21 9,22 1,24 20,25 10,28 6,29 4,32 25,35 8.9,36 0.063,37 3,38 34,39 46.105,40 51.734,41 28.182,42 27.675,44 7.31}
{0 CHEMBL2092773,1 7.382,2 33.3,3 47.1,4 1.017,5 1.148,6 0.622,7 0.603,8 376.47,9 11.8,10 10,11 51,13 11,14 30,16 54,17 17,20 6,21 11,22 1,24 24,25 10,28 6,29 4,32 27,35 7.8,36 0.056,37 3,38 36,39 51.872,40 58.564,41 31.705,42 30.729,44 7.255}
{0 CHEMBL2092859,1 7.382,2 33.3,3 47.1,4 1.017,5 1.148,6 0.622,7 0.603,8 376.47,9 11.8,10 10,11 51,13 11,14 30,16 54,17 17,20 6,21 11,22 1,24 24,25 10,28 6,29 4,32 27,35 7.8,36 0.056,37 3,38 36,39 51.872,40 58.564,41 31.705,42 30.729,44 7.889}
{0 CHEMBL2113434,1 8.62,2 30.6,3 38.9,4 1.049,5 1.158,6 0.621,7 0.634,8 310.31,9 16.7,10 10,11 36,13 11,14 24,16 38,17 11,20 6,21 5,22 1,24 14,25 11,28 6,29 5,32 22,35 13.9,36 0.079,37 3,38 30,39 37.782,40 41.698,41 22.352,42 22.81,44 7.237}
{0 CHEMBL2113436,1 7.645,2 31.8,3 45.5,4 1.025,5 1.153,6 0.618,7 0.606,8 336.4,9 13.6,10 10,11 44,13 11,14 26,16 46,17 14,20 6,21 8,22 1,24 20,25 10,28 6,29 4,32 24,35 9.1,36 0.065,37 3,38 32,39 45.105,40 50.734,41 27.182,42 26.675,44 5.164}
{0 CHEMBL2113489,1 7.551,2 33.3,3 45.8,4 1.021,5 1.149,6 0.624,7 0.608,8 362.44,9 12.5,10 10,11 48,13 11,14 29,16 51,17 16,20 6,21 10,22 1,24 22,25 10,28 6,29 4,32 26,35 8.3,36 0.059,37 3,38 35,39 48.989,40 55.149,41 29.943,42 29.202,44 7.745}
{0 CHEMBL2113492,1 7.456,2 31.9,3 46.8,4 1.021,5 1.152,6 0.616,7 0.6,8 350.43,9 12.8,10 10,11 47,13 11,14 27,16 49,17 15,20 6,21 9,22 1,24 22,25 10,28 6,29 4,32 25,35 8.5,36 0.122,37 6,38 33,39 47.989,40 54.149,41 28.943,42 28.202,44 7.921}
{0 CHEMBL261482,1 8.214,2 33.3,3 41,4 1.034,5 1.151,6 0.632,7 0.631,8 320.35,9 15.4,10 10,11 39,13 11,14 26,16 42,17 13,20 6,21 7,22 1,24 16,25 10,28 6,29 4,32 23,35 10.3,36 0.071,37 3,38 32,39 40.338,40 44.903,41 24.659,42 24.622,44 7.018}
{0 CHEMBL464859,1 8.114,2 31.6,3 42.1,4 1.035,5 1.155,6 0.623,7 0.622,8 308.34,9 15.8,10 10,11 38,13 11,14 24,16 40,17 12,20 6,21 6,22 1,24 16,25 10,28 6,29 4,32 22,35 10.5,36 0.075,37 3,38 30,39 39.338,40 43.903,41 23.659,42 23.622,44 7.501}
{0 CHEMBL519809,1 8.409,2 31.4,3 40,4 1.042,5 1.157,6 0.626,7 0.631,8 294.31,9 17.1,10 10,11 35,13 11,14 23,16 37,17 11,20 6,21 5,22 1,24 14,25 10,28 6,29 4,32 21,35 11.4,36 0.054,37 2,38 29,39 36.454,40 40.488,41 21.898,42 22.095,44 7.292}
{0 CHEMBL605866,1 8.759,2 31.3,3 37.5,4 1.049,5 1.159,6 0.629,7 0.643,8 280.28,9 18.8,10 10,11 32,13 11,14 22,16 34,17 10,20 6,21 4,22 1,24 12,25 10,28 6,29 4,32 20,35 12.5,36 0.059,37 2,38 28,39 33.571,40 37.073,41 20.136,42 20.568,44 7.194}
{0 CHEMBL607717,1 8.231,2 37.8,3 40,4 1.027,5 1.14,6 0.654,7 0.648,8 370.41,9 13.3,10 16,11 45,13 17,14 30,16 48,17 17,20 12,21 5,22 1,24 18,25 10,28 6,29 4,32 27,35 8.9,36 0.083,37 4,38 39,39 46.222,40 51.319,41 29.421,42 29.148,44 7.377}
{0 CHEMBL607719,1 7.289,2 32,3 48,4 1.017,5 1.151,6 0.614,7 0.595,8 364.46,9 12,10 10,11 50,13 11,14 28,16 52,17 16,20 6,21 10,22 1,24 24,25 10,28 6,29 4,32 26,35 8,36 0.135,37 7,38 34,39 50.872,40 57.564,41 30.705,42 29.729,44 7.721}
{0 CHEMBL608000,1 7.402,2 35.7,3 46.4,4 1.014,5 1.142,6 0.633,7 0.612,8 414.52,9 10.7,10 10,11 56,13 11,14 35,16 61,17 20,20 6,21 14,22 1,24 26,25 10,28 6,29 4,32 30,35 7.1,36 0.049,37 3,38 41,39 56.756,40 63.979,41 35.466,42 34.256,44 5.983}
{0 CHEMBL608003,1 8.122,2 35.8,3 41.5,4 1.031,5 1.143,6 0.639,7 0.635,8 430.47,9 11.3,10 16,11 53,13 17,14 34,16 56,17 19,20 12,21 7,22 1,24 22,25 12,28 6,29 6,32 31,35 11.3,36 0.107,37 6,38 43,39 54.643,40 60.568,41 33.852,42 33.632,44 6.854}
{0 CHEMBL608293,1 7.831,2 31.1,3 44.4,4 1.032,5 1.154,6 0.614,7 0.609,8 352.4,9 13.3,10 10,11 45,13 11,14 27,16 47,17 14,20 6,21 8,22 1,24 20,25 11,28 6,29 5,32 25,35 11.1,36 0.106,37 5,38 33,39 46.433,40 51.943,41 27.637,42 27.39,44 7.699}
{0 CHEMBL608296,1 7.009,2 32.1,3 50,4 1.011,5 1.15,6 0.611,7 0.585,8 392.52,9 10.7,10 10,11 56,13 11,14 30,16 58,17 18,20 6,21 12,22 1,24 28,25 10,28 6,29 4,32 28,35 7.1,36 0.155,37 9,38 36,39 56.64,40 64.395,41 34.228,42 32.782,44 7.678}
{0 CHEMBL608587,1 8.316,2 30.8,3 41,4 1.043,5 1.157,6 0.618,7 0.624,8 324.34,9 15.4,10 10,11 39,13 11,14 25,16 41,17 12,20 6,21 6,22 1,24 16,25 11,28 6,29 5,32 23,35 12.8,36 0.098,37 4,38 31,39 40.665,40 45.113,41 24.114,42 24.336,44 7.174}
{0 CHEMBL608591,1 7.382,2 33.3,3 47.1,4 1.017,5 1.148,6 0.622,7 0.603,8 376.47,9 11.8,10 10,11 51,13 11,14 30,16 54,17 17,20 6,21 11,22 1,24 24,25 10,28 6,29 4,32 27,35 7.8,36 0.056,37 3,38 36,39 51.872,40 58.564,41 31.705,42 30.729,44 7.158}
{0 CHEMBL608595,1 8.978,2 30.3,3 36.4,4 1.058,5 1.16,6 0.624,7 0.645,8 296.28,9 18.2,10 10,11 33,13 11,14 23,16 35,17 10,20 6,21 4,22 1,24 12,25 11,28 6,29 5,32 21,35 15.2,36 0.057,37 2,38 29,39 34.898,40 38.282,41 20.591,42 21.283,44 7.387}
{0 CHEMBL608596,1 7.642,2 34.7,3 44.9,4 1.02,5 1.146,6 0.631,7 0.616,8 374.45,9 12.2,10 10,11 49,13 11,14 31,16 53,17 17,20 6,21 11,22 1,24 22,25 10,28 6,29 4,32 27,35 8.2,36 0.057,37 3,38 37,39 49.989,40 56.149,41 30.943,42 30.202,44 6.194}
{0 CHEMBL608888,1 7.141,2 32.1,3 49.1,4 1.014,5 1.151,6 0.613,7 0.59,8 378.49,9 11.3,10 10,11 53,13 11,14 29,16 55,17 17,20 6,21 11,22 1,24 26,25 10,28 6,29 4,32 27,35 7.5,36 0.145,37 8,38 35,39 53.756,40 60.979,41 32.466,42 31.256,44 7.699}
{0 CHEMBL608893,1 7.231,2 33.3,3 48.1,4 1.014,5 1.148,6 0.62,7 0.597,8 390.5,9 11.1,10 10,11 54,13 11,14 31,16 57,17 18,20 6,21 12,22 1,24 26,25 10,28 6,29 4,32 28,35 7.4,36 0.053,37 3,38 37,39 54.756,40 61.979,41 33.466,42 32.256,44 7.638}
{0 CHEMBL608895,1 7.645,2 31.8,3 45.5,4 1.025,5 1.153,6 0.618,7 0.606,8 336.4,9 13.6,10 10,11 44,13 11,14 26,16 46,17 14,20 6,21 8,22 1,24 20,25 10,28 6,29 4,32 24,35 9.1,36 0.087,37 4,38 32,39 45.105,40 50.734,41 27.182,42 26.675,44 6.703}
{0 CHEMBL609179,1 7.556,2 35.8,3 45.3,4 1.016,5 1.143,6 0.636,7 0.618,8 400.49,9 11.3,10 10,11 53,13 11,14 34,16 58,17 19,20 6,21 13,22 1,24 24,25 10,28 6,29 4,32 29,35 7.5,36 0.052,37 3,38 40,39 53.872,40 60.564,41 33.705,42 32.729,44 6.079}
{0 CHEMBL609186,1 7.645,2 31.8,3 45.5,4 1.025,5 1.153,6 0.618,7 0.606,8 336.4,9 13.6,10 10,11 44,13 11,14 26,16 46,17 14,20 6,21 8,22 1,24 20,25 10,28 6,29 4,32 24,35 9.1,36 0.109,37 5,38 32,39 45.105,40 50.734,41 27.182,42 26.675,44 7.77}
{0 CHEMBL609485,1 6.598,2 32.4,3 52.9,4 1.003,5 1.148,6 0.607,7 0.572,8 448.64,9 8.8,10 10,11 68,13 11,14 34,16 70,17 22,20 6,21 16,22 1,24 36,25 10,28 6,29 4,32 32,35 5.9,36 0.186,37 13,38 40,39 68.174,40 78.055,41 41.273,42 38.89,44 6.788}
{0 CHEMBL609487,1 7.136,2 31.7,3 49.2,4 1.015,5 1.151,6 0.61,7 0.588,8 449.58,9 11.1,10 10,11 63,13 12,14 34,16 65,17 20,20 7,21 13,22 2,24 31,25 12,28 7,29 5,32 32,35 7.9,36 0.169,37 11,38 41,39 63.952,40 72.518,41 38.449,42 37.045,44 8}
{0 CHEMBL609768,1 6.686,2 32.3,3 52.3,4 1.004,5 1.148,6 0.608,7 0.575,8 434.61,9 9.2,10 10,11 65,13 11,14 33,16 67,17 21,20 6,21 15,22 1,24 34,25 10,28 6,29 4,32 31,35 6.2,36 0.179,37 12,38 39,39 65.29,40 74.64,41 39.512,42 37.363,44 6.91}
{0 CHEMBL609769,1 6.891,2 32.2,3 50.8,4 1.009,5 1.149,6 0.61,7 0.582,8 406.55,9 10.2,10 10,11 59,13 11,14 31,16 61,17 19,20 6,21 13,22 1,24 30,25 10,28 6,29 4,32 29,35 6.8,36 0.164,37 10,38 37,39 59.523,40 67.81,41 35.989,42 34.309,44 7.509}
{0 CHEMBL609773,1 7.382,2 33.3,3 47.1,4 1.017,5 1.148,6 0.622,7 0.603,8 376.47,9 11.8,10 10,11 51,13 11,14 30,16 54,17 17,20 6,21 11,22 1,24 24,25 10,28 6,29 4,32 27,35 7.8,36 0.056,37 3,38 36,39 51.872,40 58.564,41 31.705,42 30.729,44 7.658}
{0 CHEMBL609774,1 7.402,2 35.7,3 46.4,4 1.014,5 1.142,6 0.633,7 0.612,8 414.52,9 10.7,10 10,11 56,13 11,14 35,16 61,17 20,20 6,21 14,22 1,24 26,25 10,28 6,29 4,32 30,35 7.1,36 0.049,37 3,38 41,39 56.756,40 63.979,41 35.466,42 34.256,44 5.699}
{0 CHEMBL609775,1 8.12,2 31.1,3 42.2,4 1.037,5 1.156,6 0.62,7 0.62,8 365.4,9 15.6,10 10,11 45,13 12,14 28,16 47,17 14,20 7,21 7,22 2,24 19,25 12,28 7,29 5,32 26,35 11.1,36 0.106,37 5,38 35,39 46.651,40 52.026,41 27.881,42 27.885,44 7.337}
{0 CHEMBL609776,1 7.027,2 31,3 50,4 1.013,5 1.153,6 0.607,7 0.583,8 407.54,9 12.1,10 10,11 58,13 11,14 31,16 60,17 18,20 6,21 12,22 1,24 29,25 11,28 7,29 4,32 29,35 6.9,36 0.167,37 10,38 37,39 58.741,40 66.893,41 35.233,42 33.804,44 7.538}
{0 CHEMBL612154,1 6.784,2 32.3,3 51.6,4 1.007,5 1.149,6 0.609,7 0.578,8 420.58,9 9.7,10 10,11 62,13 11,14 32,16 64,17 20,20 6,21 14,22 1,24 32,25 10,28 6,29 4,32 30,35 6.5,36 0.172,37 11,38 38,39 62.407,40 71.225,41 37.75,42 35.836,44 7.569}
