{
  "data_features": {
    "feature": [
      {
        "data_type": "nominal",
        "index": "0",
        "is_ignore": "false",
        "is_row_identifier": "true",
        "is_target": "false",
        "name": "molecule_id",
        "nominal_value": [
          "CHEMBL100005",
          "CHEMBL100120",
          "CHEMBL10016",
          "CHEMBL10019",
          "CHEMBL100756",
          "CHEMBL100795",
          "CHEMBL100874",
          "CHEMBL10092",
          "CHEMBL100954",
          "CHEMBL101069",
          "CHEMBL101239",
          "CHEMBL101292",
          "CHEMBL10136",
          "CHEMBL101424",
          "CHEMBL10143",
          "CHEMBL10151",
          "CHEMBL101587",
          "CHEMBL101742",
          "CHEMBL10211",
          "CHEMBL102173",
          "CHEMBL10218",
          "CHEMBL102307",
          "CHEMBL102314",
          "CHEMBL102348",
          "CHEMBL102405",
          "CHEMBL102411",
          "CHEMBL102494",
          "CHEMBL102773",
          "CHEMBL102797",
          "CHEMBL102825",
          "CHEMBL102868",
          "CHEMBL102969",
          "CHEMBL103001",
          "CHEMBL10302",
          "CHEMBL103090",
          "CHEMBL103190",
          "CHEMBL103201",
          "CHEMBL103308",
          "CHEMBL103362",
          "CHEMBL103484",
          "CHEMBL103497",
          "CHEMBL103501",
          "CHEMBL103572",
          "CHEMBL103573",
          "CHEMBL103605",
          "CHEMBL103631",
          "CHEMBL103695",
          "CHEMBL103731",
          "CHEMBL10374",
          "CHEMBL103846",
          "CHEMBL103872",
          "CHEMBL10388",
          "CHEMBL103886",
          "CHEMBL103969",
          "CHEMBL103975",
          "CHEMBL104172",
          "CHEMBL104223",
          "CHEMBL10457",
          "CHEMBL104848",
          "CHEMBL10523",
          "CHEMBL105490",
          "CHEMBL105494",
          "CHEMBL105591",
          "CHEMBL10588",
          "CHEMBL10589",
          "CHEMBL10607",
          "CHEMBL10622",
          "CHEMBL10635",
          "CHEMBL10636",
          "CHEMBL10644",
          "CHEMBL10648",
          "CHEMBL10661",
          "CHEMBL106684",
          "CHEMBL106749",
          "CHEMBL10676",
          "CHEMBL106846",
          "CHEMBL10697",
          "CHEMBL10699",
          "CHEMBL10733",
          "CHEMBL10744",
          "CHEMBL10750",
          "CHEMBL107574",
          "CHEMBL10781",
          "CHEMBL10794",
          "CHEMBL10801",
          "CHEMBL10808",
          "CHEMBL10819",
          "CHEMBL1082723",
          "CHEMBL10832",
          "CHEMBL10834",
          "CHEMBL10843",
          "CHEMBL10846",
          "CHEMBL10847",
          "CHEMBL10854",
          "CHEMBL10860",
          "CHEMBL10862",
          "CHEMBL10897",
          "CHEMBL10901",
          "CHEMBL10905",
          "CHEMBL10910",
          "CHEMBL10911",
          "CHEMBL10915",
          "CHEMBL10919",
          "CHEMBL10922",
          "CHEMBL10924",
          "CHEMBL10926",
          "CHEMBL10940",
          "CHEMBL10948",
          "CHEMBL10951",
          "CHEMBL109644",
          "CHEMBL109648",
          "CHEMBL109778",
          "CHEMBL109800",
          "CHEMBL109926",
          "CHEMBL10996",
          "CHEMBL110053",
          "CHEMBL11064",
          "CHEMBL11082",
          "CHEMBL11106",
          "CHEMBL1111",
          "CHEMBL11115",
          "CHEMBL111277",
          "CHEMBL11131",
          "CHEMBL11152",
          "CHEMBL111612",
          "CHEMBL11162",
          "CHEMBL11174",
          "CHEMBL11176",
          "CHEMBL112600",
          "CHEMBL112605",
          "CHEMBL112624",
          "CHEMBL11341",
          "CHEMBL11345",
          "CHEMBL11369",
          "CHEMBL11528",
          "CHEMBL11706",
          "CHEMBL11840",
          "CHEMBL120106",
          "CHEMBL12013",
          "CHEMBL1204990",
          "CHEMBL1205177",
          "CHEMBL120962",
          "CHEMBL1210154",
          "CHEMBL12102",
          "CHEMBL12106",
          "CHEMBL12144",
          "CHEMBL121647",
          "CHEMBL12172",
          "CHEMBL12175",
          "CHEMBL121761",
          "CHEMBL122111",
          "CHEMBL12233",
          "CHEMBL122614",
          "CHEMBL122673",
          "CHEMBL122832",
          "CHEMBL122933",
          "CHEMBL123077",
          "CHEMBL123107",
          "CHEMBL123146",
          "CHEMBL123206",
          "CHEMBL123305",
          "CHEMBL123316",
          "CHEMBL12333",
          "CHEMBL123408",
          "CHEMBL12348",
          "CHEMBL123654",
          "CHEMBL123926",
          "CHEMBL123994",
          "CHEMBL123997",
          "CHEMBL1242923",
          "CHEMBL1242950",
          "CHEMBL12557",
          "CHEMBL12588",
          "CHEMBL12590",
          "CHEMBL12592",
          "CHEMBL126755",
          "CHEMBL1269101",
          "CHEMBL1269102",
          "CHEMBL12703",
          "CHEMBL1271479",
          "CHEMBL1271531",
          "CHEMBL1271586",
          "CHEMBL1271640",
          "CHEMBL1271691",
          "CHEMBL1271746",
          "CHEMBL1271807",
          "CHEMBL1271863",
          "CHEMBL1272137",
          "CHEMBL1272190",
          "CHEMBL1272244",
          "CHEMBL1272299",
          "CHEMBL12779",
          "CHEMBL128479",
          "CHEMBL128818",
          "CHEMBL133257",
          "CHEMBL139734",
          "CHEMBL1406",
          "CHEMBL146155",
          "CHEMBL146845",
          "CHEMBL146904",
          "CHEMBL147081",
          "CHEMBL147238",
          "CHEMBL147340",
          "CHEMBL147365",
          "CHEMBL147510",
          "CHEMBL147521",
          "CHEMBL147908",
          "CHEMBL148637",
          "CHEMBL148719",
          "CHEMBL148751",
          "CHEMBL148853",
          "CHEMBL148855",
          "CHEMBL148967",
          "CHEMBL149010",
          "CHEMBL149018",
          "CHEMBL149050",
          "CHEMBL149152",
          "CHEMBL149232",
          "CHEMBL149241",
          "CHEMBL149340",
          "CHEMBL149391",
          "CHEMBL149592",
          "CHEMBL149763",
          "CHEMBL149778",
          "CHEMBL149818",
          "CHEMBL149819",
          "CHEMBL149953",
          "CHEMBL150260",
          "CHEMBL150273",
          "CHEMBL150474",
          "CHEMBL150719",
          "CHEMBL150891",
          "CHEMBL151160",
          "CHEMBL1513",
          "CHEMBL151395",
          "CHEMBL151422",
          "CHEMBL151440",
          "CHEMBL151819",
          "CHEMBL151926",
          "CHEMBL151971",
          "CHEMBL15310",
          "CHEMBL15573",
          "CHEMBL155943",
          "CHEMBL15689",
          "CHEMBL16018",
          "CHEMBL16197",
          "CHEMBL1627022",
          "CHEMBL1628583",
          "CHEMBL1628584",
          "CHEMBL1628624",
          "CHEMBL1628673",
          "CHEMBL1628688",
          "CHEMBL16306",
          "CHEMBL163638",
          "CHEMBL170121",
          "CHEMBL170229",
          "CHEMBL170335",
          "CHEMBL170342",
          "CHEMBL170401",
          "CHEMBL170446",
          "CHEMBL170450",
          "CHEMBL170600",
          "CHEMBL171198",
          "CHEMBL171950",
          "CHEMBL171972",
          "CHEMBL172029",
          "CHEMBL172030",
          "CHEMBL172071",
          "CHEMBL172184",
          "CHEMBL172248",
          "CHEMBL172297",
          "CHEMBL172441",
          "CHEMBL172538",
          "CHEMBL172666",
          "CHEMBL172759",
          "CHEMBL172987",
          "CHEMBL173189",
          "CHEMBL173201",
          "CHEMBL173336",
          "CHEMBL173358",
          "CHEMBL173366",
          "CHEMBL173465",
          "CHEMBL173557",
          "CHEMBL173689",
          "CHEMBL173721",
          "CHEMBL173743",
          "CHEMBL173761",
          "CHEMBL173805",
          "CHEMBL173808",
          "CHEMBL173974",
          "CHEMBL173977",
          "CHEMBL173982",
          "CHEMBL174086",
          "CHEMBL174094",
          "CHEMBL174230",
          "CHEMBL174326",
          "CHEMBL174363",
          "CHEMBL174413",
          "CHEMBL174448",
          "CHEMBL174547",
          "CHEMBL174607",
          "CHEMBL174699",
          "CHEMBL174781",
          "CHEMBL174871",
          "CHEMBL175005",
          "CHEMBL175045",
          "CHEMBL175057",
          "CHEMBL175058",
          "CHEMBL175111",
          "CHEMBL175228",
          "CHEMBL175268",
          "CHEMBL175278",
          "CHEMBL175435",
          "CHEMBL175616",
          "CHEMBL175698",
          "CHEMBL175916",
          "CHEMBL176418",
          "CHEMBL176422",
          "CHEMBL176482",
          "CHEMBL176538",
          "CHEMBL176650",
          "CHEMBL176664",
          "CHEMBL176675",
          "CHEMBL176698",
          "CHEMBL176741",
          "CHEMBL176749",
          "CHEMBL176854",
          "CHEMBL176912",
          "CHEMBL176963",
          "CHEMBL176997",
          "CHEMBL176999",
          "CHEMBL177070",
          "CHEMBL177111",
          "CHEMBL177143",
          "CHEMBL177179",
          "CHEMBL177203",
          "CHEMBL177538",
          "CHEMBL177546",
          "CHEMBL177802",
          "CHEMBL177839",
          "CHEMBL1788127",
          "CHEMBL1790519",
          "CHEMBL1791271",
          "CHEMBL1791272",
          "CHEMBL1791273",
          "CHEMBL1791274",
          "CHEMBL1791275",
          "CHEMBL1791276",
          "CHEMBL1791277",
          "CHEMBL1791278",
          "CHEMBL1791279",
          "CHEMBL1791280",
          "CHEMBL1791281",
          "CHEMBL1793924",
          "CHEMBL1793925",
          "CHEMBL1793926",
          "CHEMBL1793927",
          "CHEMBL1793928",
          "CHEMBL1793929",
          "CHEMBL1793930",
          "CHEMBL1793931",
          "CHEMBL1793932",
          "CHEMBL1793933",
          "CHEMBL1793934",
          "CHEMBL18626",
          "CHEMBL19661",
          "CHEMBL19808",
          "CHEMBL19921",
          "CHEMBL19950",
          "CHEMBL20168",
          "CHEMBL2058366",
          "CHEMBL2058367",
          "CHEMBL2058368",
          "CHEMBL2058369",
          "CHEMBL2058370",
          "CHEMBL2058371",
          "CHEMBL2058372",
          "CHEMBL2058373",
          "CHEMBL2058374",
          "CHEMBL2058375",
          "CHEMBL2058376",
          "CHEMBL2058377",
          "CHEMBL2067984",
          "CHEMBL2103873",
          "CHEMBL2112377",
          "CHEMBL2113316",
          "CHEMBL2114305",
          "CHEMBL216082",
          "CHEMBL2163688",
          "CHEMBL2163689",
          "CHEMBL2163690",
          "CHEMBL2163691",
          "CHEMBL2163692",
          "CHEMBL2163693",
          "CHEMBL2163694",
          "CHEMBL2163695",
          "CHEMBL2163696",
          "CHEMBL2163697",
          "CHEMBL2163698",
          "CHEMBL2163699",
          "CHEMBL2163700",
          "CHEMBL2163701",
          "CHEMBL2163702",
          "CHEMBL2163703",
          "CHEMBL2163704",
          "CHEMBL2163705",
          "CHEMBL2163706",
          "CHEMBL2163707",
          "CHEMBL2163708",
          "CHEMBL2163709",
          "CHEMBL2163710",
          "CHEMBL2163711",
          "CHEMBL2163712",
          "CHEMBL2163713",
          "CHEMBL2163714",
          "CHEMBL2163715",
          "CHEMBL2163716",
          "CHEMBL2163717",
          "CHEMBL2163718",
          "CHEMBL2163719",
          "CHEMBL2163720",
          "CHEMBL2163721",
          "CHEMBL2163722",
          "CHEMBL2163723",
          "CHEMBL2163724",
          "CHEMBL2163725",
          "CHEMBL2163726",
          "CHEMBL2163727",
          "CHEMBL2163728",
          "CHEMBL2165326",
          "CHEMBL2165327",
          "CHEMBL2165328",
          "CHEMBL2165329",
          "CHEMBL2165330",
          "CHEMBL2165331",
          "CHEMBL2165332",
          "CHEMBL2165333",
          "CHEMBL2165334",
          "CHEMBL2165335",
          "CHEMBL2165336",
          "CHEMBL2165337",
          "CHEMBL2165338",
          "CHEMBL2165339",
          "CHEMBL2165340",
          "CHEMBL22249",
          "CHEMBL22367",
          "CHEMBL22513",
          "CHEMBL22562",
          "CHEMBL2304006",
          "CHEMBL2304015",
          "CHEMBL2304017",
          "CHEMBL2304284",
          "CHEMBL23261",
          "CHEMBL23418",
          "CHEMBL23444",
          "CHEMBL23752",
          "CHEMBL23833",
          "CHEMBL238539",
          "CHEMBL24015",
          "CHEMBL241460",
          "CHEMBL24461",
          "CHEMBL24906",
          "CHEMBL250699",
          "CHEMBL25344",
          "CHEMBL25438",
          "CHEMBL25730",
          "CHEMBL25970",
          "CHEMBL262229",
          "CHEMBL262784",
          "CHEMBL262993",
          "CHEMBL263079",
          "CHEMBL263295",
          "CHEMBL263301",
          "CHEMBL263723",
          "CHEMBL263758",
          "CHEMBL264035",
          "CHEMBL264253",
          "CHEMBL264579",
          "CHEMBL264625",
          "CHEMBL265116",
          "CHEMBL265164",
          "CHEMBL26522",
          "CHEMBL265290",
          "CHEMBL265734",
          "CHEMBL266277",
          "CHEMBL266315",
          "CHEMBL266594",
          "CHEMBL266628",
          "CHEMBL266684",
          "CHEMBL267094",
          "CHEMBL267096",
          "CHEMBL267458",
          "CHEMBL267610",
          "CHEMBL267695",
          "CHEMBL268116",
          "CHEMBL268174",
          "CHEMBL268201",
          "CHEMBL268339",
          "CHEMBL268387",
          "CHEMBL268480",
          "CHEMBL268706",
          "CHEMBL268751",
          "CHEMBL268754",
          "CHEMBL269237",
          "CHEMBL269409",
          "CHEMBL269428",
          "CHEMBL269453",
          "CHEMBL269461",
          "CHEMBL27065",
          "CHEMBL273258",
          "CHEMBL273391",
          "CHEMBL273410",
          "CHEMBL273488",
          "CHEMBL273529",
          "CHEMBL273613",
          "CHEMBL273642",
          "CHEMBL273660",
          "CHEMBL273723",
          "CHEMBL273948",
          "CHEMBL273951",
          "CHEMBL274154",
          "CHEMBL274175",
          "CHEMBL274243",
          "CHEMBL274307",
          "CHEMBL274359",
          "CHEMBL274368",
          "CHEMBL274370",
          "CHEMBL274383",
          "CHEMBL274489",
          "CHEMBL274758",
          "CHEMBL274805",
          "CHEMBL274857",
          "CHEMBL275179",
          "CHEMBL27525",
          "CHEMBL275471",
          "CHEMBL275523",
          "CHEMBL275545",
          "CHEMBL275559",
          "CHEMBL275701",
          "CHEMBL275897",
          "CHEMBL275991",
          "CHEMBL276018",
          "CHEMBL27617",
          "CHEMBL276173",
          "CHEMBL276252",
          "CHEMBL276288",
          "CHEMBL276601",
          "CHEMBL276615",
          "CHEMBL276638",
          "CHEMBL276639",
          "CHEMBL276819",
          "CHEMBL276949",
          "CHEMBL276982",
          "CHEMBL277275",
          "CHEMBL27732",
          "CHEMBL277447",
          "CHEMBL277595",
          "CHEMBL277706",
          "CHEMBL278109",
          "CHEMBL278114",
          "CHEMBL278176",
          "CHEMBL278349",
          "CHEMBL27855",
          "CHEMBL278930",
          "CHEMBL27911",
          "CHEMBL279419",
          "CHEMBL279471",
          "CHEMBL279703",
          "CHEMBL279947",
          "CHEMBL280379",
          "CHEMBL280659",
          "CHEMBL281121",
          "CHEMBL281378",
          "CHEMBL281451",
          "CHEMBL281549",
          "CHEMBL281659",
          "CHEMBL281668",
          "CHEMBL281869",
          "CHEMBL28188",
          "CHEMBL281942",
          "CHEMBL282303",
          "CHEMBL282359",
          "CHEMBL282398",
          "CHEMBL282426",
          "CHEMBL282470",
          "CHEMBL282724",
          "CHEMBL282961",
          "CHEMBL283136",
          "CHEMBL283200",
          "CHEMBL283535",
          "CHEMBL283582",
          "CHEMBL283598",
          "CHEMBL283610",
          "CHEMBL283637",
          "CHEMBL283648",
          "CHEMBL283858",
          "CHEMBL283941",
          "CHEMBL284250",
          "CHEMBL284656",
          "CHEMBL285118",
          "CHEMBL285368",
          "CHEMBL285380",
          "CHEMBL28563",
          "CHEMBL285832",
          "CHEMBL28586",
          "CHEMBL286214",
          "CHEMBL286279",
          "CHEMBL286333",
          "CHEMBL286395",
          "CHEMBL286621",
          "CHEMBL286682",
          "CHEMBL286687",
          "CHEMBL286808",
          "CHEMBL28692",
          "CHEMBL287169",
          "CHEMBL287517",
          "CHEMBL287622",
          "CHEMBL287683",
          "CHEMBL287711",
          "CHEMBL28779",
          "CHEMBL288247",
          "CHEMBL28863",
          "CHEMBL288967",
          "CHEMBL28920",
          "CHEMBL289216",
          "CHEMBL28948",
          "CHEMBL28963",
          "CHEMBL289634",
          "CHEMBL289687",
          "CHEMBL290026",
          "CHEMBL290181",
          "CHEMBL291058",
          "CHEMBL291247",
          "CHEMBL291404",
          "CHEMBL29147",
          "CHEMBL291592",
          "CHEMBL291891",
          "CHEMBL29223",
          "CHEMBL29265",
          "CHEMBL292802",
          "CHEMBL29313",
          "CHEMBL293232",
          "CHEMBL293398",
          "CHEMBL293421",
          "CHEMBL293830",
          "CHEMBL293877",
          "CHEMBL29420",
          "CHEMBL29422",
          "CHEMBL294291",
          "CHEMBL294563",
          "CHEMBL29464",
          "CHEMBL29502",
          "CHEMBL295140",
          "CHEMBL295207",
          "CHEMBL295440",
          "CHEMBL295477",
          "CHEMBL295557",
          "CHEMBL295583",
          "CHEMBL295588",
          "CHEMBL295632",
          "CHEMBL295697",
          "CHEMBL29598",
          "CHEMBL296074",
          "CHEMBL296129",
          "CHEMBL296291",
          "CHEMBL296326",
          "CHEMBL296427",
          "CHEMBL296456",
          "CHEMBL29652",
          "CHEMBL296927",
          "CHEMBL296974",
          "CHEMBL297048",
          "CHEMBL29710",
          "CHEMBL297107",
          "CHEMBL297215",
          "CHEMBL297353",
          "CHEMBL297473",
          "CHEMBL297557",
          "CHEMBL297599",
          "CHEMBL297618",
          "CHEMBL297679",
          "CHEMBL29775",
          "CHEMBL297783",
          "CHEMBL29793",
          "CHEMBL298203",
          "CHEMBL298212",
          "CHEMBL298569",
          "CHEMBL298664",
          "CHEMBL298922",
          "CHEMBL299095",
          "CHEMBL299921",
          "CHEMBL300000",
          "CHEMBL30009",
          "CHEMBL30039",
          "CHEMBL300547",
          "CHEMBL300577",
          "CHEMBL30092",
          "CHEMBL301371",
          "CHEMBL301723",
          "CHEMBL30199",
          "CHEMBL30215",
          "CHEMBL30228",
          "CHEMBL30246",
          "CHEMBL302493",
          "CHEMBL302564",
          "CHEMBL302753",
          "CHEMBL302872",
          "CHEMBL30297",
          "CHEMBL302974",
          "CHEMBL303034",
          "CHEMBL303203",
          "CHEMBL303390",
          "CHEMBL303428",
          "CHEMBL303484",
          "CHEMBL303501",
          "CHEMBL303631",
          "CHEMBL303649",
          "CHEMBL303712",
          "CHEMBL303806",
          "CHEMBL303902",
          "CHEMBL30405",
          "CHEMBL304173",
          "CHEMBL304406",
          "CHEMBL304460",
          "CHEMBL304481",
          "CHEMBL304721",
          "CHEMBL304762",
          "CHEMBL304778",
          "CHEMBL304802",
          "CHEMBL304860",
          "CHEMBL305035",
          "CHEMBL305267",
          "CHEMBL305270",
          "CHEMBL305462",
          "CHEMBL305524",
          "CHEMBL305602",
          "CHEMBL305777",
          "CHEMBL305980",
          "CHEMBL306123",
          "CHEMBL306218",
          "CHEMBL306950",
          "CHEMBL307033",
          "CHEMBL307045",
          "CHEMBL307330",
          "CHEMBL307384",
          "CHEMBL307470",
          "CHEMBL307471",
          "CHEMBL307803",
          "CHEMBL307936",
          "CHEMBL308088",
          "CHEMBL308102",
          "CHEMBL308269",
          "CHEMBL308521",
          "CHEMBL308646",
          "CHEMBL309397",
          "CHEMBL309692",
          "CHEMBL310039",
          "CHEMBL310361",
          "CHEMBL310427",
          "CHEMBL310739",
          "CHEMBL310919",
          "CHEMBL310920",
          "CHEMBL310944",
          "CHEMBL311138",
          "CHEMBL311216",
          "CHEMBL311258",
          "CHEMBL311455",
          "CHEMBL311461",
          "CHEMBL311510",
          "CHEMBL311742",
          "CHEMBL311781",
          "CHEMBL311854",
          "CHEMBL312187",
          "CHEMBL312266",
          "CHEMBL312372",
          "CHEMBL312551",
          "CHEMBL312670",
          "CHEMBL312685",
          "CHEMBL312916",
          "CHEMBL313033",
          "CHEMBL313056",
          "CHEMBL313184",
          "CHEMBL313344",
          "CHEMBL313382",
          "CHEMBL313551",
          "CHEMBL313760",
          "CHEMBL313801",
          "CHEMBL313867",
          "CHEMBL313870",
          "CHEMBL313984",
          "CHEMBL314239",
          "CHEMBL314307",
          "CHEMBL314320",
          "CHEMBL314364",
          "CHEMBL314411",
          "CHEMBL314479",
          "CHEMBL314511",
          "CHEMBL31469",
          "CHEMBL314755",
          "CHEMBL314915",
          "CHEMBL314946",
          "CHEMBL315047",
          "CHEMBL315096",
          "CHEMBL31524",
          "CHEMBL315328",
          "CHEMBL315384",
          "CHEMBL315658",
          "CHEMBL315780",
          "CHEMBL315841",
          "CHEMBL315927",
          "CHEMBL316012",
          "CHEMBL316092",
          "CHEMBL316247",
          "CHEMBL316301",
          "CHEMBL316453",
          "CHEMBL316523",
          "CHEMBL31662",
          "CHEMBL316629",
          "CHEMBL316648",
          "CHEMBL316650",
          "CHEMBL316735",
          "CHEMBL316792",
          "CHEMBL316851",
          "CHEMBL316878",
          "CHEMBL317099",
          "CHEMBL317233",
          "CHEMBL317510",
          "CHEMBL317589",
          "CHEMBL317622",
          "CHEMBL317716",
          "CHEMBL31781",
          "CHEMBL317981",
          "CHEMBL318020",
          "CHEMBL318086",
          "CHEMBL318146",
          "CHEMBL318247",
          "CHEMBL318270",
          "CHEMBL318535",
          "CHEMBL318683",
          "CHEMBL319007",
          "CHEMBL319031",
          "CHEMBL319036",
          "CHEMBL319452",
          "CHEMBL319537",
          "CHEMBL319660",
          "CHEMBL319679",
          "CHEMBL319719",
          "CHEMBL319754",
          "CHEMBL319924",
          "CHEMBL320183",
          "CHEMBL320208",
          "CHEMBL320224",
          "CHEMBL320236",
          "CHEMBL320631",
          "CHEMBL320839",
          "CHEMBL321520",
          "CHEMBL321984",
          "CHEMBL322105",
          "CHEMBL322434",
          "CHEMBL322537",
          "CHEMBL322674",
          "CHEMBL322920",
          "CHEMBL322996",
          "CHEMBL323331",
          "CHEMBL323464",
          "CHEMBL323561",
          "CHEMBL323951",
          "CHEMBL324166",
          "CHEMBL325187",
          "CHEMBL325581",
          "CHEMBL325690",
          "CHEMBL326059",
          "CHEMBL326982",
          "CHEMBL327350",
          "CHEMBL327360",
          "CHEMBL327523",
          "CHEMBL327590",
          "CHEMBL327823",
          "CHEMBL327976",
          "CHEMBL328073",
          "CHEMBL328089",
          "CHEMBL328517",
          "CHEMBL328878",
          "CHEMBL328942",
          "CHEMBL329100",
          "CHEMBL329132",
          "CHEMBL329170",
          "CHEMBL329251",
          "CHEMBL329375",
          "CHEMBL329477",
          "CHEMBL329560",
          "CHEMBL329609",
          "CHEMBL329610",
          "CHEMBL329737",
          "CHEMBL329744",
          "CHEMBL329783",
          "CHEMBL329861",
          "CHEMBL329890",
          "CHEMBL329943",
          "CHEMBL330003",
          "CHEMBL330045",
          "CHEMBL330104",
          "CHEMBL330135",
          "CHEMBL330144",
          "CHEMBL330354",
          "CHEMBL330359",
          "CHEMBL330414",
          "CHEMBL330425",
          "CHEMBL330489",
          "CHEMBL330629",
          "CHEMBL330674",
          "CHEMBL330895",
          "CHEMBL331066",
          "CHEMBL331548",
          "CHEMBL331625",
          "CHEMBL331758",
          "CHEMBL331767",
          "CHEMBL331936",
          "CHEMBL332093",
          "CHEMBL332109",
          "CHEMBL332144",
          "CHEMBL332231",
          "CHEMBL332289",
          "CHEMBL332387",
          "CHEMBL332424",
          "CHEMBL332431",
          "CHEMBL332471",
          "CHEMBL332627",
          "CHEMBL332794",
          "CHEMBL332808",
          "CHEMBL333009",
          "CHEMBL333034",
          "CHEMBL333972",
          "CHEMBL334076",
          "CHEMBL336033",
          "CHEMBL338754",
          "CHEMBL339657",
          "CHEMBL342615",
          "CHEMBL343379",
          "CHEMBL343867",
          "CHEMBL34540",
          "CHEMBL345542",
          "CHEMBL345551",
          "CHEMBL345951",
          "CHEMBL346853",
          "CHEMBL346862",
          "CHEMBL347125",
          "CHEMBL347948",
          "CHEMBL347958",
          "CHEMBL347982",
          "CHEMBL348685",
          "CHEMBL348700",
          "CHEMBL352396",
          "CHEMBL352657",
          "CHEMBL352929",
          "CHEMBL353320",
          "CHEMBL353502",
          "CHEMBL353605",
          "CHEMBL354082",
          "CHEMBL354152",
          "CHEMBL355384",
          "CHEMBL355800",
          "CHEMBL356591",
          "CHEMBL356901",
          "CHEMBL357077",
          "CHEMBL357331",
          "CHEMBL357395",
          "CHEMBL357580",
          "CHEMBL357678",
          "CHEMBL357789",
          "CHEMBL357823",
          "CHEMBL358020",
          "CHEMBL358226",
          "CHEMBL358254",
          "CHEMBL358461",
          "CHEMBL358545",
          "CHEMBL359152",
          "CHEMBL359167",
          "CHEMBL359273",
          "CHEMBL359332",
          "CHEMBL35984",
          "CHEMBL36627",
          "CHEMBL366364",
          "CHEMBL366378",
          "CHEMBL366627",
          "CHEMBL366628",
          "CHEMBL366652",
          "CHEMBL366680",
          "CHEMBL36671",
          "CHEMBL366797",
          "CHEMBL366805",
          "CHEMBL366872",
          "CHEMBL366885",
          "CHEMBL367017",
          "CHEMBL367024",
          "CHEMBL367033",
          "CHEMBL367036",
          "CHEMBL367093",
          "CHEMBL367274",
          "CHEMBL367275",
          "CHEMBL367317",
          "CHEMBL367339",
          "CHEMBL367382",
          "CHEMBL367443",
          "CHEMBL367444",
          "CHEMBL367453",
          "CHEMBL367645",
          "CHEMBL367686",
          "CHEMBL367763",
          "CHEMBL367767",
          "CHEMBL367776",
          "CHEMBL367958",
          "CHEMBL368107",
          "CHEMBL368117",
          "CHEMBL368211",
          "CHEMBL368383",
          "CHEMBL368386",
          "CHEMBL368528",
          "CHEMBL368617",
          "CHEMBL368629",
          "CHEMBL368738",
          "CHEMBL368780",
          "CHEMBL368828",
          "CHEMBL368829",
          "CHEMBL368860",
          "CHEMBL368929",
          "CHEMBL368945",
          "CHEMBL368989",
          "CHEMBL368996",
          "CHEMBL369003",
          "CHEMBL369359",
          "CHEMBL369362",
          "CHEMBL369667",
          "CHEMBL369676",
          "CHEMBL369821",
          "CHEMBL372814",
          "CHEMBL37427",
          "CHEMBL37860",
          "CHEMBL37920",
          "CHEMBL37973",
          "CHEMBL38000",
          "CHEMBL383581",
          "CHEMBL384052",
          "CHEMBL384728",
          "CHEMBL38537",
          "CHEMBL385405",
          "CHEMBL385492",
          "CHEMBL386181",
          "CHEMBL387200",
          "CHEMBL39057",
          "CHEMBL39142",
          "CHEMBL39171",
          "CHEMBL398070",
          "CHEMBL405178",
          "CHEMBL405599",
          "CHEMBL405677",
          "CHEMBL405709",
          "CHEMBL406279",
          "CHEMBL406551",
          "CHEMBL407269",
          "CHEMBL407933",
          "CHEMBL408055",
          "CHEMBL408141",
          "CHEMBL409777",
          "CHEMBL41087",
          "CHEMBL411797",
          "CHEMBL411925",
          "CHEMBL412460",
          "CHEMBL413001",
          "CHEMBL413093",
          "CHEMBL413179",
          "CHEMBL413825",
          "CHEMBL413880",
          "CHEMBL414082",
          "CHEMBL414165",
          "CHEMBL414408",
          "CHEMBL414605",
          "CHEMBL414917",
          "CHEMBL415010",
          "CHEMBL415106",
          "CHEMBL415238",
          "CHEMBL415292",
          "CHEMBL415614",
          "CHEMBL416019",
          "CHEMBL416086",
          "CHEMBL416324",
          "CHEMBL416453",
          "CHEMBL416518",
          "CHEMBL416570",
          "CHEMBL417067",
          "CHEMBL417246",
          "CHEMBL417358",
          "CHEMBL417428",
          "CHEMBL417429",
          "CHEMBL417651",
          "CHEMBL417719",
          "CHEMBL417903",
          "CHEMBL417978",
          "CHEMBL418326",
          "CHEMBL418992",
          "CHEMBL419136",
          "CHEMBL419148",
          "CHEMBL419367",
          "CHEMBL419495",
          "CHEMBL419879",
          "CHEMBL420029",
          "CHEMBL420072",
          "CHEMBL420435",
          "CHEMBL420729",
          "CHEMBL421073",
          "CHEMBL421184",
          "CHEMBL421190",
          "CHEMBL421349",
          "CHEMBL421523",
          "CHEMBL421955",
          "CHEMBL422068",
          "CHEMBL422128",
          "CHEMBL422496",
          "CHEMBL422720",
          "CHEMBL422851",
          "CHEMBL423583",
          "CHEMBL423941",
          "CHEMBL424371",
          "CHEMBL424504",
          "CHEMBL425682",
          "CHEMBL426218",
          "CHEMBL428504",
          "CHEMBL428661",
          "CHEMBL429019",
          "CHEMBL429037",
          "CHEMBL430506",
          "CHEMBL430528",
          "CHEMBL430572",
          "CHEMBL430695",
          "CHEMBL430759",
          "CHEMBL430822",
          "CHEMBL431087",
          "CHEMBL431124",
          "CHEMBL431218",
          "CHEMBL431286",
          "CHEMBL431296",
          "CHEMBL431433",
          "CHEMBL431460",
          "CHEMBL431651",
          "CHEMBL431874",
          "CHEMBL432012",
          "CHEMBL432091",
          "CHEMBL432109",
          "CHEMBL432227",
          "CHEMBL432499",
          "CHEMBL432521",
          "CHEMBL432815",
          "CHEMBL432856",
          "CHEMBL432974",
          "CHEMBL433039",
          "CHEMBL433074",
          "CHEMBL433106",
          "CHEMBL433173",
          "CHEMBL433221",
          "CHEMBL433229",
          "CHEMBL433349",
          "CHEMBL433367",
          "CHEMBL433406",
          "CHEMBL433619",
          "CHEMBL434082",
          "CHEMBL434983",
          "CHEMBL434986",
          "CHEMBL435185",
          "CHEMBL435346",
          "CHEMBL435385",
          "CHEMBL435568",
          "CHEMBL435895",
          "CHEMBL436821",
          "CHEMBL436884",
          "CHEMBL436899",
          "CHEMBL437",
          "CHEMBL437472",
          "CHEMBL43788",
          "CHEMBL438194",
          "CHEMBL438380",
          "CHEMBL438768",
          "CHEMBL439435",
          "CHEMBL439759",
          "CHEMBL440507",
          "CHEMBL440780",
          "CHEMBL440853",
          "CHEMBL441006",
          "CHEMBL441112",
          "CHEMBL44321",
          "CHEMBL445101",
          "CHEMBL44539",
          "CHEMBL44544",
          "CHEMBL44615",
          "CHEMBL448165",
          "CHEMBL450337",
          "CHEMBL450628",
          "CHEMBL45087",
          "CHEMBL45160",
          "CHEMBL45269",
          "CHEMBL45296",
          "CHEMBL453",
          "CHEMBL45351",
          "CHEMBL453822",
          "CHEMBL45456",
          "CHEMBL45723",
          "CHEMBL45760",
          "CHEMBL45872",
          "CHEMBL45875",
          "CHEMBL46195",
          "CHEMBL46311",
          "CHEMBL46357",
          "CHEMBL47008",
          "CHEMBL47383",
          "CHEMBL47404",
          "CHEMBL47417",
          "CHEMBL47418",
          "CHEMBL47424",
          "CHEMBL47450",
          "CHEMBL47536",
          "CHEMBL47563",
          "CHEMBL47604",
          "CHEMBL47620",
          "CHEMBL47706",
          "CHEMBL47765",
          "CHEMBL47827",
          "CHEMBL47828",
          "CHEMBL47868",
          "CHEMBL47915",
          "CHEMBL48024",
          "CHEMBL48031",
          "CHEMBL48120",
          "CHEMBL48134",
          "CHEMBL48196",
          "CHEMBL48261",
          "CHEMBL48448",
          "CHEMBL48652",
          "CHEMBL48907",
          "CHEMBL49007",
          "CHEMBL49040",
          "CHEMBL49312",
          "CHEMBL49850",
          "CHEMBL50232",
          "CHEMBL510130",
          "CHEMBL51530",
          "CHEMBL52110",
          "CHEMBL539420",
          "CHEMBL539423",
          "CHEMBL58058",
          "CHEMBL58359",
          "CHEMBL59288",
          "CHEMBL59819",
          "CHEMBL60058",
          "CHEMBL60149",
          "CHEMBL60276",
          "CHEMBL60367",
          "CHEMBL61211",
          "CHEMBL61425",
          "CHEMBL61711",
          "CHEMBL61780",
          "CHEMBL62019",
          "CHEMBL62112",
          "CHEMBL62159",
          "CHEMBL6297",
          "CHEMBL63169",
          "CHEMBL63290",
          "CHEMBL633",
          "CHEMBL63611",
          "CHEMBL63648",
          "CHEMBL63805",
          "CHEMBL6382",
          "CHEMBL63937",
          "CHEMBL63938",
          "CHEMBL6399",
          "CHEMBL6400",
          "CHEMBL64006",
          "CHEMBL64009",
          "CHEMBL6411",
          "CHEMBL6412",
          "CHEMBL64200",
          "CHEMBL6433",
          "CHEMBL64424",
          "CHEMBL6463",
          "CHEMBL6468",
          "CHEMBL65407",
          "CHEMBL6543",
          "CHEMBL65488",
          "CHEMBL6553",
          "CHEMBL65531",
          "CHEMBL6555",
          "CHEMBL65639",
          "CHEMBL6566",
          "CHEMBL6576",
          "CHEMBL6583",
          "CHEMBL65833",
          "CHEMBL6588",
          "CHEMBL65939",
          "CHEMBL6624",
          "CHEMBL6630",
          "CHEMBL66402",
          "CHEMBL6647",
          "CHEMBL6660",
          "CHEMBL66641",
          "CHEMBL66762",
          "CHEMBL66893",
          "CHEMBL67084",
          "CHEMBL67325",
          "CHEMBL67536",
          "CHEMBL6761",
          "CHEMBL67664",
          "CHEMBL6778",
          "CHEMBL6785",
          "CHEMBL67957",
          "CHEMBL6800",
          "CHEMBL68269",
          "CHEMBL68557",
          "CHEMBL69150",
          "CHEMBL69353",
          "CHEMBL69664",
          "CHEMBL69832",
          "CHEMBL69986",
          "CHEMBL70017",
          "CHEMBL7019",
          "CHEMBL70203",
          "CHEMBL70293",
          "CHEMBL70303",
          "CHEMBL70310",
          "CHEMBL70339",
          "CHEMBL70365",
          "CHEMBL70385",
          "CHEMBL70487",
          "CHEMBL70686",
          "CHEMBL70781",
          "CHEMBL70788",
          "CHEMBL70800",
          "CHEMBL70895",
          "CHEMBL70924",
          "CHEMBL71070",
          "CHEMBL71787",
          "CHEMBL72037",
          "CHEMBL72217",
          "CHEMBL72295",
          "CHEMBL72348",
          "CHEMBL72358",
          "CHEMBL72410",
          "CHEMBL72473",
          "CHEMBL72924",
          "CHEMBL73000",
          "CHEMBL73042",
          "CHEMBL73373",
          "CHEMBL73697",
          "CHEMBL73835",
          "CHEMBL73925",
          "CHEMBL74118",
          "CHEMBL76360",
          "CHEMBL76420",
          "CHEMBL76438",
          "CHEMBL76576",
          "CHEMBL76623",
          "CHEMBL76779",
          "CHEMBL76860",
          "CHEMBL76949",
          "CHEMBL77090",
          "CHEMBL77962",
          "CHEMBL78080",
          "CHEMBL78499",
          "CHEMBL78552",
          "CHEMBL78563",
          "CHEMBL78601",
          "CHEMBL78669",
          "CHEMBL78734",
          "CHEMBL78830",
          "CHEMBL78853",
          "CHEMBL78929",
          "CHEMBL78952",
          "CHEMBL79030",
          "CHEMBL79031",
          "CHEMBL79054",
          "CHEMBL79066",
          "CHEMBL79080",
          "CHEMBL80129",
          "CHEMBL80180",
          "CHEMBL80317",
          "CHEMBL80342",
          "CHEMBL80438",
          "CHEMBL80484",
          "CHEMBL80506",
          "CHEMBL80507",
          "CHEMBL80532",
          "CHEMBL80538",
          "CHEMBL80782",
          "CHEMBL80807",
          "CHEMBL80808",
          "CHEMBL80857",
          "CHEMBL80945",
          "CHEMBL80980",
          "CHEMBL81593",
          "CHEMBL85341",
          "CHEMBL86489",
          "CHEMBL86581",
          "CHEMBL86703",
          "CHEMBL86737",
          "CHEMBL86814",
          "CHEMBL87243",
          "CHEMBL87252",
          "CHEMBL87296",
          "CHEMBL87724",
          "CHEMBL8823",
          "CHEMBL88506",
          "CHEMBL89203",
          "CHEMBL8923",
          "CHEMBL89416",
          "CHEMBL89457",
          "CHEMBL89688",
          "CHEMBL89689",
          "CHEMBL89736",
          "CHEMBL8978",
          "CHEMBL8981",
          "CHEMBL91073",
          "CHEMBL9139",
          "CHEMBL9141",
          "CHEMBL91470",
          "CHEMBL91873",
          "CHEMBL91926",
          "CHEMBL9194",
          "CHEMBL92318",
          "CHEMBL92612",
          "CHEMBL93084",
          "CHEMBL9334",
          "CHEMBL93612",
          "CHEMBL93820",
          "CHEMBL94091",
          "CHEMBL94212",
          "CHEMBL94370",
          "CHEMBL94438",
          "CHEMBL94446",
          "CHEMBL94488",
          "CHEMBL94525",
          "CHEMBL94580",
          "CHEMBL94602",
          "CHEMBL94606",
          "CHEMBL94689",
          "CHEMBL94730",
          "CHEMBL94752",
          "CHEMBL94766",
          "CHEMBL94769",
          "CHEMBL94786",
          "CHEMBL94802",
          "CHEMBL94810",
          "CHEMBL94907",
          "CHEMBL94934",
          "CHEMBL94962",
          "CHEMBL94964",
          "CHEMBL94983",
          "CHEMBL95013",
          "CHEMBL95017",
          "CHEMBL95095",
          "CHEMBL957",
          "CHEMBL9588",
          "CHEMBL96114",
          "CHEMBL96125",
          "CHEMBL96154",
          "CHEMBL96171",
          "CHEMBL96193",
          "CHEMBL96303",
          "CHEMBL96313",
          "CHEMBL96318",
          "CHEMBL96325",
          "CHEMBL96331",
          "CHEMBL96347",
          "CHEMBL96351",
          "CHEMBL96387",
          "CHEMBL96422",
          "CHEMBL96463",
          "CHEMBL96472",
          "CHEMBL96506",
          "CHEMBL96520",
          "CHEMBL96614",
          "CHEMBL96704",
          "CHEMBL96723",
          "CHEMBL96746",
          "CHEMBL96822",
          "CHEMBL96831",
          "CHEMBL96906",
          "CHEMBL96932",
          "CHEMBL97431",
          "CHEMBL97470",
          "CHEMBL99963"
        ],
        "number_of_missing_values": "0"
      },
      {
        "data_type": "numeric",
        "index": "1",
        "is_ignore": "false",
        "is_row_identifier": "false",
        "is_target": "false",
        "name": "AMW",
        "number_of_missing_values": "0"
      },
      {
        "data_type": "numeric",
        "index": "2",
        "is_ignore": "false",
        "is_row_identifier": "false",
        "is_target": "false",
        "name": "C.",
        "number_of_missing_values": "0"
      },
      {
        "data_type": "numeric",
        "index": "3",
        "is_ignore": "false",
        "is_row_identifier": "false",
        "is_target": "false",
        "name": "H.",
        "number_of_missing_values": "0"
      },
      {
        "data_type": "numeric",
        "index": "4",
        "is_ignore": "false",
        "is_row_identifier": "false",
        "is_target": "false",
        "name": "Me",
        "number_of_missing_values": "0"
      },
      {
        "data_type": "numeric",
        "index": "5",
        "is_ignore": "false",
        "is_row_identifier": "false",
        "is_target": "false",
        "name": "Mi",
        "number_of_missing_values": "0"
      },
      {
        "data_type": "numeric",
        "index": "6",
        "is_ignore": "false",
        "is_row_identifier": "false",
        "is_target": "false",
        "name": "Mp",
        "number_of_missing_values": "0"
      },
      {
        "data_type": "numeric",
        "index": "7",
        "is_ignore": "false",
        "is_row_identifier": "false",
        "is_target": "false",
        "name": "Mv",
        "number_of_missing_values": "0"
      },
      {
        "data_type": "numeric",
        "index": "8",
        "is_ignore": "false",
        "is_row_identifier": "false",
        "is_target": "false",
        "name": "MW",
        "number_of_missing_values": "0"
      },
      {
        "data_type": "numeric",
        "index": "9",
        "is_ignore": "false",
        "is_row_identifier": "false",
        "is_target": "false",
        "name": "N.",
        "number_of_missing_values": "0"
      },
      {
        "data_type": "numeric",
        "index": "10",
        "is_ignore": "false",
        "is_row_identifier": "false",
        "is_target": "false",
        "name": "nAB",
        "number_of_missing_values": "0"
      },
      {
        "data_type": "numeric",
        "index": "11",
        "is_ignore": "false",
        "is_row_identifier": "false",
        "is_target": "false",
        "name": "nAT",
        "number_of_missing_values": "0"
      },
      {
        "data_type": "numeric",
        "index": "12",
        "is_ignore": "false",
        "is_row_identifier": "false",
        "is_target": "false",
        "name": "nB",
        "number_of_missing_values": "0"
      },
      {
        "data_type": "numeric",
        "index": "13",
        "is_ignore": "false",
        "is_row_identifier": "false",
        "is_target": "false",
        "name": "nBM",
        "number_of_missing_values": "0"
      },
      {
        "data_type": "numeric",
        "index": "14",
        "is_ignore": "false",
        "is_row_identifier": "false",
        "is_target": "false",
        "name": "nBO",
        "number_of_missing_values": "0"
      },
      {
        "data_type": "numeric",
        "index": "15",
        "is_ignore": "false",
        "is_row_identifier": "false",
        "is_target": "false",
        "name": "nBR",
        "number_of_missing_values": "0"
      },
      {
        "data_type": "numeric",
        "index": "16",
        "is_ignore": "false",
        "is_row_identifier": "false",
        "is_target": "false",
        "name": "nBT",
        "number_of_missing_values": "0"
      },
      {
        "data_type": "numeric",
        "index": "17",
        "is_ignore": "false",
        "is_row_identifier": "false",
        "is_target": "false",
        "name": "nC",
        "number_of_missing_values": "0"
      },
      {
        "data_type": "numeric",
        "index": "18",
        "is_ignore": "false",
        "is_row_identifier": "false",
        "is_target": "false",
        "name": "nCL",
        "number_of_missing_values": "0"
      },
      {
        "data_type": "numeric",
        "index": "19",
        "is_ignore": "false",
        "is_row_identifier": "false",
        "is_target": "false",
        "name": "nCsp",
        "number_of_missing_values": "0"
      },
      {
        "data_type": "numeric",
        "index": "20",
        "is_ignore": "false",
        "is_row_identifier": "false",
        "is_target": "false",
        "name": "nCsp2",
        "number_of_missing_values": "0"
      },
      {
        "data_type": "numeric",
        "index": "21",
        "is_ignore": "false",
        "is_row_identifier": "false",
        "is_target": "false",
        "name": "nCsp3",
        "number_of_missing_values": "0"
      },
      {
        "data_type": "numeric",
        "index": "22",
        "is_ignore": "false",
        "is_row_identifier": "false",
        "is_target": "false",
        "name": "nDB",
        "number_of_missing_values": "0"
      },
      {
        "data_type": "numeric",
        "index": "23",
        "is_ignore": "false",
        "is_row_identifier": "false",
        "is_target": "false",
        "name": "nF",
        "number_of_missing_values": "0"
      },
      {
        "data_type": "numeric",
        "index": "24",
        "is_ignore": "false",
        "is_row_identifier": "false",
        "is_target": "false",
        "name": "nH",
        "number_of_missing_values": "0"
      },
      {
        "data_type": "numeric",
        "index": "25",
        "is_ignore": "false",
        "is_row_identifier": "false",
        "is_target": "false",
        "name": "nHet",
        "number_of_missing_values": "0"
      },
      {
        "data_type": "numeric",
        "index": "26",
        "is_ignore": "false",
        "is_row_identifier": "false",
        "is_target": "false",
        "name": "nHM",
        "number_of_missing_values": "0"
      },
      {
        "data_type": "numeric",
        "index": "27",
        "is_ignore": "false",
        "is_row_identifier": "false",
        "is_target": "false",
        "name": "nI",
        "number_of_missing_values": "0"
      },
      {
        "data_type": "numeric",
        "index": "28",
        "is_ignore": "false",
        "is_row_identifier": "false",
        "is_target": "false",
        "name": "nN",
        "number_of_missing_values": "0"
      },
      {
        "data_type": "numeric",
        "index": "29",
        "is_ignore": "false",
        "is_row_identifier": "false",
        "is_target": "false",
        "name": "nO",
        "number_of_missing_values": "0"
      },
      {
        "data_type": "numeric",
        "index": "30",
        "is_ignore": "false",
        "is_row_identifier": "false",
        "is_target": "false",
        "name": "nP",
        "number_of_missing_values": "0"
      },
      {
        "data_type": "numeric",
        "index": "31",
        "is_ignore": "false",
        "is_row_identifier": "false",
        "is_target": "false",
        "name": "nS",
        "number_of_missing_values": "0"
      },
      {
        "data_type": "numeric",
        "index": "32",
        "is_ignore": "false",
        "is_row_identifier": "false",
        "is_target": "false",
        "name": "nSK",
        "number_of_missing_values": "0"
      },
      {
        "data_type": "numeric",
        "index": "33",
        "is_ignore": "false",
        "is_row_identifier": "false",
        "is_target": "false",
        "name": "nTB",
        "number_of_missing_values": "0"
      },
      {
        "data_type": "numeric",
        "index": "34",
        "is_ignore": "false",
        "is_row_identifier": "false",
        "is_target": "false",
        "name": "nX",
        "number_of_missing_values": "0"
      },
      {
        "data_type": "numeric",
        "index": "35",
        "is_ignore": "false",
        "is_row_identifier": "false",
        "is_target": "false",
        "name": "O.",
        "number_of_missing_values": "0"
      },
      {
        "data_type": "numeric",
        "index": "36",
        "is_ignore": "false",
        "is_row_identifier": "false",
        "is_target": "false",
        "name": "RBF",
        "number_of_missing_values": "0"
      },
      {
        "data_type": "numeric",
        "index": "37",
        "is_ignore": "false",
        "is_row_identifier": "false",
        "is_target": "false",
        "name": "RBN",
        "number_of_missing_values": "0"
      },
      {
        "data_type": "numeric",
        "index": "38",
        "is_ignore": "false",
        "is_row_identifier": "false",
        "is_target": "false",
        "name": "SCBO",
        "number_of_missing_values": "0"
      },
      {
        "data_type": "numeric",
        "index": "39",
        "is_ignore": "false",
        "is_row_identifier": "false",
        "is_target": "false",
        "name": "Se",
        "number_of_missing_values": "0"
      },
      {
        "data_type": "numeric",
        "index": "40",
        "is_ignore": "false",
        "is_row_identifier": "false",
        "is_target": "false",
        "name": "Si",
        "number_of_missing_values": "0"
      },
      {
        "data_type": "numeric",
        "index": "41",
        "is_ignore": "false",
        "is_row_identifier": "false",
        "is_target": "false",
        "name": "Sp",
        "number_of_missing_values": "0"
      },
      {
        "data_type": "numeric",
        "index": "42",
        "is_ignore": "false",
        "is_row_identifier": "false",
        "is_target": "false",
        "name": "Sv",
        "number_of_missing_values": "0"
      },
      {
        "data_type": "numeric",
        "index": "43",
        "is_ignore": "false",
        "is_row_identifier": "false",
        "is_target": "false",
        "name": "X.",
        "number_of_missing_values": "0"
      },
      {
        "data_type": "numeric",
        "index": "44",
        "is_ignore": "false",
        "is_row_identifier": "false",
        "is_target": "true",
        "name": "pXC50",
        "number_of_missing_values": "0"
      }
    ]
  }
}