"molecule_id","AMW","C.","H.","Me","Mi","Mp","Mv","MW","N.","nAB","nAT","nB","nBM","nBO","nBR","nBT","nC","nCL","nCsp","nCsp2","nCsp3","nDB","nF","nH","nHet","nHM","nI","nN","nO","nP","nS","nSK","nTB","nX","O.","RBF","RBN","SCBO","Se","Si","Sp","Sv","X.","pXC50"
{1 6.821,2 35.6,3 52.2,4 0.998,5 1.135,6 0.633,7 0.588,8 613.91,9 5.6,10 12,11 90,13 17,14 45,16 92,17 32,20 15,21 17,22 5,24 47,25 11,26 1,28 5,29 5,31 1,32 43,35 5.6,36 0.13,37 12,38 56,39 89.778,40 102.178,41 56.938,42 52.931,44 5.201}
{0 CHEMBL133027,1 8.425,2 35.8,3 41.5,4 1.026,5 1.137,6 0.661,7 0.643,8 446.54,9 11.3,10 12,11 53,13 18,14 32,16 54,17 19,20 16,21 3,22 6,24 22,25 12,26 1,28 6,29 5,31 1,32 31,35 9.4,36 0.185,37 10,38 44,39 54.393,40 60.278,41 35.046,42 34.104,44 4}
{0 CHEMBL135815,1 8.044,2 35.6,3 44.1,4 1.02,5 1.137,6 0.654,7 0.63,8 474.6,9 10.2,10 12,11 59,13 18,14 34,16 60,17 21,20 16,21 5,22 6,24 26,25 12,26 1,28 6,29 5,31 1,32 33,35 8.5,36 0.2,37 12,38 46,39 60.16,40 67.109,41 38.568,42 37.157,44 4.538}
{0 CHEMBL135998,1 8.319,2 38.2,3 41.8,4 1.021,5 1.131,6 0.669,7 0.647,8 457.56,9 9.1,10 12,11 55,13 18,14 33,16 56,17 21,19 1,20 15,21 5,22 5,24 23,25 11,26 1,28 5,29 5,31 1,32 32,33 1,35 9.1,36 0.196,37 11,38 46,39 56.174,40 62.195,41 36.801,42 35.609,44 4.481}
{0 CHEMBL137780,1 8.044,2 35.6,3 44.1,4 1.02,5 1.137,6 0.654,7 0.63,8 474.6,9 10.2,10 12,11 59,13 18,14 34,16 60,17 21,20 16,21 5,22 6,24 26,25 12,26 1,28 6,29 5,31 1,32 33,35 8.5,36 0.2,37 12,38 46,39 60.16,40 67.109,41 38.568,42 37.157,44 4.921}
{0 CHEMBL2338554,1 7.409,2 34.8,3 48.1,4 1.017,5 1.138,6 0.627,7 0.602,8 1000.26,9 5.2,10 12,11 135,13 23,14 73,16 138,17 47,20 22,21 25,22 11,24 65,25 23,26 1,28 7,29 15,31 1,32 70,35 11.1,36 0.109,37 15,38 90,39 137.323,40 153.59,41 84.586,42 81.336,44 5}
{0 CHEMBL306620,1 7.509,2 34,3 46,4 1.019,5 1.147,6 0.626,7 0.609,8 750.92,9 12,10 12,11 100,13 18,14 59,16 105,17 34,20 18,21 16,22 6,24 46,25 20,28 12,29 8,32 54,35 8,36 0.114,37 12,38 71,39 101.861,40 114.713,41 62.648,42 60.931,44 10}
{0 CHEMBL336844,1 8.477,2 36.2,3 43.1,4 1.02,5 1.13,6 0.676,7 0.644,8 491.65,9 8.6,10 12,11 58,13 18,14 34,16 59,17 21,20 16,21 5,22 6,24 25,25 12,26 2,28 5,29 5,31 2,32 33,35 8.6,36 0.203,37 12,38 46,39 59.134,40 65.531,41 39.21,42 37.323,44 4.678}
{0 CHEMBL341933,1 8.425,2 35.8,3 41.5,4 1.026,5 1.137,6 0.661,7 0.643,8 446.54,9 11.3,10 12,11 53,13 18,14 32,16 54,17 19,20 16,21 3,22 6,24 22,25 12,26 1,28 6,29 5,31 1,32 31,35 9.4,36 0.185,37 10,38 44,39 54.393,40 60.278,41 35.046,42 34.104,44 4.187}
{0 CHEMBL46809,1 7.066,2 34,3 49.1,4 1.008,5 1.147,6 0.623,7 0.595,8 749,9 11.3,10 12,11 106,13 18,14 58,16 110,17 36,20 18,21 18,22 6,24 52,25 18,28 12,29 6,32 54,35 5.7,36 0.109,37 12,38 70,39 106.857,40 121.54,41 66.023,42 63.082,44 10.155}
{0 CHEMBL567893,1 6.599,2 32.6,3 53.4,4 1.006,5 1.144,6 0.601,7 0.569,8 1174.62,9 5.1,10 6,11 178,13 17,14 84,16 179,17 58,20 17,21 41,22 11,24 95,25 25,28 9,29 16,32 83,35 9,36 0.201,37 36,38 98,39 179.148,40 203.689,41 107.064,42 101.282,44 5}
