"molecule_id","AMW","C.","pXC50"
{1 8.342,2 46.2,3 5}
{0 CHEMBL1161693,1 8.342,2 46.2,3 6.523}
{0 CHEMBL1161695,1 8.342,2 46.2,3 3.699}
{0 CHEMBL1161696,1 8.342,2 46.2,3 5.745}
{0 CHEMBL1161807,1 9.172,2 35.5,3 4.155}
{0 CHEMBL1161808,1 9.172,2 35.5,3 3.523}
{0 CHEMBL1439,1 9.385,2 31.3,3 5.572}
{0 CHEMBL166730,1 9.496,2 42.9,3 4.04}
{0 CHEMBL167311,1 9.19,2 43.6,3 4.125}
{0 CHEMBL167539,1 10.362,2 41.5,3 5.854}
{0 CHEMBL169016,1 9.391,2 34,3 5.947}
{0 CHEMBL169303,1 9.356,2 42.3,3 4.174}
{0 CHEMBL169392,1 9.522,2 41.5,3 6.523}
{0 CHEMBL169515,1 8.797,2 36.2,3 6.031}
{0 CHEMBL169550,1 9.867,2 42.9,3 5.051}
{0 CHEMBL171049,1 9.127,2 37.3,3 4.476}
{0 CHEMBL171999,1 9.904,2 42.1,3 4.509}
{0 CHEMBL172564,1 9.126,2 39.5,3 4.812}
{0 CHEMBL186,1 8.45,2 33.3,3 4.215}
{0 CHEMBL268632,1 9.46,2 40,3 4.458}
{0 CHEMBL268919,1 8.727,2 34.8,3 7.523}
{0 CHEMBL285387,1 9.071,2 33.3,3 6.585}
{0 CHEMBL29,1 8.157,2 39,3 4.921}
{0 CHEMBL292093,1 9.205,2 39.1,3 6.268}
{0 CHEMBL292147,1 10.235,2 33.3,3 4.605}
{0 CHEMBL292506,1 10.255,2 31.1,3 6.414}
{0 CHEMBL294203,1 9.057,2 38.1,3 6.18}
{0 CHEMBL294608,1 8.779,2 42.3,3 6.409}
{0 CHEMBL303053,1 9.046,2 40.7,3 7.404}
{0 CHEMBL304709,1 9.361,2 32.4,3 5.364}
{0 CHEMBL305361,1 9.488,2 37.5,3 6.706}
{0 CHEMBL316157,1 9.055,2 41.3,3 3.959}
{0 CHEMBL353004,1 9.522,2 41.5,3 4.003}
{0 CHEMBL353422,1 10.199,2 40.5,3 6.699}
{0 CHEMBL353613,1 9.625,2 41,3 7}
{0 CHEMBL353978,1 9.221,2 39.5,3 4.553}
{0 CHEMBL354754,1 9.581,2 42.9,3 5.222}
{0 CHEMBL354758,1 9.728,2 38.5,3 5.102}
{0 CHEMBL355165,1 9.306,2 45.5,3 5.367}
{0 CHEMBL355246,1 10.105,2 37.2,3 4.5}
{0 CHEMBL355558,1 9.927,2 44.4,3 6.143}
{0 CHEMBL355648,1 8.668,2 36.6,3 4.248}
{0 CHEMBL403,1 8.972,2 30.8,3 5.187}
{0 CHEMBL404,1 9.385,2 31.3,3 6.301}
{0 CHEMBL422212,1 9.225,2 43.1,3 4}
{0 CHEMBL433726,1 9.454,2 44.4,3 5.066}
{0 CHEMBL435467,1 9.037,2 40.5,3 4.13}
{0 CHEMBL44354,1 9.127,2 36.7,3 4.538}
{0 CHEMBL520642,1 9.218,2 34.5,3 4.108}
{0 CHEMBL59053,1 9.906,2 31.3,3 4.879}
{0 CHEMBL60220,1 10.197,2 37.5,3 4.664}
{0 CHEMBL60491,1 9.643,2 33.3,3 5.546}
{0 CHEMBL617,1 9.44,2 38.1,3 6}
{0 CHEMBL61760,1 10.1,2 33.3,3 5.735}
{0 CHEMBL61762,1 9.648,2 33.3,3 6.448}
{0 CHEMBL64056,1 9.266,2 33.3,3 5.294}
{0 CHEMBL6461,1 9.653,2 35.7,3 6.602}
{0 CHEMBL64793,1 10.605,2 33.3,3 5.143}
{0 CHEMBL777,1 8.66,2 34.8,3 7.097}
{0 CHEMBL83881,1 8.432,2 39.5,3 4.481}
{0 CHEMBL84001,1 8.271,2 37,3 2.301}
