{
  "data_features": {
    "feature": [
      {
        "data_type": "nominal",
        "index": "0",
        "is_ignore": "false",
        "is_row_identifier": "true",
        "is_target": "false",
        "name": "molecule_id",
        "nominal_value": [
          "CHEMBL10454",
          "CHEMBL1077203",
          "CHEMBL1082381",
          "CHEMBL1084238",
          "CHEMBL109239",
          "CHEMBL109246",
          "CHEMBL109596",
          "CHEMBL109706",
          "CHEMBL110153",
          "CHEMBL110527",
          "CHEMBL110696",
          "CHEMBL111104",
          "CHEMBL111736",
          "CHEMBL111798",
          "CHEMBL11306",
          "CHEMBL114878",
          "CHEMBL115189",
          "CHEMBL115263",
          "CHEMBL115653",
          "CHEMBL115727",
          "CHEMBL115774",
          "CHEMBL118744",
          "CHEMBL118848",
          "CHEMBL1229868",
          "CHEMBL1232074",
          "CHEMBL123320",
          "CHEMBL1233772",
          "CHEMBL1234370",
          "CHEMBL1234724",
          "CHEMBL123499",
          "CHEMBL123563",
          "CHEMBL123615",
          "CHEMBL123627",
          "CHEMBL123967",
          "CHEMBL124026",
          "CHEMBL124100",
          "CHEMBL124265",
          "CHEMBL124514",
          "CHEMBL124558",
          "CHEMBL124680",
          "CHEMBL124681",
          "CHEMBL125068",
          "CHEMBL125281",
          "CHEMBL125384",
          "CHEMBL125598",
          "CHEMBL125601",
          "CHEMBL125672",
          "CHEMBL125755",
          "CHEMBL126044",
          "CHEMBL126388",
          "CHEMBL127093",
          "CHEMBL1287851",
          "CHEMBL139886",
          "CHEMBL140004",
          "CHEMBL140152",
          "CHEMBL140511",
          "CHEMBL140568",
          "CHEMBL140569",
          "CHEMBL140575",
          "CHEMBL140720",
          "CHEMBL140788",
          "CHEMBL140970",
          "CHEMBL141080",
          "CHEMBL141451",
          "CHEMBL144176",
          "CHEMBL144313",
          "CHEMBL144430",
          "CHEMBL145175",
          "CHEMBL145641",
          "CHEMBL145930",
          "CHEMBL146256",
          "CHEMBL146718",
          "CHEMBL146951",
          "CHEMBL147004",
          "CHEMBL147005",
          "CHEMBL147107",
          "CHEMBL147261",
          "CHEMBL147489",
          "CHEMBL147494",
          "CHEMBL147561",
          "CHEMBL147629",
          "CHEMBL147738",
          "CHEMBL147804",
          "CHEMBL147844",
          "CHEMBL147881",
          "CHEMBL147882",
          "CHEMBL147903",
          "CHEMBL147910",
          "CHEMBL148081",
          "CHEMBL148136",
          "CHEMBL148169",
          "CHEMBL148171",
          "CHEMBL148178",
          "CHEMBL148212",
          "CHEMBL148213",
          "CHEMBL148214",
          "CHEMBL149977",
          "CHEMBL149983",
          "CHEMBL150027",
          "CHEMBL150077",
          "CHEMBL150242",
          "CHEMBL150342",
          "CHEMBL150483",
          "CHEMBL150745",
          "CHEMBL151024",
          "CHEMBL151133",
          "CHEMBL151235",
          "CHEMBL151331",
          "CHEMBL151399",
          "CHEMBL151539",
          "CHEMBL151591",
          "CHEMBL151718",
          "CHEMBL155874",
          "CHEMBL158521",
          "CHEMBL159433",
          "CHEMBL160153",
          "CHEMBL1632637",
          "CHEMBL1632638",
          "CHEMBL1632639",
          "CHEMBL1632640",
          "CHEMBL1632641",
          "CHEMBL1632642",
          "CHEMBL1651842",
          "CHEMBL1651846",
          "CHEMBL1651847",
          "CHEMBL1651848",
          "CHEMBL173075",
          "CHEMBL174641",
          "CHEMBL175282",
          "CHEMBL176467",
          "CHEMBL176517",
          "CHEMBL176602",
          "CHEMBL176832",
          "CHEMBL176876",
          "CHEMBL1770629",
          "CHEMBL1770649",
          "CHEMBL177077",
          "CHEMBL1770826",
          "CHEMBL1771212",
          "CHEMBL1771213",
          "CHEMBL1771215",
          "CHEMBL1771216",
          "CHEMBL1771217",
          "CHEMBL1771218",
          "CHEMBL1771219",
          "CHEMBL1771220",
          "CHEMBL1771221",
          "CHEMBL1771222",
          "CHEMBL1771223",
          "CHEMBL177740",
          "CHEMBL1779630",
          "CHEMBL1788203",
          "CHEMBL179288",
          "CHEMBL1801393",
          "CHEMBL1801424",
          "CHEMBL1801428",
          "CHEMBL1801430",
          "CHEMBL1801431",
          "CHEMBL181244",
          "CHEMBL187523",
          "CHEMBL1935291",
          "CHEMBL1939844",
          "CHEMBL1939876",
          "CHEMBL194377",
          "CHEMBL194430",
          "CHEMBL1956115",
          "CHEMBL19611",
          "CHEMBL198262",
          "CHEMBL199241",
          "CHEMBL199917",
          "CHEMBL200274",
          "CHEMBL202932",
          "CHEMBL204357",
          "CHEMBL2047536",
          "CHEMBL2047537",
          "CHEMBL2063273",
          "CHEMBL2063274",
          "CHEMBL207305",
          "CHEMBL208009",
          "CHEMBL2092878",
          "CHEMBL2111965",
          "CHEMBL2112796",
          "CHEMBL2115165",
          "CHEMBL2153737",
          "CHEMBL2153738",
          "CHEMBL227484",
          "CHEMBL227501",
          "CHEMBL227553",
          "CHEMBL227598",
          "CHEMBL227824",
          "CHEMBL228187",
          "CHEMBL228188",
          "CHEMBL228268",
          "CHEMBL228318",
          "CHEMBL228319",
          "CHEMBL228320",
          "CHEMBL229072",
          "CHEMBL2324201",
          "CHEMBL234034",
          "CHEMBL240464",
          "CHEMBL240465",
          "CHEMBL240648",
          "CHEMBL240652",
          "CHEMBL240653",
          "CHEMBL240654",
          "CHEMBL240852",
          "CHEMBL240854",
          "CHEMBL240855",
          "CHEMBL241048",
          "CHEMBL241051",
          "CHEMBL243236",
          "CHEMBL243874",
          "CHEMBL244883",
          "CHEMBL247140",
          "CHEMBL247141",
          "CHEMBL247346",
          "CHEMBL247347",
          "CHEMBL247348",
          "CHEMBL247545",
          "CHEMBL247546",
          "CHEMBL247742",
          "CHEMBL247743",
          "CHEMBL247946",
          "CHEMBL247947",
          "CHEMBL247966",
          "CHEMBL248148",
          "CHEMBL248172",
          "CHEMBL248173",
          "CHEMBL248323",
          "CHEMBL248523",
          "CHEMBL248524",
          "CHEMBL252100",
          "CHEMBL252101",
          "CHEMBL252102",
          "CHEMBL252508",
          "CHEMBL252509",
          "CHEMBL252711",
          "CHEMBL252893",
          "CHEMBL253275",
          "CHEMBL253680",
          "CHEMBL253979",
          "CHEMBL254184",
          "CHEMBL254185",
          "CHEMBL254389",
          "CHEMBL255160",
          "CHEMBL255418",
          "CHEMBL258055",
          "CHEMBL263501",
          "CHEMBL264495",
          "CHEMBL266292",
          "CHEMBL267603",
          "CHEMBL267939",
          "CHEMBL268114",
          "CHEMBL268377",
          "CHEMBL269019",
          "CHEMBL270817",
          "CHEMBL271235",
          "CHEMBL271450",
          "CHEMBL271938",
          "CHEMBL272102",
          "CHEMBL272512",
          "CHEMBL279785",
          "CHEMBL279786",
          "CHEMBL281795",
          "CHEMBL282146",
          "CHEMBL285112",
          "CHEMBL285418",
          "CHEMBL286904",
          "CHEMBL288649",
          "CHEMBL288896",
          "CHEMBL289513",
          "CHEMBL289842",
          "CHEMBL291133",
          "CHEMBL291994",
          "CHEMBL292313",
          "CHEMBL293003",
          "CHEMBL293019",
          "CHEMBL293382",
          "CHEMBL293411",
          "CHEMBL294066",
          "CHEMBL294405",
          "CHEMBL295871",
          "CHEMBL296196",
          "CHEMBL296874",
          "CHEMBL297453",
          "CHEMBL297749",
          "CHEMBL297792",
          "CHEMBL298033",
          "CHEMBL300375",
          "CHEMBL300771",
          "CHEMBL302227",
          "CHEMBL303286",
          "CHEMBL303298",
          "CHEMBL303756",
          "CHEMBL304221",
          "CHEMBL304243",
          "CHEMBL305160",
          "CHEMBL306674",
          "CHEMBL30782",
          "CHEMBL30804",
          "CHEMBL30980",
          "CHEMBL311004",
          "CHEMBL311097",
          "CHEMBL311266",
          "CHEMBL31164",
          "CHEMBL311932",
          "CHEMBL312100",
          "CHEMBL313340",
          "CHEMBL313386",
          "CHEMBL313472",
          "CHEMBL313896",
          "CHEMBL315114",
          "CHEMBL320045",
          "CHEMBL320782",
          "CHEMBL321180",
          "CHEMBL321556",
          "CHEMBL321602",
          "CHEMBL324664",
          "CHEMBL324874",
          "CHEMBL325163",
          "CHEMBL325552",
          "CHEMBL325940",
          "CHEMBL329617",
          "CHEMBL331095",
          "CHEMBL332134",
          "CHEMBL332302",
          "CHEMBL333586",
          "CHEMBL333729",
          "CHEMBL334107",
          "CHEMBL334909",
          "CHEMBL337594",
          "CHEMBL338007",
          "CHEMBL338077",
          "CHEMBL338223",
          "CHEMBL338453",
          "CHEMBL339219",
          "CHEMBL339903",
          "CHEMBL340923",
          "CHEMBL342102",
          "CHEMBL342172",
          "CHEMBL342210",
          "CHEMBL342548",
          "CHEMBL343082",
          "CHEMBL343220",
          "CHEMBL343414",
          "CHEMBL343653",
          "CHEMBL343855",
          "CHEMBL343860",
          "CHEMBL344453",
          "CHEMBL344545",
          "CHEMBL344633",
          "CHEMBL344634",
          "CHEMBL344714",
          "CHEMBL344778",
          "CHEMBL344828",
          "CHEMBL344999",
          "CHEMBL345054",
          "CHEMBL345200",
          "CHEMBL345597",
          "CHEMBL346442",
          "CHEMBL346624",
          "CHEMBL348210",
          "CHEMBL355752",
          "CHEMBL356011",
          "CHEMBL356079",
          "CHEMBL356471",
          "CHEMBL356504",
          "CHEMBL356520",
          "CHEMBL357050",
          "CHEMBL357728",
          "CHEMBL357796",
          "CHEMBL357934",
          "CHEMBL358061",
          "CHEMBL358064",
          "CHEMBL358182",
          "CHEMBL358405",
          "CHEMBL358539",
          "CHEMBL358812",
          "CHEMBL362651",
          "CHEMBL366956",
          "CHEMBL367524",
          "CHEMBL374377",
          "CHEMBL376557",
          "CHEMBL389594",
          "CHEMBL391288",
          "CHEMBL391376",
          "CHEMBL391388",
          "CHEMBL392231",
          "CHEMBL392232",
          "CHEMBL392837",
          "CHEMBL392867",
          "CHEMBL393443",
          "CHEMBL393944",
          "CHEMBL394084",
          "CHEMBL394294",
          "CHEMBL395877",
          "CHEMBL395878",
          "CHEMBL395880",
          "CHEMBL396296",
          "CHEMBL400143",
          "CHEMBL400540",
          "CHEMBL400590",
          "CHEMBL40143",
          "CHEMBL402118",
          "CHEMBL40237",
          "CHEMBL402393",
          "CHEMBL402436",
          "CHEMBL402636",
          "CHEMBL402745",
          "CHEMBL402747",
          "CHEMBL403186",
          "CHEMBL40351",
          "CHEMBL403539",
          "CHEMBL403777",
          "CHEMBL403778",
          "CHEMBL404019",
          "CHEMBL40589",
          "CHEMBL409536",
          "CHEMBL411851",
          "CHEMBL41497",
          "CHEMBL415482",
          "CHEMBL418291",
          "CHEMBL418292",
          "CHEMBL418442",
          "CHEMBL418472",
          "CHEMBL418639",
          "CHEMBL419011",
          "CHEMBL41943",
          "CHEMBL419430",
          "CHEMBL419607",
          "CHEMBL42067",
          "CHEMBL42114",
          "CHEMBL421644",
          "CHEMBL421766",
          "CHEMBL421932",
          "CHEMBL421966",
          "CHEMBL422848",
          "CHEMBL423015",
          "CHEMBL42311",
          "CHEMBL424130",
          "CHEMBL42420",
          "CHEMBL424311",
          "CHEMBL425020",
          "CHEMBL427366",
          "CHEMBL427616",
          "CHEMBL427861",
          "CHEMBL428212",
          "CHEMBL429112",
          "CHEMBL42938",
          "CHEMBL429674",
          "CHEMBL430524",
          "CHEMBL43063",
          "CHEMBL43113",
          "CHEMBL431210",
          "CHEMBL43147",
          "CHEMBL43152",
          "CHEMBL431680",
          "CHEMBL43206",
          "CHEMBL432079",
          "CHEMBL432307",
          "CHEMBL432397",
          "CHEMBL43276",
          "CHEMBL432882",
          "CHEMBL432991",
          "CHEMBL433063",
          "CHEMBL433250",
          "CHEMBL433262",
          "CHEMBL43403",
          "CHEMBL434505",
          "CHEMBL434567",
          "CHEMBL43479",
          "CHEMBL435206",
          "CHEMBL436205",
          "CHEMBL43644",
          "CHEMBL437019",
          "CHEMBL438125",
          "CHEMBL440048",
          "CHEMBL440178",
          "CHEMBL440355",
          "CHEMBL440498",
          "CHEMBL44062",
          "CHEMBL440921",
          "CHEMBL441662",
          "CHEMBL442431",
          "CHEMBL44383",
          "CHEMBL44455",
          "CHEMBL447787",
          "CHEMBL44898",
          "CHEMBL45040",
          "CHEMBL452083",
          "CHEMBL45483",
          "CHEMBL45631",
          "CHEMBL460725",
          "CHEMBL460899",
          "CHEMBL466059",
          "CHEMBL46818",
          "CHEMBL46830",
          "CHEMBL47076",
          "CHEMBL47254",
          "CHEMBL483857",
          "CHEMBL484261",
          "CHEMBL485492",
          "CHEMBL488617",
          "CHEMBL493985",
          "CHEMBL494615",
          "CHEMBL494643",
          "CHEMBL494644",
          "CHEMBL496093",
          "CHEMBL496702",
          "CHEMBL496715",
          "CHEMBL496716",
          "CHEMBL496717",
          "CHEMBL496921",
          "CHEMBL496942",
          "CHEMBL497761",
          "CHEMBL497762",
          "CHEMBL497772",
          "CHEMBL497961",
          "CHEMBL497962",
          "CHEMBL497985",
          "CHEMBL498915",
          "CHEMBL507420",
          "CHEMBL508335",
          "CHEMBL514138",
          "CHEMBL521689",
          "CHEMBL521881",
          "CHEMBL522573",
          "CHEMBL523034",
          "CHEMBL526460",
          "CHEMBL538862",
          "CHEMBL539683",
          "CHEMBL550038",
          "CHEMBL551312",
          "CHEMBL551313",
          "CHEMBL556277",
          "CHEMBL556692",
          "CHEMBL559294",
          "CHEMBL562716",
          "CHEMBL567893",
          "CHEMBL572982",
          "CHEMBL58553",
          "CHEMBL58834",
          "CHEMBL58945",
          "CHEMBL590343",
          "CHEMBL59104",
          "CHEMBL591774",
          "CHEMBL59248",
          "CHEMBL59337",
          "CHEMBL59472",
          "CHEMBL59684",
          "CHEMBL60179",
          "CHEMBL602949",
          "CHEMBL603656",
          "CHEMBL605201",
          "CHEMBL60546",
          "CHEMBL60567",
          "CHEMBL605764",
          "CHEMBL61017",
          "CHEMBL61354",
          "CHEMBL61577",
          "CHEMBL62007",
          "CHEMBL62056",
          "CHEMBL62089",
          "CHEMBL62245",
          "CHEMBL64013",
          "CHEMBL65159",
          "CHEMBL66134",
          "CHEMBL66532",
          "CHEMBL69726",
          "CHEMBL6973",
          "CHEMBL7108",
          "CHEMBL71120",
          "CHEMBL71573",
          "CHEMBL7390",
          "CHEMBL75094",
          "CHEMBL77258",
          "CHEMBL7756",
          "CHEMBL78001",
          "CHEMBL79267",
          "CHEMBL79433",
          "CHEMBL79906",
          "CHEMBL82113",
          "CHEMBL82169",
          "CHEMBL83282",
          "CHEMBL83368",
          "CHEMBL83616",
          "CHEMBL83955",
          "CHEMBL84969",
          "CHEMBL85026",
          "CHEMBL85374",
          "CHEMBL85744",
          "CHEMBL87786",
          "CHEMBL88187",
          "CHEMBL88520",
          "CHEMBL89057",
          "CHEMBL91636"
        ],
        "number_of_missing_values": "0"
      },
      {
        "data_type": "numeric",
        "index": "1",
        "is_ignore": "false",
        "is_row_identifier": "false",
        "is_target": "false",
        "name": "FCFP4_1024b948",
        "number_of_missing_values": "0"
      },
      {
        "data_type": "numeric",
        "index": "2",
        "is_ignore": "false",
        "is_row_identifier": "false",
        "is_target": "false",
        "name": "FCFP4_1024b389",
        "number_of_missing_values": "0"
      },
      {
        "data_type": "numeric",
        "index": "3",
        "is_ignore": "false",
        "is_row_identifier": "false",
        "is_target": "false",
        "name": "FCFP4_1024b652",
        "number_of_missing_values": "0"
      },
      {
        "data_type": "numeric",
        "index": "4",
        "is_ignore": "false",
        "is_row_identifier": "false",
        "is_target": "false",
        "name": "FCFP4_1024b623",
        "number_of_missing_values": "0"
      },
      {
        "data_type": "numeric",
        "index": "5",
        "is_ignore": "false",
        "is_row_identifier": "false",
        "is_target": "false",
        "name": "FCFP4_1024b542",
        "number_of_missing_values": "0"
      },
      {
        "data_type": "numeric",
        "index": "6",
        "is_ignore": "false",
        "is_row_identifier": "false",
        "is_target": "false",
        "name": "FCFP4_1024b650",
        "number_of_missing_values": "0"
      },
      {
        "data_type": "numeric",
        "index": "7",
        "is_ignore": "false",
        "is_row_identifier": "false",
        "is_target": "false",
        "name": "FCFP4_1024b162",
        "number_of_missing_values": "0"
      },
      {
        "data_type": "numeric",
        "index": "8",
        "is_ignore": "false",
        "is_row_identifier": "false",
        "is_target": "false",
        "name": "FCFP4_1024b746",
        "number_of_missing_values": "0"
      },
      {
        "data_type": "numeric",
        "index": "9",
        "is_ignore": "false",
        "is_row_identifier": "false",
        "is_target": "false",
        "name": "FCFP4_1024b71",
        "number_of_missing_values": "0"
      },
      {
        "data_type": "numeric",
        "index": "10",
        "is_ignore": "false",
        "is_row_identifier": "false",
        "is_target": "false",
        "name": "FCFP4_1024b600",
        "number_of_missing_values": "0"
      },
      {
        "data_type": "numeric",
        "index": "11",
        "is_ignore": "false",
        "is_row_identifier": "false",
        "is_target": "false",
        "name": "FCFP4_1024b781",
        "number_of_missing_values": "0"
      },
      {
        "data_type": "numeric",
        "index": "12",
        "is_ignore": "false",
        "is_row_identifier": "false",
        "is_target": "false",
        "name": "FCFP4_1024b385",
        "number_of_missing_values": "0"
      },
      {
        "data_type": "numeric",
        "index": "13",
        "is_ignore": "false",
        "is_row_identifier": "false",
        "is_target": "false",
        "name": "FCFP4_1024b645",
        "number_of_missing_values": "0"
      },
      {
        "data_type": "numeric",
        "index": "14",
        "is_ignore": "false",
        "is_row_identifier": "false",
        "is_target": "false",
        "name": "FCFP4_1024b89",
        "number_of_missing_values": "0"
      },
      {
        "data_type": "numeric",
        "index": "15",
        "is_ignore": "false",
        "is_row_identifier": "false",
        "is_target": "false",
        "name": "FCFP4_1024b680",
        "number_of_missing_values": "0"
      },
      {
        "data_type": "numeric",
        "index": "16",
        "is_ignore": "false",
        "is_row_identifier": "false",
        "is_target": "false",
        "name": "FCFP4_1024b380",
        "number_of_missing_values": "0"
      },
      {
        "data_type": "numeric",
        "index": "17",
        "is_ignore": "false",
        "is_row_identifier": "false",
        "is_target": "false",
        "name": "FCFP4_1024b300",
        "number_of_missing_values": "0"
      },
      {
        "data_type": "numeric",
        "index": "18",
        "is_ignore": "false",
        "is_row_identifier": "false",
        "is_target": "false",
        "name": "FCFP4_1024b799",
        "number_of_missing_values": "0"
      },
      {
        "data_type": "numeric",
        "index": "19",
        "is_ignore": "false",
        "is_row_identifier": "false",
        "is_target": "false",
        "name": "FCFP4_1024b817",
        "number_of_missing_values": "0"
      },
      {
        "data_type": "numeric",
        "index": "20",
        "is_ignore": "false",
        "is_row_identifier": "false",
        "is_target": "false",
        "name": "FCFP4_1024b455",
        "number_of_missing_values": "0"
      },
      {
        "data_type": "numeric",
        "index": "21",
        "is_ignore": "false",
        "is_row_identifier": "false",
        "is_target": "false",
        "name": "FCFP4_1024b826",
        "number_of_missing_values": "0"
      },
      {
        "data_type": "numeric",
        "index": "22",
        "is_ignore": "false",
        "is_row_identifier": "false",
        "is_target": "false",
        "name": "FCFP4_1024b173",
        "number_of_missing_values": "0"
      },
      {
        "data_type": "numeric",
        "index": "23",
        "is_ignore": "false",
        "is_row_identifier": "false",
        "is_target": "false",
        "name": "FCFP4_1024b540",
        "number_of_missing_values": "0"
      },
      {
        "data_type": "numeric",
        "index": "24",
        "is_ignore": "false",
        "is_row_identifier": "false",
        "is_target": "false",
        "name": "FCFP4_1024b32",
        "number_of_missing_values": "0"
      },
      {
        "data_type": "numeric",
        "index": "25",
        "is_ignore": "false",
        "is_row_identifier": "false",
        "is_target": "false",
        "name": "FCFP4_1024b632",
        "number_of_missing_values": "0"
      },
      {
        "data_type": "numeric",
        "index": "26",
        "is_ignore": "false",
        "is_row_identifier": "false",
        "is_target": "false",
        "name": "FCFP4_1024b769",
        "number_of_missing_values": "0"
      },
      {
        "data_type": "numeric",
        "index": "27",
        "is_ignore": "false",
        "is_row_identifier": "false",
        "is_target": "false",
        "name": "FCFP4_1024b351",
        "number_of_missing_values": "0"
      },
      {
        "data_type": "numeric",
        "index": "28",
        "is_ignore": "false",
        "is_row_identifier": "false",
        "is_target": "false",
        "name": "FCFP4_1024b821",
        "number_of_missing_values": "0"
      },
      {
        "data_type": "numeric",
        "index": "29",
        "is_ignore": "false",
        "is_row_identifier": "false",
        "is_target": "false",
        "name": "FCFP4_1024b8",
        "number_of_missing_values": "0"
      },
      {
        "data_type": "numeric",
        "index": "30",
        "is_ignore": "false",
        "is_row_identifier": "false",
        "is_target": "false",
        "name": "FCFP4_1024b794",
        "number_of_missing_values": "0"
      },
      {
        "data_type": "numeric",
        "index": "31",
        "is_ignore": "false",
        "is_row_identifier": "false",
        "is_target": "false",
        "name": "FCFP4_1024b983",
        "number_of_missing_values": "0"
      },
      {
        "data_type": "numeric",
        "index": "32",
        "is_ignore": "false",
        "is_row_identifier": "false",
        "is_target": "false",
        "name": "FCFP4_1024b209",
        "number_of_missing_values": "0"
      },
      {
        "data_type": "numeric",
        "index": "33",
        "is_ignore": "false",
        "is_row_identifier": "false",
        "is_target": "false",
        "name": "FCFP4_1024b395",
        "number_of_missing_values": "0"
      },
      {
        "data_type": "numeric",
        "index": "34",
        "is_ignore": "false",
        "is_row_identifier": "false",
        "is_target": "false",
        "name": "FCFP4_1024b365",
        "number_of_missing_values": "0"
      },
      {
        "data_type": "numeric",
        "index": "35",
        "is_ignore": "false",
        "is_row_identifier": "false",
        "is_target": "false",
        "name": "FCFP4_1024b969",
        "number_of_missing_values": "0"
      },
      {
        "data_type": "numeric",
        "index": "36",
        "is_ignore": "false",
        "is_row_identifier": "false",
        "is_target": "false",
        "name": "FCFP4_1024b152",
        "number_of_missing_values": "0"
      },
      {
        "data_type": "numeric",
        "index": "37",
        "is_ignore": "false",
        "is_row_identifier": "false",
        "is_target": "false",
        "name": "FCFP4_1024b1000",
        "number_of_missing_values": "0"
      },
      {
        "data_type": "numeric",
        "index": "38",
        "is_ignore": "false",
        "is_row_identifier": "false",
        "is_target": "false",
        "name": "FCFP4_1024b451",
        "number_of_missing_values": "0"
      },
      {
        "data_type": "numeric",
        "index": "39",
        "is_ignore": "false",
        "is_row_identifier": "false",
        "is_target": "false",
        "name": "FCFP4_1024b155",
        "number_of_missing_values": "0"
      },
      {
        "data_type": "numeric",
        "index": "40",
        "is_ignore": "false",
        "is_row_identifier": "false",
        "is_target": "false",
        "name": "FCFP4_1024b248",
        "number_of_missing_values": "0"
      },
      {
        "data_type": "numeric",
        "index": "41",
        "is_ignore": "false",
        "is_row_identifier": "false",
        "is_target": "false",
        "name": "FCFP4_1024b625",
        "number_of_missing_values": "0"
      },
      {
        "data_type": "numeric",
        "index": "42",
        "is_ignore": "false",
        "is_row_identifier": "false",
        "is_target": "false",
        "name": "FCFP4_1024b20",
        "number_of_missing_values": "0"
      },
      {
        "data_type": "numeric",
        "index": "43",
        "is_ignore": "false",
        "is_row_identifier": "false",
        "is_target": "false",
        "name": "FCFP4_1024b581",
        "number_of_missing_values": "0"
      },
      {
        "data_type": "numeric",
        "index": "44",
        "is_ignore": "false",
        "is_row_identifier": "false",
        "is_target": "false",
        "name": "FCFP4_1024b521",
        "number_of_missing_values": "0"
      },
      {
        "data_type": "numeric",
        "index": "45",
        "is_ignore": "false",
        "is_row_identifier": "false",
        "is_target": "false",
        "name": "FCFP4_1024b436",
        "number_of_missing_values": "0"
      },
      {
        "data_type": "numeric",
        "index": "46",
        "is_ignore": "false",
        "is_row_identifier": "false",
        "is_target": "false",
        "name": "FCFP4_1024b431",
        "number_of_missing_values": "0"
      },
      {
        "data_type": "numeric",
        "index": "47",
        "is_ignore": "false",
        "is_row_identifier": "false",
        "is_target": "false",
        "name": "FCFP4_1024b844",
        "number_of_missing_values": "0"
      },
      {
        "data_type": "numeric",
        "index": "48",
        "is_ignore": "false",
        "is_row_identifier": "false",
        "is_target": "false",
        "name": "FCFP4_1024b4",
        "number_of_missing_values": "0"
      },
      {
        "data_type": "numeric",
        "index": "49",
        "is_ignore": "false",
        "is_row_identifier": "false",
        "is_target": "false",
        "name": "FCFP4_1024b187",
        "number_of_missing_values": "0"
      },
      {
        "data_type": "numeric",
        "index": "50",
        "is_ignore": "false",
        "is_row_identifier": "false",
        "is_target": "false",
        "name": "FCFP4_1024b429",
        "number_of_missing_values": "0"
      },
      {
        "data_type": "numeric",
        "index": "51",
        "is_ignore": "false",
        "is_row_identifier": "false",
        "is_target": "false",
        "name": "FCFP4_1024b847",
        "number_of_missing_values": "0"
      },
      {
        "data_type": "numeric",
        "index": "52",
        "is_ignore": "false",
        "is_row_identifier": "false",
        "is_target": "true",
        "name": "pXC50",
        "number_of_missing_values": "0"
      }
    ]
  }
}