"molecule_id","AECC","IDE","MCD","PW5","TIC1","AAC","ALOGP","ALOGP2","AMR","AMW","ARR","ATS1e","ATS1i","ATS1m","ATS1p","ATS1s","ATS1v","ATS2e","ATS2i","ATS2m","ATS2p","ATS2s","ATS2v","ATS3e","ATS3i","ATS3m","ATS3p","ATS3s","ATS3v","ATS4e","ATS4i","ATS4m","ATS4p","ATS4s","ATS4v","ATS5e","ATS5i","ATS5m","ATS5p","ATS5s","ATS5v","ATS6e","ATS6i","ATS6m","ATS6p","ATS6s","ATS6v","ATS7e","ATS7i","ATS7m","ATS7p","ATS7s","ATS7v","ATS8e","pXC50"
{1 10.367,2 3.506,3 0.367,4 0.096,5 210.163,6 1.523,7 7.128,8 50.804,9 121.038,10 7.493,11 0.355,12 4.112,13 4.217,14 3.694,15 3.694,16 5.24,17 3.633,18 4.653,19 4.827,20 4.077,21 4.07,22 5.958,23 3.99,24 4.858,25 5.029,26 4.082,27 4.231,28 6,29 4.122,30 5.029,31 5.253,32 4.196,33 4.337,34 5.99,35 4.217,36 5.091,37 5.272,38 4.331,39 4.421,40 6.137,41 4.315,42 5.153,43 5.33,44 4.37,45 4.527,46 6.206,47 4.388,48 5.38,49 5.628,50 4.39,51 4.529,52 6.45,53 4.353,54 5.329,55 5.248}
{0 CHEMBL129976,1 10.818,2 3.53,3 0.364,4 0.096,5 227.609,6 1.295,7 7.582,8 57.49,9 136.132,10 6.467,11 0.353,12 4.276,13 4.398,14 3.69,15 3.829,16 5.338,17 3.765,18 4.825,19 5.022,20 4.056,21 4.222,22 5.882,23 4.139,24 5.087,25 5.272,26 4.153,27 4.451,28 6.074,29 4.334,30 5.339,31 5.601,32 4.242,33 4.532,34 6.245,35 4.396,36 5.279,37 5.486,38 4.313,39 4.587,40 6.214,41 4.479,42 5.34,43 5.522,44 4.427,45 4.739,46 6.271,47 4.616,48 5.632,49 5.863,50 4.385,51 4.861,52 6.528,53 4.684,54 5.789,55 5}
{0 CHEMBL130230,1 10.355,2 3.504,3 0.387,4 0.1,5 207.788,6 1.403,7 7.22,8 52.127,9 122.277,10 7.026,11 0.375,12 4.155,13 4.268,14 3.639,15 3.705,16 5.283,17 3.663,18 4.695,19 4.875,20 3.995,21 4.069,22 5.988,23 4.006,24 4.924,25 5.116,26 4.071,27 4.26,28 6.042,29 4.167,30 5.042,31 5.258,32 4.137,33 4.353,34 6.018,35 4.249,36 5.143,37 5.341,38 4.238,39 4.442,40 6.17,41 4.351,42 5.221,43 5.411,44 4.331,45 4.541,46 6.275,47 4.439,48 5.435,49 5.677,50 4.283,51 4.576,52 6.503,53 4.441,54 5.467,55 6}
{0 CHEMBL130577,1 10.438,2 3.52,3 0.375,4 0.096,5 216.683,6 1.57,7 6.564,8 43.081,9 121.01,10 7.459,11 0.364,12 4.154,13 4.264,14 3.684,15 3.676,16 5.329,17 3.654,18 4.701,19 4.877,20 4.107,21 4.036,22 6.258,23 4.002,24 4.913,25 5.097,26 4.111,27 4.231,28 6.126,29 4.155,30 5.031,31 5.244,32 4.166,33 4.325,34 6.049,35 4.235,36 5.139,37 5.336,38 4.287,39 4.408,40 6.227,41 4.337,42 5.206,43 5.389,44 4.413,45 4.498,46 6.358,47 4.429,48 5.436,49 5.674,50 4.396,51 4.515,52 6.636,53 4.427,54 5.458,55 5}
{0 CHEMBL131561,1 10.767,2 3.54,3 0.367,4 0.096,5 214.572,6 1.432,7 7.123,8 50.74,9 126.016,10 7.06,11 0.355,12 4.15,13 4.261,14 3.686,15 3.738,16 5.227,17 3.663,18 4.689,19 4.873,20 4.016,21 4.11,22 5.776,23 4.005,24 4.905,25 5.104,26 4.056,27 4.251,28 5.882,29 4.131,30 5.04,31 5.255,32 4.186,33 4.346,34 6.044,35 4.223,36 5.092,37 5.284,38 4.282,39 4.443,40 6.052,41 4.316,42 5.152,43 5.337,44 4.316,45 4.562,46 6.065,47 4.403,48 5.375,49 5.61,50 4.32,51 4.615,52 6.265,53 4.408,54 5.403,55 5.467}
{0 CHEMBL132488,1 10.452,2 3.528,3 0.355,4 0.091,5 211.136,6 1.583,7 7.668,8 58.792,9 122.001,10 7.803,11 0.344,12 4.12,13 4.222,14 3.731,15 3.692,16 5.276,17 3.643,18 4.672,19 4.837,20 4.165,21 4.061,22 6.23,23 3.996,24 4.868,25 5.047,26 4.112,27 4.209,28 6.077,29 4.111,30 4.979,31 5.184,32 4.201,33 4.319,34 5.991,35 4.208,36 5.09,37 5.276,38 4.354,39 4.411,40 6.163,41 4.311,42 5.148,43 5.323,44 4.451,45 4.504,46 6.287,47 4.394,48 5.367,49 5.591,50 4.466,51 4.519,52 6.558,53 4.38,54 5.355,55 5.463}
{0 CHEMBL133176,1 10.276,2 3.487,3 0.379,4 0.1,5 201.518,6 1.206,7 7.506,8 56.342,9 123.534,10 6.102,11 0.2,12 4.198,13 4.325,14 3.566,15 3.745,16 5.184,17 3.67,18 4.764,19 4.97,20 3.898,21 4.133,22 5.73,23 4.026,24 5.009,25 5.233,26 3.976,27 4.3,28 5.874,29 4.168,30 5.114,31 5.348,32 4.081,33 4.374,34 5.981,35 4.248,36 5.186,37 5.396,38 4.143,39 4.471,40 6.067,41 4.347,42 5.27,43 5.477,44 4.17,45 4.595,46 6.076,47 4.441,48 5.506,49 5.767,50 4.055,51 4.671,52 6.225,53 4.455,54 5.605,55 5.854}
{0 CHEMBL288436,1 9.481,2 3.379,3 0.704,4 0.102,5 175.56,6 1.291,7 5.689,8 32.361,9 107.817,10 6.492,11 0.4,12 4.088,13 4.209,14 3.54,15 3.689,16 5.081,17 3.625,18 4.658,19 4.848,20 3.963,21 4.137,22 5.63,23 4.052,24 4.967,25 5.146,26 4.134,27 4.41,28 5.906,29 4.298,30 5.266,31 5.518,32 4.088,33 4.506,34 6.126,35 4.341,36 5.236,37 5.509,38 3.936,39 4.441,40 5.959,41 4.25,42 5.119,43 5.384,44 3.82,45 4.344,46 5.822,47 4.15,48 5.171,49 5.467,50 3.771,51 4.261,52 5.889,53 4.057,54 5.061,55 6}
{0 CHEMBL335751,1 10.767,2 3.54,3 0.367,4 0.096,5 214.572,6 1.379,7 6.565,8 43.099,9 119.573,10 6.796,11 0.355,12 4.158,13 4.27,14 3.617,15 3.68,16 5.259,17 3.638,18 4.699,19 4.883,20 3.939,21 4.041,22 5.808,23 3.977,24 4.912,25 5.111,26 4.01,27 4.198,28 5.913,29 4.109,30 5.051,31 5.265,32 4.128,33 4.283,34 6.082,35 4.193,36 5.088,37 5.279,38 4.173,39 4.365,40 6.077,41 4.279,42 5.172,43 5.355,44 4.227,45 4.46,46 6.138,47 4.358,48 5.387,49 5.618,50 4.138,51 4.502,52 6.32,53 4.358,54 5.379,55 5.435}
{0 CHEMBL335762,1 10.939,2 3.569,3 0.333,4 0.086,5 231.546,6 1.467,7 7.841,8 61.486,9 134.513,10 7.115,11 0.324,12 4.244,13 4.358,14 3.778,15 3.817,16 5.333,17 3.747,18 4.803,19 4.989,20 4.182,21 4.215,22 6.037,23 4.128,24 5.039,25 5.213,26 4.183,27 4.41,28 6.074,29 4.289,30 5.298,31 5.553,32 4.31,33 4.504,34 6.275,35 4.363,36 5.23,37 5.43,38 4.403,39 4.561,40 6.183,41 4.44,42 5.27,43 5.441,44 4.504,45 4.71,46 6.234,47 4.571,48 5.569,49 5.788,50 4.564,51 4.826,52 6.526,53 4.633,54 5.705,55 5.267}
{0 CHEMBL336086,1 10.767,2 3.54,3 0.367,4 0.096,5 211.453,6 1.307,7 7.097,8 50.362,9 123.727,10 6.379,11 0.194,12 4.205,13 4.329,14 3.608,15 3.744,16 5.229,17 3.68,18 4.777,19 4.978,20 3.932,21 4.131,22 5.801,23 4.036,24 5.019,25 5.239,26 4.009,27 4.299,28 5.933,29 4.177,30 5.124,31 5.354,32 4.118,33 4.373,34 6.072,35 4.255,36 5.189,37 5.398,38 4.166,39 4.47,40 6.09,41 4.352,42 5.275,43 5.48,44 4.215,45 4.594,46 6.121,47 4.45,48 5.514,49 5.772,50 4.154,51 4.669,52 6.307,53 4.473,54 5.619,55 5.605}
{0 CHEMBL337719,1 10.452,2 3.528,3 0.355,4 0.091,5 211.189,6 1.451,7 7.641,8 58.385,9 119.712,10 7.041,11 0.188,12 4.177,13 4.293,14 3.656,15 3.698,16 5.278,17 3.661,18 4.76,19 4.945,20 4.093,21 4.083,22 6.246,23 4.027,24 4.986,25 5.19,26 4.067,27 4.259,28 6.12,29 4.157,30 5.068,31 5.29,32 4.133,33 4.346,34 6.02,35 4.24,36 5.187,37 5.391,38 4.247,39 4.439,40 6.197,41 4.347,42 5.271,43 5.467,44 4.363,45 4.538,46 6.332,47 4.442,48 5.507,49 5.755,50 4.324,51 4.578,52 6.576,53 4.446,54 5.586,55 5.056}
{0 CHEMBL339298,1 10.767,2 3.536,3 0.367,4 0.097,5 216.572,6 1.432,7 7.078,8 50.092,9 125.943,10 7.06,11 0.355,12 4.15,13 4.261,14 3.686,15 3.738,16 5.228,17 3.663,18 4.69,19 4.874,20 4.031,21 4.116,22 5.779,23 4.015,24 4.907,25 5.095,26 4.064,27 4.271,28 5.898,29 4.15,30 5.091,31 5.321,32 4.205,33 4.364,34 6.069,35 4.237,36 5.099,37 5.283,38 4.299,39 4.451,40 6.076,41 4.33,42 5.169,43 5.351,44 4.307,45 4.581,46 6.082,47 4.415,48 5.406,49 5.658,50 4.315,51 4.625,52 6.263,53 4.409,54 5.391,55 5}
{0 CHEMBL340074,1 10.367,2 3.512,3 0.367,4 0.095,5 207.829,6 1.392,7 7.147,8 51.075,9 118.822,10 6.751,11 0.194,12 4.169,13 4.288,14 3.617,15 3.7,16 5.241,17 3.651,18 4.743,19 4.935,20 3.983,21 4.085,22 5.976,23 4.011,24 4.975,25 5.183,26 4.028,27 4.26,28 6.031,29 4.15,30 5.064,31 5.288,32 4.109,33 4.347,34 5.992,35 4.234,36 5.181,37 5.388,38 4.203,39 4.44,40 6.15,41 4.337,42 5.26,43 5.461,44 4.284,45 4.541,46 6.243,47 4.424,48 5.491,49 5.746,50 4.214,51 4.582,52 6.455,53 4.42,54 5.564,55 5.429}
{0 CHEMBL340555,1 10.367,2 3.512,3 0.367,4 0.095,5 208.163,6 1.523,7 7.173,8 51.456,9 121.111,10 7.493,11 0.355,12 4.112,13 4.217,14 3.694,15 3.694,16 5.238,17 3.633,18 4.653,19 4.826,20 4.063,21 4.063,22 5.955,23 3.98,24 4.855,25 5.039,26 4.074,27 4.21,28 5.985,29 4.103,30 4.975,31 5.182,32 4.178,33 4.319,34 5.962,35 4.202,36 5.084,37 5.273,38 4.314,39 4.413,40 6.114,41 4.301,42 5.136,43 5.316,44 4.379,45 4.507,46 6.194,47 4.375,48 5.348,49 5.58,50 4.371,51 4.523,52 6.43,53 4.351,54 5.329,55 5.59}
{0 CHEMBL42314,1 10.633,2 3.542,3 0.2,4 0.086,5 204.598,6 1.378,7 7.028,8 49.394,9 120.692,10 6.572,11 0.2,12 4.183,13 4.307,14 3.594,15 3.694,16 5.279,17 3.638,18 4.741,19 4.945,20 3.991,21 4.072,22 5.987,23 4.003,24 4.975,25 5.149,26 4.052,27 4.316,28 6.097,29 4.202,30 5.249,31 5.519,32 4.109,33 4.415,34 6.122,35 4.27,36 5.224,37 5.445,38 4.168,39 4.44,40 6.191,41 4.328,42 5.241,43 5.436,44 4.288,45 4.546,46 6.277,47 4.427,48 5.54,49 5.79,50 4.137,51 4.594,52 6.578,53 4.406,54 5.674,55 5.561}
{0 CHEMBL445634,1 10.742,2 3.531,3 0.387,4 0.101,5 214.409,6 1.319,7 7.17,8 51.406,9 127.182,10 6.634,11 0.375,12 4.192,13 4.311,14 3.63,15 3.749,16 5.272,17 3.692,18 4.73,19 4.919,20 3.945,21 4.115,22 5.815,23 4.031,24 4.971,25 5.176,26 4.052,27 4.299,28 5.945,29 4.193,30 5.103,31 5.325,32 4.146,33 4.379,34 6.096,35 4.269,36 5.152,37 5.351,38 4.202,39 4.471,40 6.112,41 4.365,42 5.236,43 5.43,44 4.266,45 4.594,46 6.157,47 4.465,48 5.46,49 5.704,50 4.227,51 4.664,52 6.351,53 4.493,54 5.532,55 5.125}
