{
  "data_set_description": {
    "collection_date": "November 2013",
    "creator": "Dr Jeremy Besnard, Dr Ivan Olier, Dr Noureddin Sadawi, Dr Larisa Soldatova, Dr Crina Grosan, Prof Ross King, Dr Richard Bickerton, Prof Andrew Hopkins and Dr Willem van Hoorn",
    "default_target_attribute": "pXC50",
    "description": "This dataset contains QSAR data (from ChEMBL version 17) showing activity values (unit is pseudo-pCI50) of several compounds on drug target ChEMBL_ID: CHEMBL2558 (TID: 11150), and it has 84 rows and 1306 features (not including molecule IDs and class feature: molecule_id and pXC50). The features represent Molecular Descriptors which were generated from SMILES strings. Missing value imputation was applied to this dataset (By choosing the Median).",
    "description_version": "1",
    "file_id": "3590507",
    "format": "ARFF",
    "id": "36543",
    "licence": "Public",
    "md5_checksum": "9fc11f0885cfe10ba1ba2fdea882dcbd",
    "minio_url": "https://data.openml.org/datasets/0003/36543/dataset_36543.pq",
    "name": "QSAR-DATASET-FOR-DRUG-TARGET-CHEMBL2558",
    "original_data_url": "https://www.ebi.ac.uk/chembl/target/inspect/CHEMBL2558",
    "parquet_url": "https://data.openml.org/datasets/0003/36543/dataset_36543.pq",
    "processing_date": "2018-10-04 04:51:09",
    "row_id_attribute": "molecule_id",
    "status": "deactivated",
    "tag": [
      "MetaQSAR",
      "study_13"
    ],
    "upload_date": "2016-07-15T21:34:33",
    "url": "https://api.openml.org/data/v1/download/3590507/QSAR-DATASET-FOR-DRUG-TARGET-CHEMBL2558.arff",
    "version": "10",
    "visibility": "public"
  }
}