"molecule_id","AAC","AECC","ALOGP","ALOGP2","AMR","AMW","ARR","ATS1e","ATS1i","ATS1m","ATS1p","ATS1s","ATS1v","ATS2e","ATS2i","ATS2m","ATS2p","ATS2s","ATS2v","ATS3e","ATS3i","ATS3m","ATS3p","ATS3s","ATS3v","ATS4e","ATS4i","ATS4m","ATS4p","ATS4s","ATS4v","ATS5e","ATS5i","ATS5m","ATS5p","ATS5s","ATS5v","ATS6e","ATS6i","ATS6m","ATS6p","ATS6s","ATS6v","ATS7e","ATS7i","ATS7m","ATS7p","ATS7s","ATS7v","ATS8e","ATS8i","ATS8m","ATS8p","ATS8s","ATS8v","ATSC1e","ATSC1i","ATSC1m","ATSC1p","ATSC1s","ATSC1v","ATSC2e","ATSC2i","ATSC2m","ATSC2p","ATSC2s","ATSC2v","ATSC3e","ATSC3i","ATSC3m","ATSC3p","ATSC3s","ATSC3v","ATSC4e","ATSC4i","ATSC4m","ATSC4p","ATSC4s","ATSC4v","ATSC5e","ATSC5i","ATSC5m","ATSC5p","ATSC5s","ATSC5v","ATSC6e","ATSC6i","ATSC6m","ATSC6p","ATSC6s","ATSC6v","ATSC7e","ATSC7i","ATSC7m","ATSC7p","ATSC7s","ATSC7v","ATSC8e","ATSC8i","ATSC8m","ATSC8p","ATSC8s","ATSC8v","BAC","BBI","BIC0","BIC1","BIC2","BIC3","BIC4","BIC5","BID","BLI","BLTA96","BLTD48","BLTF96","Br.094","C.","C.001","C.002","C.003","C.005","C.006","C.008","C.013","C.015","C.016","C.017","C.019","C.020","C.024","C.025","C.026","C.027","C.028","C.029","C.031","C.033","C.034","C.035","C.037","C.039","C.040","C.041","C.042","C.043","C.044","CATS2D_00_DD","CATS2D_00_DP","CATS2D_00_PP","CATS2D_01_AA","CATS2D_01_AN","CATS2D_01_DD","CATS2D_01_DN","CATS2D_01_LL","CATS2D_01_NL","CATS2D_02_AA","CATS2D_02_AL","CATS2D_02_AP","CATS2D_02_DA","CATS2D_02_DD","CATS2D_02_DL","CATS2D_02_LL","CATS2D_02_NL","CATS2D_02_PL","CATS2D_03_AA","CATS2D_03_AL","CATS2D_03_DA","CATS2D_03_DD","CATS2D_03_DL","CATS2D_03_LL","CATS2D_03_NL","CATS2D_03_PL","CATS2D_04_AA","CATS2D_04_AL","CATS2D_04_DA","CATS2D_04_DD","CATS2D_04_DL","CATS2D_04_LL","CATS2D_04_NL","CATS2D_04_PL","CATS2D_05_AA","CATS2D_05_AL","CATS2D_05_AP","CATS2D_05_DA","CATS2D_05_DD","CATS2D_05_DL","CATS2D_05_DP","CATS2D_05_LL","CATS2D_05_NL","CATS2D_05_PL","CATS2D_06_AA","CATS2D_06_AL","CATS2D_06_AN","CATS2D_06_DA","CATS2D_06_DD","CATS2D_06_DL","CATS2D_06_LL","CATS2D_06_PL","CATS2D_07_AA","CATS2D_07_AL","CATS2D_07_AN","CATS2D_07_DA","CATS2D_07_DD","CATS2D_07_DL","CATS2D_07_LL","CATS2D_07_PL","CATS2D_08_AA","CATS2D_08_AL","CATS2D_08_AP","CATS2D_08_DA","CATS2D_08_DL","CATS2D_08_LL","CATS2D_08_NL","CATS2D_08_PL","CATS2D_09_AA","CATS2D_09_AL","CATS2D_09_AP","CATS2D_09_DA","CATS2D_09_DD","CATS2D_09_DL","CATS2D_09_LL","CATS2D_09_NL","CATS2D_09_PL","CENT","Chi0_AEA.bo.","Chi0_AEA.dm.","Chi0_AEA.ed.","Chi0_AEA.ri.","Chi0_EA","Chi0_EA.bo.","Chi0_EA.dm.","Chi0_EA.ed.","Chi0_EA.ri.","Chi1_AEA.bo.","Chi1_AEA.dm.","Chi1_AEA.ed.","Chi1_AEA.ri.","Chi1_EA","Chi1_EA.bo.","Chi1_EA.dm.","Chi1_EA.ed.","Chi1_EA.ri.","CIC0","CIC1","CIC2","CIC3","CIC4","CIC5","CID","Cl.086","Cl.089","pXC50"
{1 1.9,2 10.087,3 4.995,4 24.951,5 93.714,6 10.493,7 0.68,8 3.684,9 3.753,10 3.701,11 3.387,12 4.827,13 3.336,14 4.173,15 4.263,16 4.02,17 3.762,18 5.631,19 3.701,20 4.409,21 4.552,22 4.148,23 3.877,24 5.645,25 3.761,26 4.403,27 4.538,28 4.193,29 3.787,30 5.904,31 3.698,32 4.322,33 4.492,34 3.761,35 3.626,36 5.621,37 3.52,38 4.116,39 4.292,40 3.706,41 3.432,42 5.49,43 3.353,44 3.903,45 4.079,46 3.475,47 3.335,48 5.05,49 3.196,50 3.84,51 4.011,52 3.439,53 3.253,54 5.071,55 3.118,56 0.109,57 0.487,58 4.64,59 3.09,60 13.922,61 2.896,62 0.322,63 0.76,64 6.829,65 4.879,66 39.134,67 4.99,68 0.393,69 0.934,70 21.153,71 7.618,72 38.923,73 7.365,74 0.597,75 0.898,76 26.758,77 8.11,78 57.389,79 7.327,80 0.485,81 0.818,82 22.822,83 7.574,84 65.545,85 7.236,86 0.452,87 0.648,88 13.954,89 5.49,90 58.705,91 5.994,92 0.28,93 0.548,94 12.669,95 4.533,96 15.49,97 5.268,98 0.216,99 0.511,100 14.508,101 4.941,102 17.101,103 5.182,104 17,105 36,106 0.341,107 0.528,108 0.682,109 0.808,110 0.829,111 0.829,112 3.188,113 1.069,114 -4.27,115 -4.21,116 -3.98,118 45.7,131 9,133 5,138 2,155 4,157 1,158 4,160 2,162 2,163 6,167 4,170 3,171 5,175 10,178 3,179 6,183 4,185 1,189 6,193 2,197 1,198 8,200 2,205 2,206 6,209 1,213 2,217 7,222 2,225 688,226 15.11,227 15.11,228 15.11,229 15.11,230 15.11,231 12.736,232 14.653,233 8.782,234 15.632,235 12.331,236 12.331,237 12.331,238 12.331,239 12.331,240 8.809,241 10.408,242 4.164,243 13.32,244 3.229,245 2.188,246 1.329,247 0.629,248 0.514,249 0.514,250 3.862,252 2,253 4.738}
{0 CHEMBL1312788,1 1.252,2 10,3 4.56,4 20.795,5 82.474,6 7.343,7 0.571,8 3.63,9 3.731,10 3.178,11 3.296,12 4.803,13 3.244,14 4.096,15 4.248,16 3.483,17 3.627,18 5.249,19 3.559,20 4.312,21 4.475,22 3.515,23 3.714,24 5.541,25 3.626,26 4.388,27 4.608,28 3.295,29 3.571,30 5.569,31 3.451,32 4.167,33 4.405,34 3.159,35 3.332,36 5.447,37 3.231,38 3.848,39 4.027,40 3.124,41 3.199,42 5.138,43 3.14,44 3.938,45 4.095,46 3.044,47 3.177,48 5.331,49 3.125,50 3.802,51 3.992,52 2.881,53 3.139,54 4.95,55 3.038,56 0.012,57 0.399,58 6.708,59 3.454,60 4.493,61 4.438,62 0.037,63 0.648,64 11.741,65 5.617,66 11.012,67 7.346,68 0.079,69 0.799,70 15.199,71 6.878,72 24.419,73 8.813,74 0.173,75 0.864,76 18.311,77 7.417,78 46.395,79 9.512,80 0.251,81 0.691,82 15.192,83 5.944,84 61.629,85 7.771,86 0.044,87 0.497,88 9.815,89 4.265,90 14.567,91 5.471,92 0.197,93 0.52,94 11.534,95 4.286,96 50.346,97 4.771,98 0.097,99 0.475,100 9.659,101 4.076,102 24.617,103 5.174,104 17,105 28,106 0.227,107 0.51,108 0.586,109 0.627,110 0.627,111 0.627,112 3.056,113 0.923,114 -5.03,115 -4.93,116 -4.62,118 50,119 2,127 2,131 8,132 4,142 2,155 15,158 4,163 18,167 6,171 16,175 4,179 10,182 1,183 4,189 7,193 6,198 8,201 4,206 10,209 2,213 10,217 2,222 10,225 480,226 13.137,227 13.137,228 13.137,229 13.137,230 13.137,231 11.296,232 7.433,233 7.769,234 13.077,235 10.304,236 10.304,237 10.304,238 10.304,239 10.304,240 7.488,241 3.775,242 3.686,243 10.176,244 3.918,245 2.354,246 1.931,247 1.709,248 1.709,249 1.709,250 3.712,253 5.058}
{0 CHEMBL1319503,1 1.236,2 5.944,3 3.542,4 12.542,5 75.286,6 6.326,7 0.476,8 3.733,9 3.87,10 3.2,11 3.318,12 4.568,13 3.258,14 4.354,15 4.555,16 3.602,17 3.785,18 5.116,19 3.698,20 4.685,21 4.926,22 3.748,23 4,24 5.399,25 3.884,26 4.764,27 5.022,28 3.608,29 4.016,30 5.425,31 3.86,32 4.652,33 4.913,34 3.342,35 3.884,36 5.287,37 3.687,38 4.576,39 4.881,40 2.876,41 3.64,42 5.147,43 3.379,44 4.262,45 4.629,46 2.108,47 3.122,48 4.713,49 2.778,50 3.659,51 4.05,52 1.269,53 2.411,54 4.058,55 2.04,56 0.05,57 0.562,58 9.361,59 3.768,60 5.043,61 5.493,62 0.115,63 0.995,64 17.666,65 6.665,66 10.032,67 9.921,68 0.195,69 1.324,70 24.658,71 9.156,72 15.594,73 13.671,74 0.191,75 1.383,76 26.599,77 9.947,78 15.553,79 14.861,80 0.125,81 1.19,82 23.371,83 9.725,84 13.876,85 14.122,86 0.129,87 1.036,88 21.646,89 8.679,90 13.712,91 12.765,92 0.088,93 0.681,94 15.602,95 6.323,96 10.356,97 9.313,98 0.062,99 0.357,100 8.499,101 3.17,102 5.854,103 4.782,104 2,105 31,106 0.224,107 0.558,108 0.783,109 0.87,110 0.87,111 0.87,112 2.966,113 1.028,114 -4.03,115 -3.98,116 -3.77,118 42.1,119 1,120 4,123 2,124 1,131 3,132 3,139 2,155 9,158 4,162 2,163 10,167 4,168 1,170 2,171 9,175 2,178 2,179 10,183 1,187 2,189 10,197 2,198 5,205 1,206 2,225 248,226 12.569,227 12.569,228 12.569,229 12.569,230 12.569,231 11.39,232 16.501,233 7.339,234 12.725,235 10.403,236 10.403,237 10.403,238 10.403,239 10.403,240 8.487,241 18.225,242 3.488,243 10.675,244 4.012,245 2.165,246 0.922,247 0.441,248 0.441,249 0.441,250 3.67,253 4}
{0 CHEMBL1332684,1 1.483,2 10.591,3 3.457,4 11.952,5 87.94,6 7.694,7 0.75,8 3.745,9 3.853,10 3.334,11 3.317,12 4.953,13 3.308,14 4.165,15 4.285,16 3.656,17 3.64,18 5.353,19 3.618,20 4.42,21 4.586,22 3.62,23 3.677,24 5.546,25 3.635,26 4.356,27 4.57,28 3.4,29 3.558,30 5.368,31 3.473,32 4.178,33 4.38,34 3.377,35 3.544,36 5.209,37 3.454,38 4.189,39 4.371,40 3.357,41 3.536,42 5.214,43 3.453,44 4.174,45 4.384,46 3.254,47 3.415,48 5.196,49 3.327,50 4.016,51 4.233,52 3.048,53 3.242,54 5.063,55 3.151,56 0.04,57 0.511,58 7.268,59 3.286,60 10.145,61 3.961,62 0.013,63 0.743,64 11.547,65 5.455,66 11.49,67 6.646,68 0.22,69 0.92,70 17.448,71 6.604,72 31.01,73 7.799,74 0.317,75 0.851,76 17.643,77 6.567,78 31.068,79 8.401,80 0.191,81 0.724,82 13.804,83 5.979,84 22.145,85 7.94,86 0.109,87 0.73,88 13.585,89 5.897,90 17.294,91 7.474,92 0.124,93 0.72,94 14.156,95 5.653,96 19.947,97 7.335,98 0.146,99 0.639,100 12.133,101 4.437,102 21.204,103 5.779,104 5,105 32,106 0.264,107 0.428,108 0.52,109 0.656,110 0.682,111 0.682,112 3.146,113 0.857,114 -3.93,115 -3.88,116 -3.68,118 47.4,131 12,133 6,148 2,149 2,150 2,155 6,158 8,162 4,163 7,165 4,167 6,170 4,171 5,173 4,174 1,175 2,179 8,184 2,185 2,189 12,193 4,198 8,201 4,205 4,206 4,207 4,212 2,213 4,215 2,218 2,219 2,221 2,222 8,224 2,225 632,226 14.894,227 14.894,228 14.894,229 14.894,230 14.894,231 12.619,232 19.264,233 8.977,234 15.177,235 11.882,236 11.882,237 11.882,238 11.882,239 11.882,240 8.625,241 22.442,242 4.362,243 12.404,244 3.765,245 2.843,246 2.33,247 1.566,248 1.421,249 1.421,250 3.831,253 4.815}
{0 CHEMBL1334033,1 1.05,2 7.25,3 5.721,4 32.725,5 87.227,6 5.046,8 4.033,9 4.193,10 3.269,11 3.568,12 4.637,13 3.455,14 4.727,15 4.957,16 3.58,17 4.057,18 5.249,19 3.884,20 5.152,21 5.459,22 3.602,23 4.262,24 5.577,25 4.025,26 5.182,27 5.505,28 3.538,29 4.244,30 5.574,31 3.99,32 5.153,33 5.47,34 3.64,35 4.249,36 5.57,37 4.018,38 5.218,39 5.526,40 3.657,41 4.309,42 5.673,43 4.073,44 5.282,45 5.618,46 3.428,47 4.265,48 5.696,49 3.977,50 5.131,51 5.504,52 2.85,53 3.971,54 5.473,55 3.61,56 0.069,57 0.758,58 14.466,59 6.218,60 4.147,61 8.995,62 0.13,63 1.326,64 25.985,65 10.998,66 7.725,67 15.999,68 0.178,69 1.728,70 34.844,71 14.695,72 10.187,73 21.398,74 0.169,75 1.713,76 34.693,77 14.889,78 9.451,79 21.545,80 0.173,81 1.709,82 34.472,83 14.557,84 10.323,85 21.195,86 0.206,87 1.846,88 37.383,89 15.235,90 12.834,91 22.471,92 0.2,93 1.818,94 37.344,95 15.466,96 12.959,97 22.671,98 0.146,99 1.4,100 29.292,101 12.526,102 9.591,103 18.146,105 28,106 0.18,107 0.271,108 0.458,109 0.657,110 0.717,111 0.717,112 3.059,113 1.318,114 -6.06,115 -5.91,116 -5.49,118 34.5,120 14,121 3,123 1,124 1,155 17,162 3,163 21,170 2,171 20,178 2,179 18,187 4,189 19,197 4,198 18,205 2,206 14,213 7,222 2,225 564,226 14.104,227 14.104,228 14.104,229 14.104,230 14.104,231 14.104,232 7.906,233 8.913,234 14.17,235 10.932,236 10.932,237 10.932,238 10.932,239 10.932,240 10.932,241 12.5,242 4.302,243 11.036,244 4.732,245 4.201,246 3.109,247 1.951,248 1.6,249 1.6,250 3.746,253 4.889}
{0 CHEMBL1335384,1 1.693,2 9.448,3 5.951,4 35.414,5 124.684,6 8.707,7 0.625,8 4.024,9 4.126,10 3.81,11 3.705,12 5.082,13 3.622,14 4.56,15 4.731,16 4.254,17 4.116,18 5.56,19 4.01,20 4.737,21 4.904,22 4.406,23 4.241,24 5.767,25 4.098,26 4.877,27 5.1,28 4.334,29 4.205,30 5.934,31 4.046,32 4.696,33 4.873,34 4.255,35 4.122,36 5.748,37 3.97,38 4.718,39 4.892,40 4.326,41 4.139,42 5.86,43 4.019,44 4.699,45 4.841,46 4.278,47 4.208,48 5.817,49 4.082,50 4.836,51 5.01,52 4.204,53 4.272,54 5.87,55 4.091,56 0.004,57 0.715,58 9.13,59 4.814,60 5.666,61 5.948,62 0.239,63 1.263,64 21.672,65 8.438,66 14.909,67 10.272,68 0.159,69 1.424,70 31.798,71 11.516,72 19.621,73 13.281,74 0.5,75 1.603,76 42.75,77 14.114,78 57.409,79 15.871,80 0.225,81 1.385,82 39.973,83 12.595,84 30.306,85 12.849,86 0.466,87 1.404,88 37.181,89 10.713,90 47.118,91 11.271,92 0.193,93 1.331,94 26.956,95 10.44,96 32.764,97 11.894,98 0.361,99 1.554,100 40.653,101 13.895,102 50.966,103 14.786,104 30,105 46,106 0.281,107 0.597,108 0.766,109 0.843,110 0.85,111 0.85,112 3.409,113 1.074,114 -5.99,115 -5.84,116 -5.44,118 43.1,119 1,120 1,122 2,123 2,131 7,132 2,133 1,135 1,139 3,143 1,147 1,155 8,157 2,158 5,163 12,167 4,171 10,174 2,175 10,179 6,183 8,189 3,192 2,193 10,198 6,201 5,206 8,209 7,213 11,217 4,222 9,225 1522,226 19.361,227 19.361,228 19.361,229 19.361,230 19.361,231 16.947,232 18.679,233 11.297,234 20.032,235 15.788,236 15.788,237 15.788,238 15.788,239 15.788,240 12.07,241 23.074,242 5.388,243 17.018,244 3.98,245 2.077,246 1.057,247 0.593,248 0.554,249 0.554,250 4.101,252 1,253 4.772}
{0 CHEMBL1338466,1 1.648,2 10.5,3 4.299,4 18.479,5 106.127,6 8.948,7 0.759,8 3.859,9 3.989,10 3.594,11 3.403,12 5.081,13 3.402,14 4.33,15 4.494,16 3.965,17 3.785,18 5.463,19 3.767,20 4.483,21 4.661,22 4.054,23 3.856,24 5.611,25 3.824,26 4.637,27 4.863,28 4.142,29 3.871,30 5.799,31 3.825,32 4.496,33 4.731,34 4.01,35 3.716,36 5.663,37 3.697,38 4.334,39 4.524,40 3.945,41 3.641,42 5.582,43 3.629,44 4.243,45 4.441,46 3.729,47 3.536,48 5.435,49 3.518,50 4.239,51 4.465,52 3.546,53 3.472,54 5.379,55 3.435,56 0.165,57 0.715,58 5.842,59 3.156,60 11.386,61 3.87,62 0.251,63 1.06,64 13.055,65 5.431,66 15.529,67 6.911,68 0.342,69 1.147,70 16.279,71 5.726,72 22.024,73 7.361,74 0.534,75 1.215,76 23.659,77 6.857,78 41.178,79 9.191,80 0.461,81 1.109,82 19.407,83 5.656,84 36.457,85 7.513,86 0.405,87 0.945,88 18.984,89 4.492,90 31.969,91 5.25,92 0.319,93 0.869,94 17.298,95 4.114,96 26.239,97 4.921,98 0.354,99 0.867,100 12.888,101 3.349,102 30.115,103 3.967,104 10,105 41,106 0.285,107 0.574,108 0.625,109 0.659,110 0.659,111 0.659,112 3.305,113 0.871,114 -6.35,115 -6.19,116 -5.74,118 41.5,119 2,124 1,131 8,132 2,133 2,146 2,151 6,155 10,157 6,158 4,163 12,167 12,171 8,174 4,175 18,182 8,183 12,189 4,192 4,193 14,198 4,201 20,206 2,209 12,213 6,217 8,222 8,225 1000,226 17.706,227 17.706,228 17.706,229 17.706,230 17.706,231 15.086,232 20.881,233 10.346,234 18,235 14.287,236 14.287,237 14.287,238 14.287,239 14.287,240 10.449,241 17.817,242 4.881,243 14.869,244 3.71,245 2.04,246 1.744,247 1.549,248 1.549,249 1.549,250 3.999,251 1,253 4.959}
{0 CHEMBL1362905,1 1.843,2 10.615,3 3.954,4 15.632,5 96.686,6 8.925,7 0.607,8 3.858,9 3.965,10 3.567,11 3.389,12 5.085,13 3.398,14 4.353,15 4.504,16 3.923,17 3.73,18 5.602,19 3.726,20 4.516,21 4.689,22 3.95,23 3.793,24 5.836,25 3.765,26 4.554,27 4.777,28 3.827,29 3.688,30 5.775,31 3.662,32 4.447,33 4.658,34 3.769,35 3.608,36 5.619,37 3.608,38 4.393,39 4.569,40 3.863,41 3.65,42 5.696,43 3.656,44 4.486,45 4.671,46 3.814,47 3.727,48 5.712,49 3.697,50 4.486,51 4.677,52 3.749,53 3.712,54 5.715,55 3.646,56 0.137,57 0.687,58 5.986,59 3.535,60 9.098,61 3.98,62 0.432,63 1.046,64 13.312,65 5.795,66 24.657,67 6.559,68 0.607,69 1.191,70 19.079,71 6.878,72 56.542,73 8.06,74 0.632,75 1.157,76 22.233,77 6.405,78 59.017,79 8.167,80 0.573,81 1.033,82 17.29,83 5.093,84 54.318,85 6.266,86 0.552,87 1.046,88 15.632,89 5.102,90 49.772,91 5.789,92 0.526,93 1.046,94 17.463,95 6.326,96 43.534,97 7.22,98 0.565,99 1.005,100 18.962,101 7.501,102 55.056,103 9.123,104 20,105 38,106 0.321,107 0.659,108 0.77,109 0.837,110 0.837,111 0.837,112 3.304,113 0.876,114 -5.57,115 -5.44,116 -5.08,118 42.9,122 1,123 2,131 8,132 2,133 2,137 1,143 1,147 1,151 1,155 8,157 3,158 2,160 2,162 1,163 10,166 3,167 5,168 1,170 2,171 6,174 2,175 8,176 1,178 3,179 1,182 1,183 8,185 1,187 2,193 12,197 2,198 1,201 10,206 4,209 6,212 1,213 8,217 3,222 8,225 1146,226 17.524,227 17.524,228 17.524,229 17.524,230 17.524,231 15.349,232 17.998,233 10.474,234 18.086,235 13.774,236 13.774,237 13.774,238 13.774,239 13.774,240 10.452,241 21.632,242 4.929,243 14.674,244 3.549,245 1.611,246 0.97,247 0.589,248 0.589,249 0.589,250 3.984,252 1,253 4}
{0 CHEMBL1376392,1 1.592,2 8.5,3 1.422,4 2.023,5 68.811,6 7.303,7 0.333,8 3.592,9 3.716,10 3.101,11 3.061,12 4.806,13 3.052,14 4.056,15 4.222,16 3.361,17 3.335,18 5.337,19 3.298,20 4.271,21 4.481,22 3.345,23 3.368,24 5.448,25 3.323,26 4.183,27 4.389,28 3.279,29 3.302,30 5.327,31 3.266,32 4.135,33 4.319,34 3.362,35 3.336,36 5.631,37 3.285,38 4.188,39 4.409,40 3.099,41 3.333,42 5.311,43 3.231,44 4.137,45 4.39,46 2.929,47 3.206,48 5.187,49 3.077,50 3.978,51 4.232,52 2.832,53 2.954,54 5.247,55 2.84,56 0.061,57 0.463,58 7.029,59 2.941,60 10.708,61 3.873,62 0.211,63 0.646,64 12.333,65 4.618,66 29.731,67 6.277,68 0.365,69 0.71,70 16.793,71 5.097,72 48.868,73 7.093,74 0.315,75 0.659,76 15.311,77 4.593,78 38.476,79 6.342,80 0.462,81 0.663,82 14.05,83 4.812,84 70.333,85 6.619,86 0.269,87 0.675,88 15.139,89 5.065,90 44.453,91 7.105,92 0.232,93 0.611,94 14.776,95 4.876,96 37.197,97 7.088,98 0.329,99 0.486,100 12.969,101 3.933,102 45.178,103 5.814,104 31,105 22,106 0.299,107 0.658,108 0.808,109 0.874,110 0.897,111 0.897,112 2.958,113 0.939,114 -2.4,115 -2.43,116 -2.38,118 38.2,119 1,120 1,123 1,127 2,131 4,133 2,143 2,148 1,149 1,150 1,155 5,158 4,159 1,160 2,162 3,163 2,165 1,167 5,168 1,170 4,171 1,173 1,175 2,178 1,179 2,182 2,183 3,184 1,185 2,186 1,187 1,188 1,189 6,193 2,197 1,198 6,201 2,205 1,206 3,207 1,208 1,209 3,210 1,211 1,212 2,213 2,215 2,217 1,221 1,222 1,224 1,225 428,226 11.905,227 11.905,228 11.905,229 11.905,230 11.905,231 10.687,232 13.967,233 7.582,234 12.038,235 8.869,236 8.869,237 8.869,238 8.869,239 8.869,240 6.958,241 16.27,242 3.588,243 9.086,244 3.496,245 1.586,246 0.787,247 0.434,248 0.316,249 0.316,250 3.591,253 5.071}
{0 CHEMBL1388040,1 1.448,2 15.071,3 5.326,4 28.362,5 112.48,6 6.552,7 0.4,8 4.142,9 4.271,10 3.598,11 3.629,12 5.119,13 3.59,14 4.726,15 4.928,16 3.878,17 3.992,18 5.64,19 3.924,20 4.99,21 5.238,22 3.915,23 4.138,24 5.837,25 4.026,26 5.018,27 5.275,28 3.78,29 4.142,30 5.772,31 3.989,32 5.065,33 5.349,34 3.699,35 4.131,36 5.782,37 3.95,38 5.012,39 5.306,40 3.542,41 4.055,42 5.657,43 3.85,44 4.914,45 5.23,46 3.403,47 3.909,48 5.557,49 3.699,50 4.738,51 5.039,52 3.335,53 3.765,54 5.425,55 3.583,56 0.029,57 0.873,58 14.019,59 5.833,60 7.194,61 8.003,62 0.247,63 1.386,64 26.337,65 8.956,66 25.722,67 12.866,68 0.44,69 1.676,70 34.723,71 11.841,72 40.099,73 16.93,74 0.327,75 1.634,76 35.261,77 12.753,78 33.116,79 18.266,80 0.512,81 1.583,82 37.093,83 12.874,84 44.132,85 19.117,86 0.37,87 1.507,88 34.893,89 12.398,90 30.447,91 18.437,92 0.364,93 1.378,94 31.908,95 11.034,96 32.223,97 16.482,98 0.274,99 1.182,100 26.781,101 9.281,102 26.402,103 13.609,104 6,105 38,106 0.239,107 0.479,108 0.683,109 0.82,110 0.845,111 0.845,112 3.373,113 1.025,114 -4.99,115 -4.89,116 -4.58,118 39,120 4,122 1,123 6,131 8,133 4,155 8,158 6,163 6,166 2,167 8,171 4,175 4,179 2,183 4,189 4,192 1,193 3,198 4,200 1,201 2,206 5,209 2,213 5,217 3,222 4,225 1360,226 19.405,227 19.405,228 19.405,229 19.405,230 19.405,231 17.902,232 23.252,233 12.009,234 20.002,235 14.775,236 14.775,237 14.775,238 14.775,239 14.775,240 12.565,241 29.163,242 5.672,243 15.664,244 4.434,245 2.977,246 1.741,247 0.907,248 0.759,249 0.759,250 4.063,253 5.015}
{0 CHEMBL1393497,1 1.655,2 9.5,3 3.498,4 12.235,5 73.555,6 8.292,7 0.333,8 3.611,9 3.723,10 3.246,11 3.154,12 4.684,13 3.103,14 4.15,15 4.329,16 3.604,17 3.488,18 5.223,19 3.404,20 4.409,21 4.626,22 3.661,23 3.562,24 5.481,25 3.45,26 4.327,27 4.563,28 3.634,29 3.445,30 5.403,31 3.311,32 4.153,33 4.348,34 3.193,35 3.291,36 5.327,37 3.148,38 4.127,39 4.403,40 3.029,41 3.266,42 4.887,43 3.068,44 4.056,45 4.318,46 3.068,47 3.141,48 5.003,49 2.973,50 3.879,51 4.117,52 3.153,53 2.897,54 5.108,55 2.815,56 0.04,57 0.438,58 6.638,59 3.35,60 5.711,61 4.325,62 0.19,63 0.655,64 14.653,65 5.659,66 21.832,67 7.365,68 0.466,69 0.736,70 25.495,71 6.942,72 48.135,73 8.801,74 0.417,75 0.644,76 27.382,77 6.87,78 47.719,79 8.603,80 0.53,81 0.57,82 19.176,83 5.533,84 61.576,85 6.944,86 0.191,87 0.571,88 18.715,89 6.018,90 23.662,91 8.216,92 0.221,93 0.492,94 19.853,95 5.439,96 25.97,97 7.174,98 0.408,99 0.382,100 17.35,101 3.849,102 43.103,103 4.801,104 33,105 23,106 0.313,107 0.627,108 0.807,109 0.843,110 0.843,111 0.843,112 2.957,113 1.103,114 -4.54,115 -4.47,116 -4.21,118 37.1,119 2,120 2,123 1,124 1,131 3,133 3,143 1,155 2,158 3,160 1,162 3,163 5,167 5,170 1,171 3,175 2,179 5,182 1,183 1,185 1,189 6,198 3,201 3,205 1,206 1,209 3,212 3,213 1,222 2,225 372,226 11.483,227 11.483,228 11.483,229 11.483,230 11.483,231 10.499,232 15.41,233 7.034,234 11.909,235 8.877,236 8.877,237 8.877,238 8.877,239 8.877,240 7.392,241 18.463,242 3.362,243 9.651,244 3.474,245 1.818,246 0.865,247 0.672,248 0.672,249 0.672,250 3.585,252 2,253 4.398}
{0 CHEMBL1399156,1 1.63,2 10.3,3 4.181,4 17.484,5 86.593,6 8.847,7 0.286,8 3.784,9 3.897,10 3.503,11 3.32,12 4.705,13 3.26,14 4.385,15 4.576,16 3.891,17 3.7,18 5.254,19 3.606,20 4.612,21 4.831,22 4.096,23 3.84,24 5.477,25 3.695,26 4.597,27 4.857,28 4.234,29 3.822,30 5.345,31 3.606,32 4.528,33 4.79,34 3.5,35 3.663,36 5.261,37 3.414,38 4.296,39 4.545,40 3.354,41 3.447,42 5.017,43 3.249,44 4.236,45 4.487,46 3.313,47 3.343,48 4.987,49 3.153,50 4.094,51 4.34,52 3.338,53 3.207,54 4.925,55 3.042,56 0.002,57 0.529,58 7.55,59 4.173,60 2.703,61 5.423,62 0.213,63 0.847,64 19.786,65 7.061,66 15.086,67 9.031,68 0.464,69 0.982,70 35.373,71 9.531,72 29.647,73 11.957,74 0.252,75 0.93,76 43.34,77 10.422,78 20.986,79 13.045,80 0.401,81 0.802,82 54.605,83 10.203,84 26.874,85 12.308,86 0.219,87 0.675,88 29.507,89 7.439,90 15.646,91 9.303,92 0.238,93 0.619,94 29.01,95 6.823,96 17.062,97 8.418,98 0.406,99 0.537,100 28.161,101 5.478,102 22.808,103 7.005,104 10,105 27,106 0.297,107 0.548,108 0.754,109 0.83,110 0.83,111 0.83,112 3.055,113 1.175,114 -4.45,115 -4.38,116 -4.12,117 1,118 36.6,119 1,120 2,123 6,131 2,132 1,133 3,155 4,158 2,163 5,166 1,167 6,171 2,175 1,179 5,182 1,183 2,189 4,193 1,198 5,206 2,208 1,209 4,213 1,217 1,225 486,226 13.397,227 13.397,228 13.397,229 13.397,230 13.397,231 12.515,232 17.453,233 8.281,234 14.046,235 10.378,236 10.378,237 10.378,238 10.378,239 10.378,240 9.094,241 19.228,242 3.963,243 11.511,244 3.728,245 2.347,246 1.214,247 0.799,248 0.799,249 0.799,250 3.717,252 1,253 4}
{0 CHEMBL1399323,1 1.41,2 9.28,3 3.724,4 13.865,5 94.611,6 7.292,7 0.429,8 3.923,9 4.027,10 3.484,11 3.517,12 4.99,13 3.486,14 4.498,15 4.648,16 3.866,17 3.954,18 5.49,19 3.896,20 4.821,21 5.018,22 4.003,23 4.121,24 5.821,25 4.047,26 4.898,27 5.1,28 3.977,29 4.103,30 6.048,31 4.026,32 4.877,33 5.085,34 3.91,35 4.059,36 6.037,37 3.975,38 4.785,39 5.001,40 3.741,41 3.973,42 5.859,43 3.865,44 4.698,45 4.929,46 3.498,47 3.792,48 5.741,49 3.671,50 4.439,51 4.696,52 3.199,53 3.542,54 5.398,55 3.4,56 0.005,57 0.604,58 9.354,59 4.579,60 5.983,61 5.806,62 0.189,63 1.046,64 18.252,65 8.003,66 22.284,67 10.409,68 0.212,69 1.4,70 26.986,71 10.897,72 34.603,73 14.448,74 0.392,75 1.474,76 30.232,77 11.22,78 81.067,79 14.641,80 0.55,81 1.411,82 30.254,83 11.02,84 85.199,85 14.301,86 0.252,87 1.278,88 27.251,89 10.721,90 58.901,91 14.022,92 0.36,93 1.15,94 26.051,95 9.367,96 68.944,97 12.167,98 0.231,99 0.898,100 20.158,101 7.473,102 40.829,103 10.134,104 11,105 40,106 0.242,107 0.524,108 0.667,109 0.804,110 0.87,111 0.877,112 3.268,113 0.939,114 -4.57,115 -4.49,116 -4.23,118 45.7,120 3,121 3,122 1,131 9,132 1,133 2,143 2,155 16,157 2,158 6,163 18,166 1,167 10,171 15,174 1,175 10,179 12,182 2,183 10,189 14,193 9,198 12,201 8,206 8,209 5,213 6,217 3,222 7,225 790,226 17.267,227 17.267,228 17.267,229 17.267,230 17.267,231 15.603,232 19.094,233 10.099,234 17.493,235 13.738,236 13.738,237 13.738,238 13.738,239 13.738,240 11.168,241 21.512,242 4.671,243 13.986,244 4.114,245 2.469,246 1.634,247 0.834,248 0.451,249 0.408,250 3.966,253 4}
{0 CHEMBL1405204,1 1.783,2 7.174,3 5.445,4 29.652,5 87.031,6 8.994,7 0.64,8 3.729,9 3.826,10 3.45,11 3.331,12 4.97,13 3.316,14 4.238,15 4.373,16 3.845,17 3.738,18 5.559,19 3.711,20 4.503,21 4.669,22 3.954,23 3.897,24 5.655,25 3.846,26 4.613,27 4.782,28 4.085,29 3.953,30 5.872,31 3.904,32 4.685,33 4.86,34 4.103,35 3.954,36 5.96,37 3.907,38 4.769,39 4.963,40 4.26,41 3.915,42 6.396,43 3.901,44 4.577,45 4.783,46 3.568,47 3.583,48 6.006,49 3.504,50 3.963,51 4.211,52 2.735,53 2.939,54 5.228,55 2.788,56 0.149,57 0.575,58 5.078,59 3.235,60 6.559,61 3.772,62 0.276,63 0.928,64 10.678,65 5.607,66 45.027,67 6.565,68 0.411,69 1.179,70 17.782,71 7.559,72 60.082,73 8.564,74 0.573,75 1.302,76 22.439,77 8.544,78 73.885,79 9.472,80 0.682,81 1.404,82 24.688,83 8.996,84 60.934,85 10.641,86 0.908,87 1.384,88 28.496,89 9.835,90 122.348,91 11.334,92 0.893,93 1.061,94 30.022,95 8.548,96 131.687,97 8.479,98 0.421,99 0.55,100 16.423,101 4.947,102 61.772,103 5.694,104 28,105 36,106 0.318,107 0.624,108 0.781,109 0.876,110 0.886,111 0.886,112 3.191,113 0.899,114 -5.37,115 -5.25,116 -4.91,118 45.9,119 1,121 1,123 1,131 7,132 2,133 2,138 1,139 2,151 2,155 7,157 1,158 6,163 9,167 6,171 10,174 1,175 3,179 10,182 2,183 10,189 8,193 14,198 8,201 7,206 8,209 2,213 5,222 1,225 728,226 15.19,227 15.19,228 15.19,229 15.19,230 15.19,231 12.783,232 11.211,233 8.887,234 15.495,235 12.333,236 12.333,237 12.333,238 12.333,239 12.333,240 8.849,241 12.494,242 4.187,243 12.91,244 3.427,245 1.707,246 0.822,247 0.291,248 0.237,249 0.237,250 3.864,252 1,253 5.101}
{0 CHEMBL1414184,1 1.829,2 7.833,3 2.231,4 4.977,5 73.472,6 9.703,7 0.526,8 3.48,9 3.548,10 3.377,11 3.166,12 4.705,13 3.089,14 3.945,15 4.055,16 3.728,17 3.51,18 5.218,19 3.404,20 3.971,21 4.069,22 3.648,23 3.399,24 5.294,25 3.327,26 4.066,27 4.204,28 3.615,29 3.327,30 5.482,31 3.283,32 3.932,33 4.065,34 3.419,35 3.271,36 5.241,37 3.186,38 3.851,39 3.984,40 3.345,41 3.239,42 5.345,43 3.119,44 3.801,45 4.009,46 3.39,47 3.21,48 4.863,49 2.99,50 3.511,51 3.64,52 2.965,53 2.732,54 4.806,55 2.638,56 0.072,57 0.386,58 3.954,59 2.881,60 5.084,61 2.836,62 0.32,63 0.622,64 12.069,65 5.414,66 27.375,67 5.103,68 0.196,69 0.664,70 14.596,71 5.617,72 15.627,73 4.796,74 0.39,75 0.681,76 12.812,77 5.189,78 41.8,79 4.648,80 0.313,81 0.584,82 15.387,83 5.597,84 37.368,85 4.685,86 0.404,87 0.55,88 7.917,89 4.041,90 59.179,91 3.783,92 0.172,93 0.547,94 18.416,95 6.242,96 16.782,97 6.146,98 0.26,99 0.358,100 9.242,101 3.504,102 33.765,103 2.642,104 19,105 26,106 0.351,107 0.724,108 0.843,109 0.87,110 0.87,111 0.87,112 2.96,113 1.089,114 -3.19,115 -3.19,116 -3.06,118 41.4,119 1,122 1,131 2,132 1,133 1,138 2,139 2,143 2,155 1,157 1,158 1,160 1,162 2,163 5,167 3,170 2,171 1,175 4,176 2,178 1,179 1,183 2,187 1,189 2,192 2,193 2,198 2,201 2,206 2,209 2,213 1,217 2,225 352,226 11.939,227 11.939,228 11.939,229 11.939,230 11.939,231 10.487,232 13.209,233 6.97,234 12.529,235 9.277,236 9.277,237 9.277,238 9.277,239 9.277,240 6.974,241 15.137,242 3.196,243 10.054,244 3.029,245 1.087,246 0.466,247 0.328,248 0.328,249 0.328,250 3.606,253 4.799}
{0 CHEMBL1419992,1 1.409,2 14.194,3 4.788,4 22.92,5 125.909,6 6.926,7 0.529,8 4.17,9 4.295,10 3.683,11 3.72,12 5.209,13 3.683,14 4.712,15 4.899,16 4.005,17 4.098,18 5.685,19 4.041,20 4.954,21 5.16,22 4.075,23 4.266,24 5.903,25 4.171,26 5.077,27 5.321,28 3.979,29 4.263,30 5.973,31 4.132,32 5.062,33 5.324,34 3.922,35 4.222,36 5.97,37 4.086,38 4.969,39 5.223,40 3.839,41 4.15,42 5.85,43 4.009,44 4.874,45 5.123,46 3.68,47 4.02,48 5.811,49 3.879,50 4.694,51 4.955,52 3.568,53 3.903,54 5.515,55 3.758,56 0.045,57 0.845,58 13.207,59 5.592,60 9.361,61 7.639,62 0.261,63 1.383,64 24.458,65 8.848,66 24.444,67 12.483,68 0.306,69 1.711,70 31.465,71 11.806,72 33.632,73 16.66,74 0.292,75 1.813,76 36.679,77 13.614,78 44.42,79 19.341,80 0.433,81 1.761,82 36.739,83 13.223,84 55.332,85 19.03,86 0.236,87 1.579,88 33.013,89 12.879,90 40.052,91 18.142,92 0.426,93 1.422,94 30.68,95 11.05,96 56.328,97 15.377,98 0.179,99 1.218,100 24.95,101 9.757,102 23.997,103 13.931,104 11,105 46,106 0.228,107 0.518,108 0.696,109 0.812,110 0.826,111 0.826,112 3.471,113 0.944,114 -4.82,115 -4.73,116 -4.44,118 43.3,119 1,122 1,123 5,131 12,132 3,133 3,143 1,155 14,158 5,160 1,162 2,163 14,166 1,167 8,168 1,170 4,171 7,175 7,178 4,179 1,182 1,183 9,187 1,189 4,193 8,198 8,200 1,201 5,203 1,206 11,209 2,213 12,217 1,222 11,225 1625,226 21.248,227 21.248,228 21.248,229 21.248,230 21.248,231 18.93,232 28.307,233 12.643,234 21.669,235 16.73,236 16.73,237 16.73,238 16.73,239 16.73,240 13.254,241 40.623,242 5.952,243 17.306,244 4.497,245 2.701,246 1.601,247 0.884,248 0.792,249 0.792,250 4.17,253 4}
{0 CHEMBL1422903,1 1.536,2 13.345,3 4.222,4 17.826,5 118.477,6 7.314,7 0.5,8 4.108,9 4.225,10 3.712,11 3.687,12 5.102,13 3.63,14 4.678,15 4.861,16 4.081,17 4.074,18 5.615,19 3.989,20 4.927,21 5.155,22 4.078,23 4.189,24 5.814,25 4.072,26 4.911,27 5.115,28 3.975,29 4.18,30 5.834,31 4.047,32 4.961,33 5.192,34 3.837,35 4.146,36 5.834,37 3.994,38 4.97,39 5.239,40 3.786,41 4.096,42 5.751,43 3.917,44 4.892,45 5.19,46 3.678,47 3.977,48 5.631,49 3.788,50 4.736,51 5.018,52 3.678,53 3.837,54 5.656,55 3.674,56 0.026,57 0.809,58 12.65,59 5.585,60 6.287,61 7.254,62 0.238,63 1.367,64 25.495,65 9.12,66 19.804,67 12.174,68 0.429,69 1.64,70 35.936,71 12.152,72 34.337,73 15.76,74 0.31,75 1.589,76 34.779,77 12.503,78 37.949,79 15.892,80 0.427,81 1.607,82 36.034,83 12.737,84 46.383,85 16.749,86 0.435,87 1.605,88 35.932,89 12.815,90 38.547,91 18.037,92 0.212,93 1.456,94 33.325,95 12.261,96 27.97,97 17.218,98 0.368,99 1.275,100 32.395,101 10.503,102 45.981,103 13.83,104 7,105 43,106 0.252,107 0.541,108 0.717,109 0.811,110 0.858,111 0.858,112 3.407,113 1.045,114 -3.81,115 -3.77,116 -3.58,118 41.1,119 1,120 3,123 5,131 8,133 2,135 1,139 1,143 1,146 1,155 8,157 1,158 8,163 7,166 2,167 9,171 5,175 6,179 5,182 1,183 3,189 6,192 3,193 5,198 5,201 3,206 3,208 1,209 8,213 3,216 1,217 7,222 4,225 1410,226 20.146,227 20.146,228 20.146,229 20.146,230 20.146,231 18.152,232 21.53,233 12.219,234 20.789,235 15.796,236 15.796,237 15.796,238 15.796,239 15.796,240 12.729,241 25.75,242 5.718,243 16.791,244 4.271,245 2.513,246 1.442,247 0.871,248 0.585,249 0.585,250 4.109,253 4.44}
{0 CHEMBL1447565,1 1.937,2 12.697,3 2.902,4 8.421,5 113.433,6 8.828,7 0.343,8 4.122,9 4.212,10 3.923,11 3.642,12 5.299,13 3.635,14 4.714,15 4.852,16 4.283,17 4.008,18 6.382,19 4.001,20 4.955,21 5.14,22 4.241,23 4.092,24 6.26,25 4.081,26 4.987,27 5.175,28 4.245,29 4.063,30 6.376,31 4.056,32 4.987,33 5.171,34 4.267,35 4.076,36 6.387,37 4.05,38 5,39 5.212,40 4.128,41 4.003,42 6.391,43 3.976,44 4.812,45 4.987,46 4.097,47 3.867,48 6.335,49 3.879,50 4.642,51 4.784,52 4.091,53 3.813,54 6.108,55 3.843,56 0.283,57 1.017,58 10.54,59 5.785,60 56.496,61 5.763,62 1.284,63 1.913,64 24.696,65 9.59,66 214.625,67 10.189,68 1.217,69 1.743,70 32.538,71 10.578,72 173.815,73 12.481,74 1.521,75 1.793,76 32.452,77 11.131,78 220.35,79 12.272,80 1.502,81 1.719,82 35.683,83 11.801,84 219.551,85 13.14,86 1.65,87 1.546,88 42.971,89 11.965,90 261.058,91 13.545,92 1.484,93 1.396,94 27.632,95 8.995,96 202.714,97 10.102,98 0.863,99 1.494,100 20.095,101 8.355,102 137.445,103 8.352,104 69,105 51,106 0.319,107 0.656,108 0.83,109 0.889,110 0.889,111 0.889,112 3.531,113 1.019,114 -4.24,115 -4.18,116 -3.95,118 38.2,119 1,120 1,123 4,124 1,125 1,131 6,132 2,133 1,134 1,136 1,143 2,155 6,157 3,158 6,160 1,162 3,163 5,166 2,167 5,170 3,171 2,174 4,175 6,176 2,178 2,179 3,182 2,183 6,189 4,192 2,193 9,198 5,200 4,201 8,203 2,206 5,209 2,213 3,216 2,217 8,221 2,222 2,225 2028,226 21.203,227 21.203,228 21.203,229 21.203,230 21.203,231 19.207,232 27.441,233 12.151,234 22.055,235 17.183,236 17.183,237 17.183,238 17.183,239 17.183,240 13.949,241 38.513,242 5.643,243 18.569,244 3.845,245 1.804,246 0.746,247 0.391,248 0.391,249 0.391,250 4.203,253 4}
{0 CHEMBL1447787,1 1.386,2 10.571,3 3.047,4 9.286,5 83.557,6 6.335,7 0.273,8 3.885,9 4.009,10 3.306,11 3.356,12 4.842,13 3.312,14 4.48,15 4.682,16 3.593,17 3.717,18 5.408,19 3.641,20 4.729,21 4.964,22 3.621,23 3.851,24 5.57,25 3.742,26 4.748,27 4.994,28 3.541,29 3.825,30 5.659,31 3.697,32 4.665,33 4.909,34 3.448,35 3.809,36 5.519,37 3.661,38 4.705,39 4.977,40 3.295,41 3.763,42 5.493,43 3.582,44 4.553,45 4.848,46 3.188,47 3.591,48 5.286,49 3.408,50 4.388,51 4.663,52 3.035,53 3.33,54 5.253,55 3.189,56 0.024,57 0.609,58 11.17,59 4.617,60 5.031,61 6.359,62 0.296,63 0.961,64 20.869,65 7.103,66 29.182,67 10.266,68 0.303,69 1.14,70 26.622,71 8.88,72 26.647,73 12.887,74 0.454,75 1.126,76 27.296,77 8.884,78 44.13,79 12.945,80 0.233,81 1.08,82 24.545,83 8.917,84 30.716,85 12.847,86 0.355,87 1.06,88 25.605,89 8.943,90 36.76,91 13.049,92 0.151,93 0.912,94 21.543,95 7.703,96 21.965,97 11.481,98 0.253,99 0.71,100 18.938,101 5.854,102 30.938,103 8.595,104 19,105 28,106 0.244,107 0.521,108 0.753,109 0.807,110 0.83,111 0.853,112 3.102,113 1.068,114 -3.71,115 -3.67,116 -3.49,118 37,119 2,120 2,121 1,123 5,131 4,132 1,133 1,143 1,155 6,157 1,158 9,163 5,167 7,171 2,174 2,175 6,179 5,189 8,192 1,193 3,198 8,201 4,206 2,209 7,213 1,217 1,222 2,225 594,226 14.378,227 14.378,228 14.378,229 14.378,230 14.378,231 13.524,232 20.232,233 8.929,234 14.888,235 10.808,236 10.808,237 10.808,238 10.808,239 10.808,240 9.458,241 23.56,242 4.1,243 11.428,244 4.138,245 2.57,246 1.25,247 0.946,248 0.815,249 0.685,250 3.766,253 4}
{0 CHEMBL1447872,1 1.306,2 10.32,3 4.636,4 21.492,5 102.534,6 6.49,7 0.444,8 4.005,9 4.129,10 3.458,11 3.57,12 4.972,13 3.512,14 4.58,15 4.77,16 3.755,17 3.954,18 5.462,19 3.865,20 4.857,21 5.097,22 3.776,23 4.063,24 5.731,25 3.938,26 4.845,27 5.086,28 3.767,29 4.031,30 5.788,31 3.91,32 4.817,33 5.045,34 3.849,35 4.088,36 5.773,37 3.977,38 4.884,39 5.105,40 3.853,41 4.146,42 5.885,43 4.021,44 4.895,45 5.141,46 3.645,47 4.108,48 5.741,49 3.937,50 4.8,51 5.08,52 3.355,53 3.896,54 5.546,55 3.687,56 0.044,57 0.686,58 12.053,59 5.346,60 6.417,61 7.288,62 0.161,63 1.151,64 22.132,65 8.693,66 16.64,67 12.159,68 0.251,69 1.404,70 29.629,71 11.312,72 32.306,73 15.84,74 0.329,75 1.353,76 29.486,77 11.185,78 46.445,79 15.503,80 0.208,81 1.381,82 28.21,83 11.127,84 34.945,85 15.565,86 0.354,87 1.474,88 30.383,89 11.84,90 50.862,91 16.541,92 0.234,93 1.461,94 30.405,95 12.337,96 37.584,97 17.323,98 0.251,99 1.265,100 27.746,101 11.173,102 31.5,103 15.82,104 8,105 35,106 0.22,107 0.502,108 0.698,109 0.801,110 0.81,111 0.81,112 3.267,113 1.036,114 -4.86,115 -4.77,116 -4.48,118 42.3,119 1,120 3,121 1,123 4,131 9,132 2,133 1,142 1,155 13,158 8,163 13,167 7,171 10,174 1,175 8,179 11,183 6,189 14,192 1,193 7,198 18,201 1,206 15,208 1,209 3,213 9,217 3,222 2,225 1028,226 17.336,227 17.336,228 17.336,229 17.336,230 17.336,231 15.819,232 18.652,233 10.77,234 17.557,235 13.32,236 13.32,237 13.32,238 13.32,239 13.32,240 11.052,241 22.095,242 5.104,243 13.671,244 4.394,245 2.724,246 1.559,247 0.952,248 0.899,249 0.899,250 3.95,253 4.991}
{0 CHEMBL1449968,1 1.699,2 8.4,3 4.577,4 20.945,5 86.105,6 9.388,7 0.696,8 3.609,9 3.685,10 3.498,11 3.357,12 4.702,13 3.274,14 4.116,15 4.227,16 3.902,17 3.755,18 5.159,19 3.653,20 4.219,21 4.364,22 3.897,23 3.795,24 5.177,25 3.671,26 4.279,27 4.442,28 3.774,29 3.761,30 5.23,31 3.612,32 4.137,33 4.331,34 3.588,35 3.592,36 5.019,37 3.409,38 3.892,39 4.071,40 3.336,41 3.281,42 4.862,43 3.161,44 3.779,45 3.958,46 3.148,47 3.122,48 4.806,49 3.009,50 3.583,51 3.777,52 2.989,53 2.968,54 4.552,55 2.801,56 0.031,57 0.428,58 4.7,59 2.883,60 5.044,61 3.297,62 0.176,63 0.746,64 14.339,65 6.002,66 11.097,67 6.333,68 0.088,69 0.822,70 14.528,71 6.52,72 9.501,73 7.458,74 0.176,75 0.906,76 17.52,77 7.198,78 16.067,79 7.308,80 0.105,81 0.807,82 19.918,83 7.197,84 11.211,85 7.401,86 0.104,87 0.608,88 12.134,89 4.896,90 11.21,91 5.01,92 0.144,93 0.576,94 11.839,95 4.293,96 14.615,97 3.817,98 0.117,99 0.483,100 10.014,101 3.699,102 11.205,103 3.416,104 3,105 33,106 0.313,107 0.628,108 0.758,109 0.836,110 0.871,111 0.871,112 3.059,113 1.106,114 -6.2,115 -6.04,116 -5.61,118 46.9,120 2,122 1,131 5,132 3,139 2,146 1,147 1,151 1,155 10,157 2,158 2,163 15,167 5,171 14,175 4,179 10,183 5,189 7,193 8,198 2,201 7,206 2,209 4,213 3,217 1,222 2,225 400,226 14.041,227 14.041,228 14.041,229 14.041,230 14.041,231 12.227,232 8.037,233 8.18,234 14.562,235 11.324,236 11.324,237 11.324,238 11.324,239 11.324,240 8.46,241 4.297,242 3.828,243 12.044,244 3.301,245 1.59,246 0.886,247 0.461,248 0.274,249 0.274,250 3.762,253 4}
{0 CHEMBL1450616,1 1.929,2 10.154,3 3.616,4 13.078,5 101.792,6 10.154,7 0.586,8 3.793,9 3.885,10 3.665,11 3.432,12 5.046,13 3.412,14 4.275,15 4.385,16 4.096,17 3.829,18 5.506,19 3.787,20 4.5,21 4.649,22 4.169,23 3.902,24 5.731,25 3.839,26 4.429,27 4.579,28 4.093,29 3.781,30 5.853,31 3.756,32 4.446,33 4.6,34 4.073,35 3.795,36 5.803,37 3.754,38 4.379,39 4.53,40 4.067,41 3.702,42 5.884,43 3.648,44 4.134,45 4.287,46 3.719,47 3.499,48 5.468,49 3.414,50 4.069,51 4.264,52 3.47,53 3.331,54 5.325,55 3.313,56 0.144,57 0.616,58 3.417,59 3.002,60 8.907,61 3.036,62 0.298,63 0.99,64 8.851,65 5.342,66 15.27,67 5.43,68 0.476,69 1.138,70 21.224,71 7.847,72 46.377,73 7.17,74 0.537,75 1.037,76 15.216,77 6.429,78 62.025,79 5.843,80 0.58,81 1.112,82 16.296,83 6.43,84 53.503,85 5.056,86 0.671,87 0.994,88 19.19,89 6.86,90 72.295,91 5.903,92 0.386,93 0.73,94 19.253,95 5.785,96 41.341,97 5.562,98 0.312,99 0.715,100 11.681,101 4.545,102 25.517,103 4.756,104 10,105 41,106 0.339,107 0.609,108 0.713,109 0.836,110 0.877,111 0.877,112 3.305,113 0.933,114 -5.2,115 -5.09,116 -4.77,118 44.7,120 1,124 1,131 9,133 3,143 2,147 1,151 3,155 6,157 5,158 8,163 10,167 10,171 4,174 1,175 16,179 5,182 4,183 9,189 5,192 6,193 6,198 6,200 2,201 8,206 4,209 12,213 1,217 10,222 4,225 966,226 17.706,227 17.706,228 17.706,229 17.706,230 17.706,231 15.409,232 17.297,233 10.458,234 18.175,235 14.327,236 14.327,237 14.327,238 14.327,239 14.327,240 10.892,241 17.409,242 4.966,243 15.176,244 3.319,245 1.785,246 1.192,247 0.494,248 0.263,249 0.263,250 4,252 1,253 5.234}
{0 CHEMBL1465945,1 1.69,2 7.25,3 2.203,4 4.853,5 88.185,6 8.898,7 0.593,8 3.741,9 3.838,10 3.464,11 3.304,12 5.021,13 3.324,14 4.228,15 4.357,16 3.858,17 3.71,18 5.593,19 3.726,20 4.437,21 4.582,22 3.991,23 3.855,24 5.682,25 3.864,26 4.575,27 4.717,28 4.069,29 3.878,30 6.088,31 3.895,32 4.579,33 4.737,34 4.015,35 3.855,36 5.96,37 3.876,38 4.61,39 4.774,40 3.914,41 3.73,42 6.141,43 3.762,44 4.315,45 4.492,46 3.472,47 3.476,48 5.712,49 3.449,50 4.054,51 4.287,52 2.751,53 3.071,54 5.273,55 2.953,56 0.155,57 0.564,58 4.698,59 2.77,60 4.223,61 3.03,62 0.338,63 0.904,64 9.414,65 4.539,66 38.609,67 4.996,68 0.319,69 1.087,70 12.406,71 6.023,72 28.437,73 6.867,74 0.735,75 1.191,76 15.335,77 6.344,78 87.231,79 6.882,80 0.426,81 1.181,82 15.887,83 6.719,84 33.751,85 7.188,86 0.8,87 1.108,88 19.659,89 6.792,90 105.865,91 6.45,92 0.454,93 0.821,94 14.313,95 5.598,96 57.682,97 5.809,98 0.415,99 0.603,100 13.231,101 4.558,102 58.221,103 5.179,104 18,105 40,106 0.298,107 0.611,108 0.722,109 0.839,110 0.878,111 0.878,112 3.231,113 0.809,114 -4.42,115 -4.35,116 -4.1,118 47.2,122 1,129 2,131 8,132 1,133 1,135 1,139 1,143 1,145 1,151 2,155 7,157 3,158 5,163 6,166 3,167 8,171 3,174 8,175 11,179 1,182 1,183 9,189 3,192 4,193 14,198 5,201 12,206 6,209 4,213 4,222 1,225 768,226 16.242,227 16.242,228 16.242,229 16.242,230 16.242,231 13.804,232 15.75,233 9.353,234 16.522,235 13.291,236 13.291,237 13.291,238 13.291,239 13.291,240 9.551,241 19.909,242 4.36,243 13.73,244 3.479,245 1.702,246 1.077,247 0.41,248 0.188,249 0.188,250 3.924,253 4}
{0 CHEMBL1469916,1 1.776,2 8.722,3 1.314,4 1.726,5 63.348,6 8.937,7 0.333,8 3.448,9 3.534,10 3.126,11 2.886,12 4.862,13 2.933,14 3.873,15 3.982,16 3.406,17 3.152,18 5.507,19 3.194,20 4.006,21 4.154,22 3.372,23 3.204,24 5.461,25 3.235,26 4.061,27 4.225,28 3.277,29 3.091,30 5.54,31 3.13,32 3.893,33 4.044,34 3.26,35 2.936,36 5.638,37 2.982,38 3.744,39 3.905,40 2.977,41 2.805,42 5.208,43 2.832,44 3.617,45 3.751,46 2.957,47 2.631,48 5.489,49 2.704,50 3.46,51 3.622,52 2.672,53 2.454,54 4.904,55 2.51,56 0.214,57 0.387,58 3.811,59 2.252,60 18.753,61 2.39,62 0.503,63 0.529,64 7.724,65 3.39,66 62.245,67 3.759,68 0.467,69 0.596,70 9.374,71 3.626,72 58.384,73 4.06,74 0.643,75 0.552,76 11.946,77 3.717,78 104.223,79 4.054,80 0.643,81 0.458,82 9.883,83 3.055,84 84.767,85 3.66,86 0.472,87 0.387,88 8.883,89 2.912,90 76.621,91 3.297,92 0.495,93 0.332,94 7.29,95 2.216,96 89.752,97 2.351,98 0.375,99 0.27,100 7.007,101 2.063,102 54.303,103 2.226,104 35,105 23,106 0.343,107 0.679,108 0.8,109 0.869,110 0.883,111 0.883,112 2.958,113 0.807,114 -2.82,115 -2.83,116 -2.74,118 39.3,122 1,127 2,131 4,133 2,143 2,151 2,155 3,157 2,158 5,160 1,162 3,163 3,167 8,170 2,171 1,175 5,176 1,178 1,179 2,182 2,183 3,185 4,189 3,192 1,193 2,198 2,200 2,201 7,206 1,209 4,216 2,217 2,225 384,226 11.646,227 11.646,228 11.646,229 11.646,230 11.646,231 10.203,232 15.737,233 7.017,234 11.888,235 8.794,236 8.794,237 8.794,238 8.794,239 8.794,240 6.478,241 20.434,242 3.265,243 9.023,244 3.032,245 1.295,246 0.67,247 0.313,248 0.241,249 0.241,250 3.585,253 4.963}
{0 CHEMBL1479933,1 1.68,2 9.238,3 3.177,4 10.091,5 82.127,6 8.981,7 0.739,8 3.613,9 3.692,10 3.402,11 3.286,12 4.832,13 3.247,14 4.063,15 4.177,16 3.783,17 3.624,18 5.316,19 3.564,20 4.188,21 4.329,22 3.735,23 3.62,24 5.376,25 3.55,26 4.19,27 4.344,28 3.62,29 3.499,30 5.459,31 3.434,32 3.996,33 4.118,34 3.618,35 3.393,36 5.318,37 3.36,38 3.963,39 4.093,40 3.387,41 3.37,42 5.176,43 3.306,44 3.996,45 4.177,46 3.286,47 3.382,48 5.095,49 3.248,50 3.94,51 4.175,52 3,53 3.217,54 4.99,55 3.067,56 0.028,57 0.427,58 4.734,59 2.896,60 4.259,61 3.125,62 0.227,63 0.701,64 9.913,65 4.743,66 19.918,67 5.183,68 0.135,69 0.79,70 15.42,71 6.336,72 14.373,73 6.447,74 0.331,75 0.788,76 15.683,77 5.892,78 37.278,79 5.28,80 0.224,81 0.656,82 13.108,83 4.873,84 23.412,85 4.308,86 0.207,87 0.598,88 9.049,89 4.207,90 28.371,91 3.937,92 0.179,93 0.648,94 12.797,95 5.323,96 16.495,97 5.919,98 0.173,99 0.619,100 14.092,101 5.244,102 25.285,103 6.115,104 5,105 31,106 0.307,107 0.595,108 0.716,109 0.791,110 0.806,111 0.806,112 3.103,113 0.94,114 -4.41,115 -4.34,116 -4.09,118 48.5,119 1,131 7,132 2,134 2,136 1,139 1,143 1,146 1,155 8,157 2,158 6,163 9,167 10,171 5,174 1,175 6,179 1,182 1,183 9,189 4,193 3,198 5,200 1,201 4,206 8,213 8,216 1,217 1,222 5,225 564,226 14.345,227 14.345,228 14.345,229 14.345,230 14.345,231 12.167,232 6.361,233 8.701,234 14.765,235 11.377,236 11.377,237 11.377,238 11.377,239 11.377,240 8.193,241 5.976,242 4.171,243 12.065,244 3.364,245 1.786,246 1.126,247 0.712,248 0.629,249 0.629,250 3.784,253 4.636}
{0 CHEMBL1481417,1 1.44,2 6.588,3 2.575,4 6.631,5 62.067,6 8.81,7 1,8 3.4,9 3.507,10 3.136,11 3.04,12 4.585,13 3.05,14 3.864,15 3.992,16 3.518,17 3.424,18 5.052,19 3.426,20 4.035,21 4.223,22 3.479,23 3.441,24 5.171,25 3.42,26 3.894,27 4.098,28 3.214,29 3.257,30 4.977,31 3.207,32 3.645,33 3.854,34 2.986,35 3.029,36 4.706,37 2.973,38 3.432,39 3.623,40 2.713,41 2.859,42 4.437,43 2.785,44 3.284,45 3.515,46 2.389,47 2.574,48 4.232,49 2.474,50 2.99,51 3.252,52 1.859,53 2.161,54 3.899,55 2.032,56 0.022,57 0.405,58 3.267,59 1.736,60 3.285,61 1.878,62 0.063,63 0.66,64 5.693,65 2.832,66 6.879,67 3.119,68 0.131,69 0.776,70 8.99,71 3.617,72 14.723,73 4.151,74 0.154,75 0.669,76 8.202,77 3.229,78 14.675,79 3.749,80 0.109,81 0.505,82 6.748,83 2.805,84 10.499,85 3.553,86 0.049,87 0.39,88 4.966,89 2.253,90 6.626,91 2.759,92 0.047,93 0.329,94 5.071,95 2.112,96 6.251,97 2.743,98 0.059,99 0.245,100 4.147,101 1.499,102 6.556,103 1.884,105 29,106 0.274,107 0.492,108 0.66,109 0.793,110 0.809,111 0.824,112 2.911,113 0.81,114 -2.49,115 -2.52,116 -2.46,118 52,131 6,135 5,139 1,145 1,155 3,158 5,160 1,162 1,163 2,166 1,167 7,170 1,171 2,174 1,175 2,176 1,179 2,182 1,185 1,189 4,193 1,197 1,198 2,201 2,205 2,209 1,212 1,225 210,226 11.964,227 11.964,228 11.964,229 11.964,230 11.964,231 9.768,233 7.018,234 12.198,235 9.93,236 9.93,237 9.93,238 9.93,239 9.93,240 6.62,242 3.38,243 10.325,244 3.204,245 2.061,246 1.18,247 0.48,248 0.4,249 0.32,250 3.618,253 4}
{0 CHEMBL1494871,1 1.653,2 9.333,3 3.265,4 10.661,5 90.872,6 8.754,7 0.462,8 3.77,9 3.848,10 3.51,11 3.417,12 5.007,13 3.38,14 4.265,15 4.377,16 3.932,17 3.824,18 5.57,19 3.754,20 4.517,21 4.655,22 4.064,23 3.939,24 5.779,25 3.855,26 4.51,27 4.654,28 4.009,29 3.835,30 5.948,31 3.772,32 4.48,33 4.639,34 3.796,35 3.766,36 5.785,37 3.703,38 4.455,39 4.628,40 3.726,41 3.668,42 5.761,43 3.612,44 4.328,45 4.495,46 3.62,47 3.476,48 5.912,49 3.443,50 4.088,51 4.24,52 3.271,53 3.303,54 5.665,55 3.236,56 0.077,57 0.497,58 6.148,59 3.732,60 13.5,61 3.964,62 0.288,63 0.84,64 13.203,65 6.629,66 41.027,67 7.306,68 0.335,69 1.095,70 22.346,71 8.893,72 50.749,73 8.854,74 0.458,75 1.024,76 22.727,77 8.794,78 70.852,79 8.837,80 0.372,81 0.968,82 19.992,83 8.226,84 68.878,85 8.658,86 0.435,87 0.964,88 20.656,89 7.719,90 77.752,91 7.879,92 0.625,93 0.818,94 18.783,95 6.677,96 103.488,97 6.986,98 0.518,99 0.618,100 12.415,101 4.975,102 108.912,103 5.052,104 27,105 37,106 0.293,107 0.617,108 0.76,109 0.86,110 0.869,111 0.869,112 3.229,113 0.955,114 -4.1,115 -4.05,116 -3.83,118 46.2,119 1,120 1,124 1,131 8,132 2,133 2,143 3,152 1,154 1,155 9,156 1,157 2,158 5,160 1,162 1,163 13,164 1,167 6,170 1,171 8,172 3,174 1,175 9,178 3,179 5,180 1,183 10,187 1,189 6,190 1,193 9,194 2,197 1,198 4,200 2,201 6,202 1,203 2,206 6,208 1,209 1,211 1,213 9,214 2,217 2,221 2,222 8,223 2,225 778,226 15.845,227 15.845,228 15.845,229 15.845,230 15.845,231 13.962,232 15.691,233 9.201,234 16.068,235 12.79,236 12.79,237 12.79,238 12.79,239 12.79,240 9.916,241 15.624,242 4.329,243 13.171,244 3.632,245 1.802,246 0.994,247 0.43,248 0.378,249 0.378,250 3.904,253 4.463}
{0 CHEMBL1495386,1 1.52,2 9.957,3 2.367,4 5.603,5 87,6 8.141,7 0.48,8 3.755,9 3.832,10 3.399,11 3.301,12 4.981,13 3.313,14 4.231,15 4.352,16 3.714,17 3.626,18 5.452,19 3.635,20 4.319,21 4.439,22 3.747,23 3.704,24 5.544,25 3.69,26 4.407,27 4.563,28 3.644,29 3.685,30 5.534,31 3.65,32 4.43,33 4.598,34 3.631,35 3.656,36 5.599,37 3.615,38 4.373,39 4.557,40 3.53,41 3.509,42 5.615,43 3.47,44 4.162,45 4.357,46 3.32,47 3.305,48 5.351,49 3.272,50 3.965,51 4.132,52 3.121,53 3.217,54 5.159,55 3.155,56 0.06,57 0.476,58 6.321,59 3.543,60 5.511,61 3.874,62 0.357,63 0.741,64 12.904,65 5.484,66 28.86,67 5.951,68 0.287,69 0.815,70 13.283,71 6.259,72 19.765,73 7.05,74 0.336,75 0.872,76 16.324,77 6.843,78 32.259,79 7.732,80 0.431,81 0.879,82 17.512,83 7.086,84 31.725,85 8.268,86 0.508,87 0.827,88 17.401,89 6.483,90 50.376,91 7.757,92 0.4,93 0.652,94 14.757,95 5.399,96 40.296,97 6.456,98 0.31,99 0.557,100 10.819,101 4.395,102 28.469,103 5.164,104 14,105 34,106 0.271,107 0.618,108 0.751,109 0.834,110 0.853,111 0.862,112 3.188,113 0.839,114 -3.56,115 -3.53,116 -3.37,118 47.4,122 2,127 2,128 1,129 1,131 5,132 2,133 2,134 2,143 1,155 8,157 1,158 8,163 7,166 1,167 11,171 7,175 7,179 6,182 1,183 6,189 5,192 3,193 5,198 4,200 1,201 3,206 4,208 1,209 4,213 3,217 3,222 1,225 716,226 15.826,227 15.826,228 15.826,229 15.826,230 15.826,231 13.907,232 12.653,233 9.359,234 16.326,235 12.225,236 12.225,237 12.225,238 12.225,239 12.225,240 9.172,241 13.527,242 4.293,243 12.819,244 3.728,245 1.78,246 1.029,247 0.566,248 0.461,249 0.408,250 3.869,253 4}
{0 CHEMBL1508896,1 2.163,2 7.105,3 2.248,4 5.054,5 69.138,6 11.175,7 0.55,8 3.461,9 3.519,10 3.532,11 3.063,12 4.767,13 3.04,14 3.957,15 4.051,16 3.871,17 3.431,18 5.645,19 3.424,20 4.113,21 4.194,22 4.006,23 3.559,24 5.656,25 3.505,26 4.266,27 4.368,28 3.945,29 3.442,30 5.926,31 3.462,32 4.153,33 4.259,34 3.707,35 3.19,36 6.114,37 3.26,38 3.891,39 4.03,40 3.415,41 3.049,42 5.509,43 3.059,44 3.717,45 3.938,46 2.942,47 2.738,48 5.057,49 2.678,50 3.218,51 3.435,52 2.85,53 2.231,54 4.644,55 2.155,56 0.197,57 0.437,58 2.573,59 2.646,60 32.149,61 1.982,62 0.509,63 0.656,64 5.377,65 3.94,66 91.009,67 3.229,68 0.529,69 0.743,70 11.127,71 5.634,72 71.967,73 4.69,74 0.767,75 0.756,76 21.146,77 6.625,78 122.664,79 4.671,80 1.039,81 0.585,82 12.124,83 4.396,84 217.576,85 2.354,86 0.601,87 0.495,88 6.045,89 3.329,90 82.49,91 2.451,92 0.496,93 0.375,94 9.368,95 3.306,96 67.333,97 3.593,98 0.37,99 0.153,100 8.617,101 2.246,102 59.118,103 2.448,104 38,105 30,106 0.414,107 0.708,108 0.762,109 0.791,110 0.791,111 0.791,112 3.012,113 1.029,114 -4.1,115 -4.05,116 -3.83,118 37,122 1,131 4,133 2,136 1,140 1,145 1,151 2,155 2,157 4,163 4,166 5,167 4,171 4,174 6,175 6,182 4,183 6,193 10,201 5,209 2,217 2,225 417,226 11.963,227 11.963,228 11.963,229 11.963,230 11.963,231 10.021,232 10.8,233 6.731,234 12.579,235 9.797,236 9.797,237 9.797,238 9.797,239 9.797,240 6.883,241 7.914,242 3.117,243 10.895,244 2.592,245 1.051,246 0.769,247 0.621,248 0.621,249 0.621,250 3.651,252 1,253 4.752}
{0 CHEMBL1530893,1 1.69,2 10.05,3 2.927,4 8.568,5 77.699,6 8.75,7 0.571,8 3.586,9 3.692,10 3.273,11 3.191,12 4.817,13 3.172,14 4.036,15 4.172,16 3.629,17 3.527,18 5.331,19 3.483,20 4.278,21 4.447,22 3.611,23 3.594,24 5.54,25 3.531,26 4.231,27 4.431,28 3.417,29 3.431,30 5.487,31 3.356,32 4.145,33 4.371,34 3.281,35 3.221,36 5.418,37 3.171,38 3.905,39 4.12,40 3.128,41 3.111,42 5.121,43 3.046,44 3.718,45 3.885,46 3.215,47 3.093,48 5.043,49 3.035,50 3.768,51 3.959,52 3.033,53 3.087,54 5.166,55 2.978,56 0.057,57 0.446,58 4.927,59 2.703,60 5.882,61 3.21,62 0.181,63 0.674,64 9.253,65 4.577,66 15.349,67 5.715,68 0.303,69 0.806,70 16.146,71 5.689,72 42.987,73 6.517,74 0.248,75 0.758,76 16.298,77 5.687,78 29.879,79 6.959,80 0.344,81 0.678,82 15.329,83 4.953,84 49.636,85 5.974,86 0.284,87 0.535,88 12.585,89 3.994,90 41.104,91 4.845,92 0.22,93 0.449,94 9.094,95 3.316,96 27.261,97 4.02,98 0.232,99 0.456,100 10.017,101 3.941,102 39.636,103 5.143,104 18,105 28,106 0.313,107 0.594,108 0.673,109 0.763,110 0.796,111 0.808,112 3.056,113 0.91,114 -4.33,115 -4.27,116 -4.03,118 45.5,119 1,131 8,132 1,133 3,142 1,144 1,155 6,158 2,160 2,161 1,162 4,163 9,167 2,170 4,171 8,175 6,178 5,179 2,183 4,187 5,193 1,195 1,197 2,198 4,201 1,205 1,206 8,208 1,209 1,211 1,212 1,213 6,222 4,225 494,226 13.085,227 13.085,228 13.085,229 13.085,230 13.085,231 11.287,232 15.752,233 7.793,234 13.274,235 10.35,236 10.35,237 10.35,238 10.35,239 10.35,240 7.685,241 20.813,242 3.727,243 10.708,244 3.355,245 1.841,246 1.417,247 0.932,248 0.75,249 0.69,250 3.713,252 1,253 4.445}
{0 CHEMBL1542492,1 1.702,2 10.087,3 2.72,4 7.399,5 82.832,6 8.648,7 0.458,8 3.691,9 3.783,10 3.363,11 3.228,12 5.049,13 3.243,14 4.143,15 4.263,16 3.683,17 3.557,18 5.585,19 3.559,20 4.376,21 4.547,22 3.69,23 3.621,24 5.741,25 3.602,26 4.398,27 4.583,28 3.642,29 3.591,30 5.834,31 3.567,32 4.356,33 4.554,34 3.568,35 3.531,36 5.759,37 3.496,38 4.25,39 4.439,40 3.483,41 3.422,42 5.663,43 3.409,44 4.102,45 4.284,46 3.41,47 3.282,48 5.6,49 3.286,50 4.001,51 4.149,52 3.372,53 3.169,54 5.897,55 3.178,56 0.173,57 0.508,58 5.157,59 2.982,60 12.444,61 3.277,62 0.344,63 0.75,64 9.577,65 4.901,66 52.942,67 5.626,68 0.557,69 0.902,70 15.093,71 5.955,72 61.961,73 7.126,74 0.472,75 0.913,76 15.843,77 6.131,78 89.42,79 7.362,80 0.582,81 0.849,82 16.517,83 5.945,84 84.649,85 7.438,86 0.427,87 0.782,88 14.238,89 5.081,90 78.338,91 6.033,92 0.411,93 0.678,94 12.044,95 4.303,96 68.652,97 4.992,98 0.582,99 0.586,100 10.397,101 3.69,102 120.962,103 4.229,104 30,105 32,106 0.304,107 0.657,108 0.759,109 0.836,110 0.85,111 0.85,112 3.187,113 0.841,114 -2.92,115 -2.92,116 -2.82,118 44.4,119 1,124 1,127 1,128 1,131 7,132 1,139 1,140 1,143 2,151 2,155 8,157 2,158 6,160 1,162 3,163 8,166 2,167 6,170 3,171 7,174 1,175 5,176 1,178 2,179 5,182 2,183 7,185 1,187 2,189 5,193 8,197 1,198 4,200 2,201 5,203 1,206 5,208 4,209 4,211 2,213 5,217 5,222 4,225 776,226 15.215,227 15.215,228 15.215,229 15.215,230 15.215,231 13.199,232 15.958,233 9.045,234 15.319,235 11.75,236 11.75,237 11.75,238 11.75,239 11.75,240 8.619,241 18.751,242 4.191,243 11.891,244 3.468,245 1.49,246 0.921,247 0.486,248 0.41,249 0.41,250 3.844,253 4.845}
{0 CHEMBL1546005,1 1.934,2 8.524,3 1.404,4 1.972,5 87.584,6 10.318,7 0.261,8 3.629,9 3.688,10 3.68,11 3.363,12 4.723,13 3.269,14 4.199,15 4.299,16 4.071,17 3.779,18 5.54,19 3.668,20 4.465,21 4.627,22 3.941,23 3.801,24 5.679,25 3.683,26 4.361,27 4.541,28 3.94,29 3.743,30 5.626,31 3.581,32 4.162,33 4.234,34 4.099,35 3.763,36 5.5,37 3.557,38 4.043,39 4.121,40 3.883,41 3.429,42 5.883,43 3.34,44 3.686,45 3.834,46 3.219,47 3.152,48 4.917,49 3.009,50 3.707,51 3.886,52 3.055,53 3.081,54 4.812,55 2.92,56 0.094,57 0.483,58 4.782,59 3.497,60 20.138,61 3.183,62 0.328,63 0.887,64 16.729,65 6.968,66 58.687,67 6.038,68 0.501,69 1.069,70 22.043,71 9.04,72 86.586,73 8.023,74 0.551,75 0.975,76 21.727,77 8.7,78 85.202,79 7.879,80 0.296,81 0.877,82 29.753,83 9.918,84 57.719,85 6.614,86 0.528,87 0.717,88 17.144,89 6.595,90 107.578,91 4.405,92 0.152,93 0.51,94 11.535,95 4.506,96 21.795,97 4.288,98 0.195,99 0.489,100 8.324,101 4.046,102 31.325,103 4.139,104 17,105 34,106 0.356,107 0.71,108 0.84,109 0.885,110 0.885,111 0.885,112 3.104,113 1.224,114 -2.25,115 -2.29,116 -2.26,118 39.4,120 1,123 2,124 1,127 1,129 1,131 2,132 1,134 2,143 1,144 1,155 3,157 2,158 4,163 3,167 7,171 2,174 2,175 3,179 2,183 3,189 2,192 4,193 4,198 1,201 2,206 1,209 3,213 1,217 2,225 517,226 13.723,227 13.723,228 13.723,229 13.723,230 13.723,231 12.229,232 10.878,233 7.915,234 14.408,235 11.351,236 11.351,237 11.351,238 11.351,239 11.351,240 8.916,241 10.995,242 3.785,243 12.489,244 3.11,245 1.19,246 0.485,247 0.242,248 0.242,249 0.242,250 3.774,253 4.471}
{0 CHEMBL1546100,1 1.904,2 7.188,3 2.447,4 5.987,5 68.435,6 10.054,7 0.588,8 3.341,9 3.432,10 3.289,11 3.055,12 4.591,13 2.964,14 3.756,15 3.877,16 3.694,17 3.37,18 4.99,19 3.26,20 3.786,21 3.922,22 3.561,23 3.266,24 5.107,25 3.119,26 3.835,27 4.023,28 3.492,29 3.156,30 5.152,31 3.046,32 3.543,33 3.718,34 3.207,35 2.953,36 4.836,37 2.862,38 3.391,39 3.557,40 2.776,41 2.798,42 4.554,43 2.653,44 3.254,45 3.443,46 2.703,47 2.618,48 4.433,49 2.512,50 3.014,51 3.148,52 2.625,53 2.543,54 4.346,55 2.419,56 0.063,57 0.399,58 3.012,59 2.24,60 6.739,61 2.266,62 0.155,63 0.625,64 8.931,65 3.99,66 11.97,67 4.01,68 0.147,69 0.62,70 13.198,71 4.913,72 22.309,73 4.094,74 0.335,75 0.63,76 12.859,77 4.463,78 42.479,79 3.422,80 0.155,81 0.485,82 9.071,83 3.275,84 17.542,85 3.118,86 0.135,87 0.442,88 11.334,89 3.358,90 11.343,91 2.376,92 0.118,93 0.329,94 4.703,95 2.077,96 9.496,97 1.953,98 0.06,99 0.228,100 3.352,101 1.928,102 9.156,103 2.056,104 13,105 23,106 0.377,107 0.743,108 0.851,109 0.867,110 0.867,111 0.867,112 2.852,113 1.095,114 -3.43,115 -3.41,116 -3.26,118 40,119 1,126 1,128 1,131 2,138 1,139 1,143 1,146 1,147 1,151 1,155 3,158 3,160 2,162 2,163 3,167 4,168 1,170 2,171 2,174 1,175 5,179 2,182 1,183 4,187 2,189 2,193 2,197 1,201 2,206 2,209 1,213 5,222 2,225 248,226 10.569,227 10.569,228 10.569,229 10.569,230 10.569,231 9.117,232 8.671,233 6.289,234 11.069,235 8.379,236 8.379,237 8.379,238 8.379,239 8.379,240 6.167,241 11.208,242 2.988,243 9.223,244 2.74,245 0.895,246 0.35,247 0.27,248 0.27,249 0.27,250 3.495,253 4.959}
{0 CHEMBL1556867,1 1.58,2 11.417,3 3.082,4 9.499,5 94.915,6 7.676,7 0.654,8 3.845,9 3.958,10 3.447,11 3.353,12 5.021,13 3.351,14 4.318,15 4.484,16 3.718,17 3.676,18 5.41,19 3.663,20 4.422,21 4.586,22 3.689,23 3.747,24 5.521,25 3.691,26 4.506,27 4.721,28 3.543,29 3.684,30 5.463,31 3.598,32 4.469,33 4.702,34 3.498,35 3.63,36 5.397,37 3.554,38 4.322,39 4.507,40 3.543,41 3.653,42 5.361,43 3.574,44 4.483,45 4.734,46 3.481,47 3.604,48 5.431,49 3.521,50 4.245,51 4.459,52 3.335,53 3.426,54 5.265,55 3.357,56 0.067,57 0.625,58 8.066,59 3.694,60 8.901,61 4.612,62 0.252,63 0.919,64 15.232,65 5.601,66 18.766,67 7.065,68 0.283,69 0.99,70 16.55,71 6.742,72 25.291,73 8.632,74 0.223,75 0.982,76 20.035,77 7.521,78 27.161,79 10.004,80 0.39,81 0.932,82 20.483,83 6.853,84 29.579,85 9.177,86 0.184,87 0.895,88 15.151,89 6.349,90 18.713,91 8.552,92 0.343,93 0.955,94 20.904,95 6.839,96 32.016,97 9.563,98 0.311,99 0.776,100 15.481,101 5.178,102 24.113,103 6.992,104 6,105 34,106 0.275,107 0.579,108 0.744,109 0.817,110 0.833,111 0.833,112 3.227,113 0.865,114 -4.95,115 -4.86,116 -4.56,118 42.9,119 1,122 1,123 1,131 7,132 3,133 2,141 1,145 2,151 2,155 10,157 2,158 4,163 10,166 3,167 9,171 6,175 7,179 2,182 1,183 5,189 4,192 2,193 7,198 7,200 1,201 4,206 7,208 2,209 2,213 5,216 2,217 4,222 3,225 870,226 16.524,227 16.524,228 16.524,229 16.524,230 16.524,231 14.297,232 14.997,233 9.964,234 16.965,235 12.781,236 12.781,237 12.781,238 12.781,239 12.781,240 9.432,241 14.072,242 4.691,243 13.405,244 3.812,245 2.068,246 1.123,247 0.703,248 0.607,249 0.607,250 3.912,253 4}
{0 CHEMBL1577064,1 1.727,2 5.722,3 2.255,4 5.086,5 65.583,6 8.794,7 0.316,8 3.459,9 3.549,10 3.148,11 2.985,12 4.803,13 3.005,14 3.944,15 4.075,16 3.539,17 3.351,18 5.441,19 3.371,20 4.108,21 4.23,22 3.602,23 3.45,24 5.529,25 3.474,26 4.254,27 4.408,28 3.595,29 3.437,30 5.775,31 3.443,32 4.271,33 4.469,34 3.558,35 3.307,36 5.71,37 3.348,38 4.08,39 4.197,40 3.405,41 3.021,42 6.107,43 3.118,44 3.749,45 3.932,46 2.177,47 2.569,48 5.195,49 2.468,50 3.061,51 3.338,52 0.87,53 1.784,54 4.174,55 1.538,56 0.162,57 0.407,58 3.832,59 2.353,60 15.174,61 2.599,62 0.352,63 0.621,64 8.247,65 3.9,66 57.827,67 4.656,68 0.344,69 0.716,70 9.058,71 4.454,72 54.151,73 4.669,74 0.565,75 0.765,76 12.732,77 5.09,78 93.576,79 5.913,80 0.608,81 0.727,82 15.883,83 4.854,84 95.718,85 5.957,86 0.83,87 0.531,88 11.762,89 3.496,90 168.952,91 3.068,92 0.543,93 0.343,94 10.303,95 3.089,96 112.449,97 2.948,98 0.25,99 0.166,100 6.242,101 1.668,102 49.225,103 2.193,104 38,105 28,106 0.332,107 0.652,108 0.693,109 0.707,110 0.734,111 0.748,112 2.963,113 0.826,114 -3.59,115 -3.57,116 -3.4,118 42.9,119 2,127 2,131 2,132 2,133 2,143 2,151 2,155 6,157 3,158 6,163 6,166 1,167 8,171 4,174 3,175 10,179 2,182 2,183 12,189 4,192 4,193 10,198 4,201 2,206 2,225 358,226 11.414,227 11.414,228 11.414,229 11.414,230 11.414,231 9.939,232 15.948,233 6.411,234 11.514,235 9.297,236 9.297,237 9.297,238 9.297,239 9.297,240 6.937,241 20.768,242 2.977,243 9.432,244 3.08,245 1.411,246 1.197,247 1.125,248 0.982,249 0.911,250 3.601,253 4.752}
{0 CHEMBL1585339,1 1.569,2 9.95,3 4.893,4 23.939,5 83.4,6 8.806,7 0.571,8 3.623,9 3.727,10 3.327,11 3.287,12 4.745,13 3.231,14 4.118,15 4.27,16 3.698,17 3.655,18 5.242,19 3.569,20 4.364,21 4.546,22 3.789,23 3.765,24 5.474,25 3.648,26 4.372,27 4.568,28 3.749,29 3.626,30 5.563,31 3.488,32 4.227,33 4.482,34 3.274,35 3.401,36 5.229,37 3.26,38 3.999,39 4.21,40 3.392,41 3.279,42 5.226,43 3.181,44 3.842,45 4.001,46 3.294,47 3.241,48 5.09,49 3.152,50 3.857,51 4.034,52 3.279,53 3.23,54 5.096,55 3.094,56 0.018,57 0.427,58 5.419,59 3.014,60 4.882,61 3.942,62 0.103,63 0.684,64 11.439,65 5.296,66 14.315,67 6.992,68 0.133,69 0.821,70 20.271,71 7.414,72 27.247,73 9.46,74 0.337,75 0.817,76 26.732,77 7.247,78 47.899,79 8.746,80 0.203,81 0.731,82 19.799,83 6.516,84 32.687,85 8.395,86 0.243,87 0.544,88 16.545,89 5.214,90 36.363,91 6.553,92 0.143,93 0.476,94 11.007,95 4.049,96 26.704,97 4.749,98 0.231,99 0.469,100 13.682,101 4.337,102 36.918,103 5.197,104 18,105 28,106 0.289,107 0.603,108 0.75,109 0.843,110 0.857,111 0.857,112 3.056,113 1.024,114 -5.86,115 -5.72,116 -5.33,118 45.7,119 1,120 1,123 1,131 7,132 3,133 2,143 1,155 10,158 1,160 1,162 2,163 16,167 2,170 3,171 10,175 3,178 5,179 7,183 2,187 1,189 4,193 4,197 2,198 7,201 1,205 1,206 9,209 1,213 9,222 7,225 482,226 13.301,227 13.301,228 13.301,229 13.301,230 13.301,231 11.656,232 13.241,233 7.814,234 13.578,235 10.249,236 10.249,237 10.249,238 10.249,239 10.249,240 7.739,241 11.415,242 3.611,243 10.774,244 3.56,245 1.856,246 1.062,247 0.557,248 0.479,249 0.479,250 3.713,252 2,253 4.47}
{0 CHEMBL1593516,1 1.543,2 9.48,3 5.403,4 29.195,5 104.101,6 8.029,7 0.536,8 3.948,9 4.062,10 3.587,11 3.551,12 4.925,13 3.501,14 4.534,15 4.707,16 4.002,17 3.994,18 5.472,19 3.919,20 4.855,21 5.076,22 4.052,23 4.159,24 5.75,25 4.034,26 4.882,27 5.134,28 3.985,29 4.134,30 5.694,31 3.994,32 4.815,33 5.036,34 4.055,35 4.072,36 5.784,37 3.946,38 4.835,39 5.08,40 3.957,41 4.004,42 5.797,43 3.858,44 4.692,45 4.937,46 3.91,47 3.875,48 5.647,49 3.713,50 4.471,51 4.704,52 3.681,53 3.758,54 5.423,55 3.608,56 0.025,57 0.645,58 9.269,59 4.415,60 7.255,61 5.892,62 0.124,63 1.125,64 19.533,65 7.719,66 16.221,67 10.468,68 0.396,69 1.42,70 34.182,71 11.387,72 36.868,73 15.346,74 0.284,75 1.451,76 34.415,77 11.971,78 25.613,79 16.42,80 0.26,81 1.286,82 31.102,83 11.451,84 36.961,85 15.2,86 0.296,87 1.279,88 35.093,89 11.601,90 48.349,91 15.191,92 0.425,93 1.075,94 39.467,95 10.217,96 50.788,97 13.104,98 0.357,99 0.916,100 27.012,101 8.254,102 40.204,103 11.049,104 10,105 40,106 0.264,107 0.548,108 0.684,109 0.783,110 0.783,111 0.783,112 3.268,113 1.034,114 -4.94,115 -4.84,116 -4.54,118 42.6,120 3,123 4,124 1,131 6,132 2,133 2,139 2,155 7,158 6,163 11,167 5,168 2,171 11,174 1,179 7,183 2,187 6,189 6,193 6,197 5,198 3,201 5,206 3,212 2,213 8,217 2,222 12,225 926,226 16.947,227 16.947,228 16.947,229 16.947,230 16.947,231 15.195,232 14.663,233 10.02,234 17.458,235 13.869,236 13.869,237 13.869,238 13.869,239 13.869,240 11.183,241 12.857,242 4.836,243 14.832,244 4.012,245 2.348,246 1.554,247 0.979,248 0.979,249 0.979,250 3.966,252 2,253 4.991}
{0 CHEMBL1600553,1 1.778,2 13.815,3 2.646,4 6.999,5 103.213,6 8.266,7 0.393,8 3.941,9 4.059,10 3.568,11 3.437,12 5.156,13 3.431,14 4.423,15 4.579,16 3.904,17 3.758,18 5.67,19 3.727,20 4.664,21 4.87,22 3.894,23 3.824,24 5.916,25 3.756,26 4.613,27 4.819,28 3.903,29 3.742,30 5.95,31 3.697,32 4.543,33 4.745,34 3.867,35 3.683,36 5.897,37 3.627,38 4.435,39 4.634,40 3.741,41 3.682,42 5.669,43 3.578,44 4.38,45 4.589,46 3.61,47 3.621,48 5.649,49 3.509,50 4.316,51 4.522,52 3.539,53 3.518,54 5.683,55 3.434,56 0.136,57 0.693,58 8.372,59 3.969,60 12.016,61 4.788,62 0.354,63 1.037,64 16.51,65 6.338,66 33.792,67 8.312,68 0.669,69 1.186,70 26.585,71 8.352,72 77.16,73 10.612,74 0.557,75 1.115,76 25.318,77 7.599,78 76.817,79 9.283,80 0.645,81 1.028,82 24.139,83 7.112,84 87.394,85 8.585,86 0.514,87 0.98,88 21.203,89 7.168,90 63.491,91 8.44,92 0.421,93 0.932,94 22.107,95 7.242,96 65.369,97 8.717,98 0.471,99 0.83,100 18.56,101 6.349,102 64.095,103 8.111,104 31,105 36,106 0.304,107 0.643,108 0.804,109 0.882,110 0.882,111 0.882,112 3.338,113 0.938,114 -2.63,115 -2.65,116 -2.58,118 38.3,119 1,120 3,131 6,132 1,133 1,138 1,139 1,143 3,144 1,153 1,155 8,158 4,160 3,161 1,162 4,163 6,166 1,167 4,168 2,169 1,170 7,171 3,175 6,176 1,178 7,179 2,183 3,185 3,187 5,189 4,193 1,195 2,196 1,197 4,198 5,200 1,201 1,204 1,205 3,206 5,208 2,209 5,211 1,212 1,213 4,217 6,219 1,220 1,221 2,222 4,225 1271,226 17.991,227 17.991,228 17.991,229 17.991,230 17.991,231 16.153,232 16.975,233 11.05,234 18.191,235 13.77,236 13.77,237 13.77,238 13.77,239 13.77,240 10.84,241 18.252,242 5.22,243 14.049,244 3.777,245 1.797,246 0.857,247 0.399,248 0.399,249 0.399,250 4.001,253 4.59}
{0 CHEMBL1604659,1 1.433,2 11.591,3 3.685,4 13.576,5 89.654,6 6.782,7 0.522,8 3.843,9 3.971,10 3.316,11 3.366,12 4.917,13 3.327,14 4.351,15 4.537,16 3.621,17 3.688,18 5.402,19 3.628,20 4.587,21 4.796,22 3.577,23 3.772,24 5.633,25 3.681,26 4.565,27 4.824,28 3.416,29 3.716,30 5.487,31 3.581,32 4.469,33 4.712,34 3.391,35 3.637,36 5.496,37 3.507,38 4.439,39 4.703,40 3.229,41 3.492,42 5.439,43 3.365,44 4.239,45 4.512,46 3.111,47 3.321,48 5.17,49 3.211,50 4.022,51 4.224,52 3.067,53 3.293,54 5.128,55 3.188,56 0.037,57 0.602,58 9.844,59 4.11,60 7.709,61 5.629,62 0.148,63 0.916,64 17.275,65 6.507,66 21.176,67 9.133,68 0.381,69 1.076,70 23.008,71 7.608,72 43.553,73 10.577,74 0.197,75 1.04,76 22.211,77 7.911,78 31.063,79 11.5,80 0.176,81 0.944,82 19.966,83 7.459,84 34.187,85 10.697,86 0.23,87 0.889,88 19.997,89 6.32,90 38.986,91 9.325,92 0.191,93 0.724,94 16.363,95 5.245,96 25.829,97 7.735,98 0.294,99 0.628,100 12.794,101 4.468,102 32.178,103 6.342,104 19,105 30,106 0.251,107 0.571,108 0.717,109 0.781,110 0.797,111 0.797,112 3.144,113 0.965,114 -4.22,115 -4.16,116 -3.93,118 40.9,119 3,123 1,124 1,131 8,132 1,133 3,143 1,155 7,158 4,160 1,162 4,163 9,167 2,168 1,169 1,170 4,171 6,175 2,178 1,179 4,183 4,185 1,187 5,189 4,193 3,197 4,201 1,205 3,206 4,208 1,211 1,212 1,213 8,222 6,225 664,226 14.447,227 14.447,228 14.447,229 14.447,230 14.447,231 12.793,232 21.402,233 8.759,234 14.691,235 11.365,236 11.365,237 11.365,238 11.365,239 11.365,240 8.906,241 28.87,242 4.235,243 11.754,244 4.027,245 2.205,246 1.37,247 1.006,248 0.915,249 0.915,250 3.806,253 4.646}
{0 CHEMBL290426,1 1.406,2 9.579,3 3.132,4 9.807,5 75.198,6 7.093,7 0.6,8 3.649,9 3.764,10 3.156,11 3.23,12 4.787,13 3.19,14 4.125,15 4.286,16 3.425,17 3.573,18 5.227,19 3.496,20 4.407,21 4.631,22 3.439,23 3.637,24 5.453,25 3.534,26 4.39,27 4.623,28 3.299,29 3.483,30 5.606,31 3.372,32 4.263,33 4.508,34 3.051,35 3.351,36 5.289,37 3.222,38 4.146,39 4.403,40 2.899,41 3.256,42 5.089,43 3.111,44 4.019,45 4.281,46 2.865,47 3.163,48 4.978,49 3.028,50 3.883,51 4.123,52 2.832,53 3.064,54 4.971,55 2.959,56 0.036,57 0.467,58 7.539,59 3.448,60 7.752,61 4.466,62 0.096,63 0.736,64 12.776,65 5.583,66 13.958,67 7.509,68 0.123,69 0.91,70 18.412,71 7.196,72 28.125,73 9.845,74 0.347,75 0.863,76 18.947,77 6.557,78 64.742,79 8.983,80 0.211,81 0.759,82 16.749,83 5.789,84 43.644,85 7.911,86 0.172,87 0.679,88 14.836,89 5.297,90 33.456,91 7.362,92 0.113,93 0.595,94 12.913,95 4.86,96 23.801,97 6.797,98 0.129,99 0.502,100 11.29,101 4.249,102 27.087,103 5.686,104 5,105 25,106 0.258,107 0.578,108 0.702,109 0.827,110 0.876,111 0.876,112 3.008,113 0.956,114 -4.79,115 -4.7,116 -4.41,118 44.4,120 2,123 1,131 9,132 2,133 1,143 1,155 12,158 1,160 1,162 4,163 13,167 1,170 4,171 9,175 3,176 1,177 1,178 4,179 4,183 2,187 3,189 3,193 1,197 3,198 4,201 2,205 2,206 6,209 2,212 1,213 7,217 1,221 2,222 8,225 427,226 12.949,227 12.949,228 12.949,229 12.949,230 12.949,231 11.303,232 11.733,233 8.101,234 13.022,235 9.878,236 9.878,237 9.878,238 9.878,239 9.878,240 7.506,241 10.887,242 3.854,243 9.984,244 3.764,245 2.016,246 1.337,247 0.656,248 0.389,249 0.389,250 3.67,253 4.883}
{0 CHEMBL421701,1 1.402,2 11.519,3 6.707,4 44.98,5 124.372,6 7.832,7 0.533,8 3.988,9 4.098,10 3.704,11 3.691,12 4.998,13 3.593,14 4.495,15 4.66,16 4.112,17 4.073,18 5.417,19 3.948,20 4.693,21 4.904,22 4.129,23 4.193,24 5.533,25 4.03,26 4.692,27 4.865,28 4.021,29 4.222,30 5.554,31 4.028,32 4.711,33 4.918,34 3.7,35 4.117,36 5.539,37 3.901,38 4.692,39 4.956,40 3.509,41 3.962,42 5.46,43 3.743,44 4.558,45 4.845,46 3.37,47 3.789,48 5.28,49 3.565,50 4.322,51 4.584,52 3.548,53 3.653,54 5.084,55 3.447,56 0.047,57 0.657,58 10.846,59 4.853,60 8.988,61 6.352,62 0.143,63 1.16,64 21.608,65 8.299,66 15.672,67 10.628,68 0.187,69 1.423,70 31.007,71 11.561,72 19.071,73 13.887,74 0.159,75 1.405,76 33.55,77 12.61,78 17.602,79 14.52,80 0.146,81 1.38,82 33.027,83 12.792,84 21.887,85 15.437,86 0.127,87 1.296,88 27.756,89 11.639,90 24.637,91 15.496,92 0.123,93 1.145,94 25.845,95 10.496,96 21.375,97 13.771,98 0.142,99 0.935,100 22.812,101 8.326,102 16.468,103 10.596,104 9,105 41,106 0.234,107 0.538,108 0.694,109 0.833,110 0.896,111 0.896,112 3.339,113 1.105,114 -5.54,115 -5.41,116 -5.05,118 46,119 2,123 2,127 5,130 1,131 8,133 2,135 1,139 1,146 1,155 10,158 4,163 11,165 4,167 3,171 10,173 3,175 2,179 15,181 2,183 1,189 16,191 1,193 1,198 14,199 1,206 10,209 1,210 1,213 11,215 1,222 4,225 1030,226 18.999,227 18.999,228 18.999,229 18.999,230 18.999,231 16.518,232 13.462,233 11.379,234 19.613,235 14.723,236 14.723,237 14.723,238 14.723,239 14.723,240 10.964,241 12.071,242 5.202,243 15.764,244 4.242,245 2.419,246 1.477,247 0.645,248 0.27,249 0.27,250 4.042,253 4.71}
