{
  "data_set_description": {
    "collection_date": "November 2013",
    "creator": "Dr Jeremy Besnard, Dr Ivan Olier, Dr Noureddin Sadawi, Dr Larisa Soldatova, Dr Crina Grosan, Prof Ross King, Dr Richard Bickerton, Prof Andrew Hopkins and Dr Willem van Hoorn",
    "default_target_attribute": "pXC50",
    "description": "This dataset contains QSAR data (from ChEMBL version 17) showing activity values (unit is pseudo-pCI50) of several compounds on drug target ChEMBL_ID: CHEMBL2501 (TID: 10402), and it has 65 rows and 1230 features (not including molecule IDs and class feature: molecule_id and pXC50). The features represent Molecular Descriptors which were generated from SMILES strings. Missing value imputation was applied to this dataset (By choosing the Median).",
    "description_version": "1",
    "file_id": "3590145",
    "format": "ARFF",
    "id": "36525",
    "licence": "Public",
    "md5_checksum": "6e4f2953bba910485832065e1a51855f",
    "minio_url": "https://data.openml.org/datasets/0003/36525/dataset_36525.pq",
    "name": "QSAR-DATASET-FOR-DRUG-TARGET-CHEMBL2501",
    "original_data_url": "https://www.ebi.ac.uk/chembl/target/inspect/CHEMBL2501",
    "parquet_url": "https://data.openml.org/datasets/0003/36525/dataset_36525.pq",
    "processing_date": "2018-10-04 04:53:22",
    "row_id_attribute": "molecule_id",
    "status": "deactivated",
    "tag": [
      "MetaQSAR",
      "study_13"
    ],
    "upload_date": "2016-07-15T21:30:56",
    "url": "https://api.openml.org/data/v1/download/3590145/QSAR-DATASET-FOR-DRUG-TARGET-CHEMBL2501.arff",
    "version": "11",
    "visibility": "public"
  }
}