"molecule_id","AMW","C.","H.","Me","Mi","Mp","Mv","MW","N.","nAB","nAT","nB","nBM","nBO","nBR","nBT","nC","nCL","nCsp","nCsp2","nCsp3","nDB","nF","nH","nHet","nHM","nI","nN","nO","nP","nS","nSK","nTB","nX","O.","RBF","RBN","SCBO","Se","Si","Sp","Sv","X.","pXC50"
{1 9.113,2 26.3,3 36.8,4 1.073,5 1.166,6 0.598,7 0.63,8 173.15,9 15.8,10 5,11 19,13 6,14 12,16 19,17 5,20 3,21 2,22 1,24 7,25 7,28 3,29 4,32 12,35 21.1,36 0.158,37 3,38 15.5,39 20.382,40 22.163,41 11.358,42 11.977,44 4}
{0 CHEMBL1098101,1 8.508,2 27.3,3 40.9,4 1.058,5 1.163,6 0.596,7 0.614,8 187.18,9 13.6,10 5,11 22,13 6,14 13,16 22,17 6,20 3,21 3,22 1,24 9,25 7,28 3,29 4,32 13,35 18.2,36 0.182,37 4,38 16.5,39 23.265,40 25.578,41 13.119,42 13.504,44 4.387}
{0 CHEMBL121915,1 14.134,2 30.4,3 34.8,4 1.058,5 1.143,6 0.729,7 0.688,8 325.08,9 13,11 23,13 4,14 15,16 23,17 7,20 5,21 2,22 4,24 8,25 8,26 1,27 1,28 3,29 4,32 15,34 1,35 17.4,36 0.13,37 3,38 19,39 24.335,40 26.299,41 16.778,42 15.821,43 4.3,44 6.854}
{0 CHEMBL13378,1 8.095,2 30.4,3 43.5,4 1.046,5 1.152,6 0.603,7 0.609,8 186.19,9 8.7,10 5,11 23,13 6,14 13,16 23,17 7,20 4,21 3,22 1,24 10,25 6,28 2,29 4,32 13,35 17.4,36 0.13,37 3,38 16.5,39 24.047,40 26.495,41 13.875,42 14.009,44 4}
{0 CHEMBL154535,1 8.77,2 33.3,3 38.1,4 1.055,5 1.147,6 0.624,7 0.642,8 184.17,9 9.5,10 5,11 21,13 6,14 14,16 22,17 7,20 4,21 3,22 1,24 8,25 6,28 2,29 4,32 13,35 19,36 0.045,37 1,38 17.5,39 22.164,40 24.08,41 13.114,42 13.482,44 4.526}
{0 CHEMBL1738726,1 10.14,2 38.5,3 33.3,4 1.047,5 1.12,6 0.714,7 0.702,8 395.45,9 7.7,10 10,11 39,13 14,14 28,16 41,17 15,20 12,21 3,22 4,24 13,25 11,26 2,28 3,29 6,31 2,32 26,35 15.4,36 0.146,37 6,38 37,39 40.84,40 43.667,41 27.847,42 27.361,44 5.128}
{0 CHEMBL1812596,1 9.818,2 34.6,3 34.6,4 1.052,5 1.135,6 0.683,7 0.68,8 255.28,9 11.5,10 5,11 26,13 8,14 18,16 27,17 9,20 7,21 2,22 3,24 9,25 8,26 1,28 3,29 4,31 1,32 17,35 15.4,36 0.111,37 3,38 23.5,39 27.342,40 29.498,41 17.767,42 17.691,44 5.991}
{0 CHEMBL1812597,1 8.594,2 36.1,3 41.7,4 1.028,5 1.132,6 0.668,7 0.646,8 309.38,9 8.3,10 5,11 36,13 8,14 23,16 38,17 13,20 7,21 6,22 3,24 15,25 8,26 1,28 3,29 4,31 1,32 21,35 11.1,36 0.079,37 3,38 28.5,39 36.993,40 40.744,41 24.051,42 23.271,44 4.141}
{0 CHEMBL1812598,1 9.818,2 34.6,3 34.6,4 1.052,5 1.135,6 0.683,7 0.68,8 255.28,9 11.5,10 5,11 26,13 8,14 18,16 27,17 9,20 7,21 2,22 3,24 9,25 8,26 1,28 3,29 4,31 1,32 17,35 15.4,36 0.111,37 3,38 23.5,39 27.342,40 29.498,41 17.767,42 17.691,44 5.323}
{0 CHEMBL1812599,1 10.14,2 38.5,3 33.3,4 1.047,5 1.12,6 0.714,7 0.702,8 395.45,9 7.7,10 10,11 39,13 14,14 28,16 41,17 15,20 12,21 3,22 4,24 13,25 11,26 2,28 3,29 6,31 2,32 26,35 15.4,36 0.146,37 6,38 37,39 40.84,40 43.667,41 27.847,42 27.361,44 4.27}
{0 CHEMBL193087,1 8.303,2 29.4,3 41.2,4 1.043,5 1.161,6 0.615,7 0.62,8 282.3,9 17.6,10 10,11 34,13 11,14 21,16 35,17 10,20 5,21 5,22 1,24 14,25 10,28 6,29 4,32 20,35 11.8,36 0.143,37 5,38 27,39 35.454,40 39.488,41 20.898,42 21.095,44 4.149}
{0 CHEMBL2092841,1 8.77,2 33.3,3 38.1,4 1.055,5 1.147,6 0.624,7 0.642,8 184.17,9 9.5,10 5,11 21,13 6,14 14,16 22,17 7,20 4,21 3,22 1,24 8,25 6,28 2,29 4,32 13,35 19,36 0.045,37 1,38 17.5,39 22.164,40 24.08,41 13.114,42 13.482,44 4.268}
{0 CHEMBL22304,1 7.644,2 24.2,3 51.5,4 1.027,5 1.154,6 0.608,7 0.568,8 252.24,9 6.1,11 33,13 2,14 16,16 33,17 8,20 1,21 7,22 2,24 17,25 8,26 1,28 2,29 5,30 1,32 16,35 15.2,36 0.152,37 5,38 18,39 33.884,40 38.089,41 20.057,42 18.755,44 4}
{0 CHEMBL2312396,1 7.538,2 32.4,3 47.1,4 1.03,5 1.146,6 0.606,7 0.597,8 256.29,9 5.9,11 34,13 4,14 17,16 33,17 11,19 2,20 3,21 6,22 3,24 16,25 7,28 2,29 5,32 18,33 1,35 14.7,36 0.242,37 8,38 22,39 35.025,40 38.95,41 20.614,42 20.304,44 6.733}
{0 CHEMBL2312397,1 7.547,2 35.9,3 46.2,4 1.023,5 1.138,6 0.625,7 0.611,8 294.34,9 5.1,10 6,11 39,13 9,14 21,16 39,17 14,20 9,21 5,22 3,24 18,25 7,28 2,29 5,32 21,35 12.8,36 0.205,37 8,38 27,39 39.909,40 44.365,41 24.375,42 23.831,44 5.332}
{0 CHEMBL2312398,1 7.037,2 28.6,3 51.4,4 1.026,5 1.153,6 0.582,7 0.567,8 246.3,9 5.7,11 35,13 3,14 16,16 34,17 10,20 3,21 7,22 3,24 18,25 7,28 2,29 5,32 17,35 14.3,36 0.206,37 7,38 19,39 35.909,40 40.365,41 20.375,42 19.831,44 5.268}
{0 CHEMBL2312399,1 6.692,2 29.3,3 53.7,4 1.016,5 1.151,6 0.583,7 0.558,8 274.36,9 4.9,11 41,13 3,14 18,16 40,17 12,20 3,21 9,22 3,24 22,25 7,28 2,29 5,32 19,35 12.2,36 0.225,37 9,38 21,39 41.676,40 47.196,41 23.898,42 22.885,44 5.483}
{0 CHEMBL2312400,1 6.818,2 31,3 52.4,4 1.016,5 1.148,6 0.593,7 0.569,8 286.37,9 4.8,11 42,13 3,14 20,16 42,17 13,20 3,21 10,22 3,24 22,25 7,28 2,29 5,32 20,35 11.9,36 0.167,37 7,38 23,39 42.676,40 48.196,41 24.898,42 23.885,44 5.238}
{0 CHEMBL2312401,1 6.913,2 28.6,3 52.4,4 1.024,5 1.153,6 0.58,7 0.562,8 290.36,9 4.8,11 42,13 3,14 19,16 41,17 12,20 3,21 9,22 3,24 22,25 8,28 2,29 6,32 20,35 14.3,36 0.22,37 9,38 22,39 43.003,40 48.405,41 24.352,42 23.6,44 4.352}
{0 CHEMBL2312402,1 7.543,2 34.9,3 46.5,4 1.026,5 1.139,6 0.618,7 0.606,8 324.37,9 4.7,10 6,11 43,13 9,14 23,16 43,17 15,20 9,21 6,22 3,24 20,25 8,28 2,29 6,32 23,35 14,36 0.233,37 10,38 29,39 44.12,40 48.99,41 26.591,42 26.073,44 5.551}
{0 CHEMBL2312403,1 7.523,2 27.3,3 48.5,4 1.041,5 1.156,6 0.578,7 0.576,8 248.27,9 6.1,11 33,13 3,14 16,16 32,17 9,20 3,21 6,22 3,24 16,25 8,28 2,29 6,32 17,35 18.2,36 0.219,37 7,38 19,39 34.353,40 38.159,41 19.068,42 19.019,44 6.91}
{0 CHEMBL2312680,1 7.545,2 34.1,3 46.3,4 1.025,5 1.143,6 0.619,7 0.606,8 309.36,9 7.3,10 6,11 41,13 9,14 22,16 41,17 14,20 9,21 5,22 3,24 19,25 8,28 3,29 5,32 22,35 12.2,36 0.22,37 9,38 28,39 42.011,40 46.864,41 25.381,42 24.853,44 5.247}
{0 CHEMBL2312681,1 7.543,2 34.9,3 46.5,4 1.026,5 1.139,6 0.618,7 0.606,8 324.37,9 4.7,10 6,11 43,13 9,14 23,16 43,17 15,20 9,21 6,22 3,24 20,25 8,28 2,29 6,32 23,35 14,36 0.233,37 10,38 29,39 44.12,40 48.99,41 26.591,42 26.073,44 6.664}
{0 CHEMBL2312682,1 7.701,2 30.8,3 46.2,4 1.036,5 1.15,6 0.601,7 0.598,8 200.22,9 7.7,11 26,13 3,14 13,16 25,17 8,19 1,20 2,21 5,22 2,24 12,25 6,28 2,29 4,32 14,33 1,35 15.4,36 0.24,37 6,38 17,39 26.931,40 29.91,41 15.636,42 15.536,44 7.462}
{0 CHEMBL2312683,1 7.808,2 26.7,3 46.7,4 1.049,5 1.158,6 0.577,7 0.583,8 234.24,9 6.7,11 30,13 3,14 15,16 29,17 8,20 3,21 5,22 3,24 14,25 8,28 2,29 6,32 16,35 20,36 0.241,37 7,38 18,39 31.469,40 34.744,41 17.307,42 17.492,44 6.622}
{0 CHEMBL2312684,1 7.046,2 25.9,3 51.9,4 1.03,5 1.16,6 0.57,7 0.558,8 190.23,9 7.4,11 27,13 2,14 12,16 26,17 7,20 2,21 5,22 2,24 14,25 6,28 2,29 4,32 13,35 14.8,36 0.231,37 6,38 14,39 27.814,40 31.325,41 15.398,42 15.063,44 6.469}
{0 CHEMBL2312685,1 6.809,2 26.7,3 53.3,4 1.023,5 1.158,6 0.572,7 0.553,8 204.26,9 6.7,11 30,13 2,14 13,16 29,17 8,20 2,21 6,22 2,24 16,25 6,28 2,29 4,32 14,35 13.3,36 0.241,37 7,38 15,39 30.698,40 34.741,41 17.159,42 16.59,44 4.991}
{0 CHEMBL2312686,1 7.201,2 30.8,3 50,4 1.027,5 1.147,6 0.592,7 0.579,8 187.22,9 3.8,11 26,13 2,14 13,16 26,17 8,20 2,21 6,22 2,24 13,25 5,28 1,29 4,32 13,35 15.4,36 0.077,37 2,38 15,39 26.713,40 29.827,41 15.392,42 15.041,44 5.602}
{0 CHEMBL27130,1 7.134,2 31.3,3 50,4 1.022,5 1.148,6 0.599,7 0.581,8 228.28,9 6.3,10 5,11 32,13 6,14 16,16 32,17 10,20 4,21 6,22 1,24 16,25 6,28 2,29 4,32 16,35 12.5,36 0.125,37 4,38 19.5,39 32.698,40 36.741,41 19.159,42 18.59,44 5.597}
{0 CHEMBL274440,1 7.507,2 23.3,3 53.3,4 1.026,5 1.153,6 0.602,7 0.558,8 225.21,9 3.3,11 30,13 2,14 13,16 29,17 7,20 1,21 6,22 2,24 16,25 7,26 1,28 1,29 5,30 1,32 14,35 16.7,36 0.241,37 7,38 15,39 30.782,40 34.591,41 18.051,42 16.734,44 4}
{0 CHEMBL275040,1 7.109,2 33.3,3 50,4 1.02,5 1.141,6 0.605,7 0.586,8 213.26,9 3.3,11 30,13 3,14 15,16 30,17 10,20 4,21 6,22 3,24 15,25 5,28 1,29 4,32 15,35 13.3,36 0.133,37 4,38 18,39 30.596,40 34.242,41 18.154,42 17.568,44 7.484}
{0 CHEMBL276815,1 8.095,2 30.4,3 43.5,4 1.046,5 1.152,6 0.603,7 0.609,8 186.19,9 8.7,10 5,11 23,13 6,14 13,16 23,17 7,20 4,21 3,22 1,24 10,25 6,28 2,29 4,32 13,35 17.4,36 0.13,37 3,38 16.5,39 24.047,40 26.495,41 13.875,42 14.009,44 4.37}
{0 CHEMBL279561,1 6.727,2 31.3,3 53.1,4 1.015,5 1.146,6 0.591,7 0.565,8 215.28,9 3.1,11 32,13 2,14 15,16 32,17 10,20 2,21 8,22 2,24 17,25 5,28 1,29 4,32 15,35 12.5,36 0.125,37 4,38 17,39 32.48,40 36.658,41 18.915,42 18.095,44 6.433}
{0 CHEMBL279956,1 9.458,2 25,3 35,4 1.085,5 1.169,6 0.591,7 0.635,8 189.15,9 15,11 20,13 3,14 13,16 20,17 5,20 3,21 2,22 3,24 7,25 8,28 3,29 5,32 13,35 25,36 0.15,37 3,38 16,39 21.709,40 23.372,41 11.812,42 12.692,44 5.819}
{0 CHEMBL28472,1 7.686,2 35.5,3 45.2,4 1.026,5 1.14,6 0.626,7 0.615,8 238.27,9 6.5,10 5,11 31,13 7,14 18,16 32,17 11,20 6,21 5,22 2,24 14,25 6,28 2,29 4,32 17,35 12.9,36 0.094,37 3,38 22.5,39 31.814,40 35.325,41 19.398,42 19.063,44 6.701}
{0 CHEMBL288166,1 7.326,2 27.3,3 50,4 1.038,5 1.155,6 0.574,7 0.569,8 161.18,9 4.5,11 22,13 2,14 10,16 21,17 6,20 2,21 4,22 2,24 11,25 5,28 1,29 4,32 11,35 18.2,36 0.19,37 4,38 12,39 22.829,40 25.412,41 12.631,42 12.515,44 8.288}
{0 CHEMBL28862,1 8.215,2 20.8,3 50,4 1.042,5 1.157,6 0.605,7 0.57,8 197.15,9 4.2,11 24,13 2,14 11,16 23,17 5,20 1,21 4,22 2,24 12,25 7,26 1,28 1,29 5,30 1,32 12,35 20.8,36 0.217,37 5,38 13,39 25.015,40 27.76,41 14.528,42 13.68,44 4}
{0 CHEMBL30285,1 9.302,2 29.4,3 35.3,4 1.075,5 1.157,6 0.609,7 0.644,8 158.13,9 11.8,10 5,11 17,13 6,14 11,16 17,17 5,20 4,21 1,22 1,24 6,25 6,28 2,29 4,32 11,35 23.5,36 0.118,37 2,38 14.5,39 18.28,40 19.665,41 10.352,42 10.956,44 5.759}
{0 CHEMBL314690,1 7.958,2 30,3 45,4 1.047,5 1.15,6 0.593,7 0.599,8 159.16,9 5,11 20,13 2,14 11,16 20,17 6,20 2,21 4,22 2,24 9,25 5,28 1,29 4,32 11,35 20,36 0.15,37 3,38 13,39 20.945,40 22.997,41 11.869,42 11.988,44 6.155}
{0 CHEMBL337577,1 7.975,2 33.3,3 43.3,4 1.034,5 1.147,6 0.621,7 0.619,8 239.26,9 10,11 30,13 4,14 18,16 31,17 10,20 5,21 5,22 4,24 13,25 7,28 3,29 4,32 17,35 13.3,36 0.097,37 3,38 22,39 31.033,40 34.409,41 18.642,42 18.557,44 5.293}
{0 CHEMBL350704,1 7.113,2 41.7,3 47.9,4 1.003,5 1.123,6 0.65,7 0.618,8 341.44,9 2.1,10 12,11 48,13 14,14 26,16 49,17 20,20 14,21 6,22 2,24 23,25 5,28 1,29 4,32 25,35 8.3,36 0.184,37 9,38 34,39 48.131,40 53.903,41 31.199,42 29.675,44 4.879}
{0 CHEMBL351653,1 6.983,2 36.8,3 50,4 1.01,5 1.133,6 0.623,7 0.595,8 265.34,9 2.6,10 6,11 38,13 8,14 19,16 38,17 14,20 8,21 6,22 2,24 19,25 5,28 1,29 4,32 19,35 10.5,36 0.211,37 8,38 24,39 38.363,40 43.073,41 23.676,42 22.622,44 5.502}
{0 CHEMBL370038,1 9.08,2 28.6,3 35.7,4 1.06,5 1.166,6 0.621,7 0.644,8 254.24,9 21.4,10 10,11 28,13 11,14 19,16 29,17 8,20 5,21 3,22 1,24 10,25 10,28 6,29 4,32 18,35 14.3,36 0.138,37 4,38 25,39 29.687,40 32.658,41 17.375,42 18.041,44 6.959}
{0 CHEMBL370941,1 8.654,2 29,3 38.7,4 1.051,5 1.164,6 0.617,7 0.631,8 268.27,9 19.4,10 10,11 31,13 11,14 20,16 32,17 9,20 5,21 4,22 1,24 12,25 10,28 6,29 4,32 19,35 12.9,36 0.156,37 5,38 26,39 32.571,40 36.073,41 19.136,42 19.568,44 5.456}
{0 CHEMBL372643,1 8.303,2 29.4,3 41.2,4 1.043,5 1.161,6 0.615,7 0.62,8 282.3,9 17.6,10 10,11 34,13 11,14 21,16 35,17 10,20 5,21 5,22 1,24 14,25 10,28 6,29 4,32 20,35 11.8,36 0.171,37 6,38 27,39 35.454,40 39.488,41 20.898,42 21.095,44 4.495}
{0 CHEMBL373428,1 9.061,2 35.9,3 38.5,4 1.042,5 1.132,6 0.666,7 0.659,8 353.39,9 7.7,10 5,11 39,13 10,14 25,16 40,17 14,20 10,21 4,22 5,24 15,25 10,26 1,28 3,29 6,31 1,32 24,35 15.4,36 0.15,37 6,38 32.5,39 40.647,40 44.163,41 25.96,42 25.701,44 7.638}
{0 CHEMBL39338,1 6.97,2 41.2,3 49,4 1,5 1.124,6 0.646,7 0.612,8 355.47,9 2,10 12,11 51,13 14,14 27,16 52,17 21,20 14,21 7,22 2,24 25,25 5,28 1,29 4,32 26,35 7.8,36 0.192,37 10,38 35,39 51.014,40 57.318,41 32.961,42 31.202,44 5.471}
{0 CHEMBL39664,1 7.971,2 25,3 50,4 1.032,5 1.149,6 0.617,7 0.579,8 223.19,9 3.6,11 28,13 2,14 14,16 28,17 7,20 1,21 6,22 2,24 14,25 7,26 1,28 1,29 5,30 1,32 14,35 17.9,36 0.107,37 3,38 16,39 28.898,40 32.175,41 17.29,42 16.207,44 4}
{0 CHEMBL40123,1 7.276,2 42.2,3 46.7,4 1.005,5 1.122,6 0.654,7 0.626,8 327.41,9 2.2,10 12,11 45,13 14,14 25,16 46,17 19,20 14,21 5,22 2,24 21,25 5,28 1,29 4,32 24,35 8.9,36 0.174,37 8,38 33,39 45.247,40 50.488,41 29.438,42 28.149,44 4}
{0 CHEMBL431029,1 9.18,2 21.7,3 43.5,4 1.063,5 1.155,6 0.618,7 0.603,8 211.13,9 4.3,11 23,13 3,14 12,16 22,17 5,20 2,21 3,22 3,24 10,25 8,26 1,28 1,29 6,30 1,32 13,35 26.1,36 0.227,37 5,38 15,39 24.458,40 26.554,41 14.221,42 13.868,44 4}
{0 CHEMBL479804,1 7.526,2 27.6,3 48.3,4 1.039,5 1.156,6 0.581,7 0.579,8 218.24,9 6.9,11 29,13 3,14 14,16 28,17 8,20 3,21 5,22 3,24 14,25 7,28 2,29 5,32 15,35 17.2,36 0.25,37 7,38 17,39 30.142,40 33.535,41 16.852,42 16.778,44 5.57}
{0 CHEMBL479805,1 7.037,2 28.6,3 51.4,4 1.026,5 1.153,6 0.582,7 0.567,8 246.3,9 5.7,11 35,13 3,14 16,16 34,17 10,20 3,21 7,22 3,24 18,25 7,28 2,29 5,32 17,35 14.3,36 0.235,37 8,38 19,39 35.909,40 40.365,41 20.375,42 19.831,44 5.476}
{0 CHEMBL480169,1 7.245,2 40,3 47.3,4 1.008,5 1.128,6 0.644,7 0.617,8 398.5,9 3.6,10 12,11 55,13 15,14 30,16 56,17 22,20 15,21 7,22 3,24 26,25 7,28 2,29 5,32 29,35 9.1,36 0.196,37 11,38 39,39 55.443,40 62.026,41 35.421,42 33.938,44 4}
{0 CHEMBL482080,1 7.524,2 29,3 48.4,4 1.04,5 1.15,6 0.583,7 0.581,8 233.25,9 3.2,11 31,13 3,14 15,16 30,17 9,20 3,21 6,22 3,24 15,25 7,28 1,29 6,32 16,35 19.4,36 0.267,37 8,38 18,39 32.251,40 35.661,41 18.063,42 17.998,44 5.996}
{0 CHEMBL482097,1 7.241,2 34.9,3 48.8,4 1.021,5 1.137,6 0.613,7 0.595,8 311.37,9 2.3,11 43,13 5,14 22,16 43,17 15,20 7,21 8,22 5,24 21,25 7,28 1,29 6,32 22,35 14,36 0.163,37 7,38 27,39 43.902,40 48.907,41 26.347,42 25.578,44 8.418}
{0 CHEMBL492469,1 9.189,2 32.1,3 39.3,4 1.044,5 1.14,6 0.662,7 0.651,8 257.3,9 10.7,11 28,13 4,14 18,16 29,17 9,20 5,21 4,22 4,24 11,25 8,26 1,28 3,29 4,31 1,32 17,35 14.3,36 0.103,37 3,38 22,39 29.225,40 31.913,41 18.528,42 18.218,44 5.488}
{0 CHEMBL492630,1 9.818,2 34.6,3 34.6,4 1.052,5 1.135,6 0.683,7 0.68,8 255.28,9 11.5,10 5,11 26,13 8,14 18,16 27,17 9,20 7,21 2,22 3,24 9,25 8,26 1,28 3,29 4,31 1,32 17,35 15.4,36 0.111,37 3,38 23.5,39 27.342,40 29.498,41 17.767,42 17.691,44 5.438}
{0 CHEMBL500042,1 7.258,2 28.1,3 50,4 1.032,5 1.155,6 0.582,7 0.572,8 232.27,9 6.3,11 32,13 3,14 15,16 31,17 9,20 3,21 6,22 3,24 16,25 7,28 2,29 5,32 16,35 15.6,36 0.226,37 7,38 18,39 33.025,40 36.95,41 18.614,42 18.304,44 7.271}
{0 CHEMBL518313,1 7.342,2 35.7,3 47.6,4 1.019,5 1.138,6 0.622,7 0.604,8 308.37,9 4.8,10 6,11 42,13 9,14 22,16 42,17 15,20 9,21 6,22 3,24 20,25 7,28 2,29 5,32 22,35 11.9,36 0.214,37 9,38 28,39 42.793,40 47.78,41 26.137,42 25.358,44 4.67}
{0 CHEMBL553028,1 7.421,2 35.3,3 47.1,4 1.021,5 1.139,6 0.622,7 0.606,8 252.3,9 5.9,10 5,11 34,13 7,14 19,16 35,17 12,20 6,21 6,22 2,24 16,25 6,28 2,29 4,32 18,35 11.8,36 0.086,37 3,38 23.5,39 34.698,40 38.741,41 21.159,42 20.59,44 5.86}
{0 CHEMBL575060,1 7.745,2 26.3,3 47.4,4 1.05,5 1.158,6 0.572,7 0.578,8 147.15,9 5.3,11 19,13 2,14 9,16 18,17 5,20 2,21 3,22 2,24 9,25 5,28 1,29 4,32 10,35 21.1,36 0.222,37 4,38 11,39 19.945,40 21.997,41 10.869,42 10.988,44 6.308}
{0 CHEMBL72366,1 10.33,2 30,3 35,4 1.074,5 1.151,6 0.649,7 0.665,8 206.6,9 10,10 5,11 20,13 6,14 13,16 20,17 6,18 1,20 4,21 2,22 1,24 7,25 7,26 1,28 2,29 4,32 13,34 1,35 20,36 0.15,37 3,38 16.5,39 21.487,40 23.024,41 12.972,42 13.31,43 5,44 4.022}
{0 CHEMBL73698,1 12.553,2 30,3 35,4 1.07,5 1.146,6 0.673,7 0.675,8 251.05,9 10,10 5,11 20,13 6,14 13,15 1,16 20,17 6,20 4,21 2,22 1,24 7,25 7,26 1,28 2,29 4,32 13,34 1,35 20,36 0.15,37 3,38 16.5,39 21.393,40 22.921,41 13.466,42 13.508,43 5,44 4}
{0 CHEMBL94859,1 9.08,2 28.6,3 35.7,4 1.06,5 1.166,6 0.621,7 0.644,8 254.24,9 21.4,10 10,11 28,13 11,14 19,16 29,17 8,20 5,21 3,22 1,24 10,25 10,28 6,29 4,32 18,35 14.3,36 0.138,37 4,38 25,39 29.687,40 32.658,41 17.375,42 18.041,44 6.481}
