{
  "data_features": {
    "feature": [
      {
        "data_type": "nominal",
        "index": "0",
        "is_ignore": "false",
        "is_row_identifier": "true",
        "is_target": "false",
        "name": "molecule_id",
        "nominal_value": [
          "CHEMBL141337",
          "CHEMBL141544",
          "CHEMBL143596",
          "CHEMBL143732",
          "CHEMBL143902",
          "CHEMBL145539",
          "CHEMBL145567",
          "CHEMBL1791097",
          "CHEMBL1791099",
          "CHEMBL1791102",
          "CHEMBL1791105",
          "CHEMBL1791110",
          "CHEMBL1791112",
          "CHEMBL1791113",
          "CHEMBL1791114",
          "CHEMBL1791119",
          "CHEMBL1791120",
          "CHEMBL1791121",
          "CHEMBL1791125",
          "CHEMBL1791126",
          "CHEMBL1791129",
          "CHEMBL2112251",
          "CHEMBL2112252",
          "CHEMBL2112253",
          "CHEMBL2112254",
          "CHEMBL2112255",
          "CHEMBL2112256",
          "CHEMBL2112257",
          "CHEMBL2112258",
          "CHEMBL2112259",
          "CHEMBL2112260",
          "CHEMBL2112261",
          "CHEMBL2112262",
          "CHEMBL2112263",
          "CHEMBL2112264",
          "CHEMBL2112265",
          "CHEMBL2112266",
          "CHEMBL2112267",
          "CHEMBL2112268",
          "CHEMBL2112269",
          "CHEMBL2112270",
          "CHEMBL2112271",
          "CHEMBL2112272",
          "CHEMBL2112836",
          "CHEMBL2112837",
          "CHEMBL22323",
          "CHEMBL23068",
          "CHEMBL23069",
          "CHEMBL23279",
          "CHEMBL23324",
          "CHEMBL23344",
          "CHEMBL278323",
          "CHEMBL279912",
          "CHEMBL283768",
          "CHEMBL290698",
          "CHEMBL306051",
          "CHEMBL306511",
          "CHEMBL306526",
          "CHEMBL306978",
          "CHEMBL307356",
          "CHEMBL308611",
          "CHEMBL310112",
          "CHEMBL310482",
          "CHEMBL343681",
          "CHEMBL356719",
          "CHEMBL356791",
          "CHEMBL357864",
          "CHEMBL357865",
          "CHEMBL418012",
          "CHEMBL421121",
          "CHEMBL431767",
          "CHEMBL543448",
          "CHEMBL72451",
          "CHEMBL74386",
          "CHEMBL74849",
          "CHEMBL74981",
          "CHEMBL75520",
          "CHEMBL76225",
          "CHEMBL77682",
          "CHEMBL77706",
          "CHEMBL77836",
          "CHEMBL77856",
          "CHEMBL77938"
        ],
        "number_of_missing_values": "0"
      },
      {
        "data_type": "numeric",
        "index": "1",
        "is_ignore": "false",
        "is_row_identifier": "false",
        "is_target": "false",
        "name": "FCFP4_1024b164",
        "number_of_missing_values": "0"
      },
      {
        "data_type": "numeric",
        "index": "2",
        "is_ignore": "false",
        "is_row_identifier": "false",
        "is_target": "false",
        "name": "FCFP4_1024b862",
        "number_of_missing_values": "0"
      },
      {
        "data_type": "numeric",
        "index": "3",
        "is_ignore": "false",
        "is_row_identifier": "false",
        "is_target": "false",
        "name": "FCFP4_1024b948",
        "number_of_missing_values": "0"
      },
      {
        "data_type": "numeric",
        "index": "4",
        "is_ignore": "false",
        "is_row_identifier": "false",
        "is_target": "false",
        "name": "FCFP4_1024b429",
        "number_of_missing_values": "0"
      },
      {
        "data_type": "numeric",
        "index": "5",
        "is_ignore": "false",
        "is_row_identifier": "false",
        "is_target": "false",
        "name": "FCFP4_1024b202",
        "number_of_missing_values": "0"
      },
      {
        "data_type": "numeric",
        "index": "6",
        "is_ignore": "false",
        "is_row_identifier": "false",
        "is_target": "false",
        "name": "FCFP4_1024b203",
        "number_of_missing_values": "0"
      },
      {
        "data_type": "numeric",
        "index": "7",
        "is_ignore": "false",
        "is_row_identifier": "false",
        "is_target": "false",
        "name": "FCFP4_1024b332",
        "number_of_missing_values": "0"
      },
      {
        "data_type": "numeric",
        "index": "8",
        "is_ignore": "false",
        "is_row_identifier": "false",
        "is_target": "false",
        "name": "FCFP4_1024b490",
        "number_of_missing_values": "0"
      },
      {
        "data_type": "numeric",
        "index": "9",
        "is_ignore": "false",
        "is_row_identifier": "false",
        "is_target": "false",
        "name": "FCFP4_1024b567",
        "number_of_missing_values": "0"
      },
      {
        "data_type": "numeric",
        "index": "10",
        "is_ignore": "false",
        "is_row_identifier": "false",
        "is_target": "false",
        "name": "FCFP4_1024b603",
        "number_of_missing_values": "0"
      },
      {
        "data_type": "numeric",
        "index": "11",
        "is_ignore": "false",
        "is_row_identifier": "false",
        "is_target": "false",
        "name": "FCFP4_1024b635",
        "number_of_missing_values": "0"
      },
      {
        "data_type": "numeric",
        "index": "12",
        "is_ignore": "false",
        "is_row_identifier": "false",
        "is_target": "false",
        "name": "FCFP4_1024b69",
        "number_of_missing_values": "0"
      },
      {
        "data_type": "numeric",
        "index": "13",
        "is_ignore": "false",
        "is_row_identifier": "false",
        "is_target": "false",
        "name": "FCFP4_1024b718",
        "number_of_missing_values": "0"
      },
      {
        "data_type": "numeric",
        "index": "14",
        "is_ignore": "false",
        "is_row_identifier": "false",
        "is_target": "false",
        "name": "FCFP4_1024b740",
        "number_of_missing_values": "0"
      },
      {
        "data_type": "numeric",
        "index": "15",
        "is_ignore": "false",
        "is_row_identifier": "false",
        "is_target": "false",
        "name": "FCFP4_1024b925",
        "number_of_missing_values": "0"
      },
      {
        "data_type": "numeric",
        "index": "16",
        "is_ignore": "false",
        "is_row_identifier": "false",
        "is_target": "false",
        "name": "FCFP4_1024b152",
        "number_of_missing_values": "0"
      },
      {
        "data_type": "numeric",
        "index": "17",
        "is_ignore": "false",
        "is_row_identifier": "false",
        "is_target": "false",
        "name": "FCFP4_1024b298",
        "number_of_missing_values": "0"
      },
      {
        "data_type": "numeric",
        "index": "18",
        "is_ignore": "false",
        "is_row_identifier": "false",
        "is_target": "false",
        "name": "FCFP4_1024b714",
        "number_of_missing_values": "0"
      },
      {
        "data_type": "numeric",
        "index": "19",
        "is_ignore": "false",
        "is_row_identifier": "false",
        "is_target": "false",
        "name": "FCFP4_1024b799",
        "number_of_missing_values": "0"
      },
      {
        "data_type": "numeric",
        "index": "20",
        "is_ignore": "false",
        "is_row_identifier": "false",
        "is_target": "false",
        "name": "FCFP4_1024b541",
        "number_of_missing_values": "0"
      },
      {
        "data_type": "numeric",
        "index": "21",
        "is_ignore": "false",
        "is_row_identifier": "false",
        "is_target": "false",
        "name": "FCFP4_1024b110",
        "number_of_missing_values": "0"
      },
      {
        "data_type": "numeric",
        "index": "22",
        "is_ignore": "false",
        "is_row_identifier": "false",
        "is_target": "false",
        "name": "FCFP4_1024b453",
        "number_of_missing_values": "0"
      },
      {
        "data_type": "numeric",
        "index": "23",
        "is_ignore": "false",
        "is_row_identifier": "false",
        "is_target": "false",
        "name": "FCFP4_1024b572",
        "number_of_missing_values": "0"
      },
      {
        "data_type": "numeric",
        "index": "24",
        "is_ignore": "false",
        "is_row_identifier": "false",
        "is_target": "false",
        "name": "FCFP4_1024b832",
        "number_of_missing_values": "0"
      },
      {
        "data_type": "numeric",
        "index": "25",
        "is_ignore": "false",
        "is_row_identifier": "false",
        "is_target": "false",
        "name": "FCFP4_1024b837",
        "number_of_missing_values": "0"
      },
      {
        "data_type": "numeric",
        "index": "26",
        "is_ignore": "false",
        "is_row_identifier": "false",
        "is_target": "false",
        "name": "FCFP4_1024b107",
        "number_of_missing_values": "0"
      },
      {
        "data_type": "numeric",
        "index": "27",
        "is_ignore": "false",
        "is_row_identifier": "false",
        "is_target": "false",
        "name": "FCFP4_1024b38",
        "number_of_missing_values": "0"
      },
      {
        "data_type": "numeric",
        "index": "28",
        "is_ignore": "false",
        "is_row_identifier": "false",
        "is_target": "false",
        "name": "FCFP4_1024b468",
        "number_of_missing_values": "0"
      },
      {
        "data_type": "numeric",
        "index": "29",
        "is_ignore": "false",
        "is_row_identifier": "false",
        "is_target": "false",
        "name": "FCFP4_1024b904",
        "number_of_missing_values": "0"
      },
      {
        "data_type": "numeric",
        "index": "30",
        "is_ignore": "false",
        "is_row_identifier": "false",
        "is_target": "false",
        "name": "FCFP4_1024b32",
        "number_of_missing_values": "0"
      },
      {
        "data_type": "numeric",
        "index": "31",
        "is_ignore": "false",
        "is_row_identifier": "false",
        "is_target": "false",
        "name": "FCFP4_1024b35",
        "number_of_missing_values": "0"
      },
      {
        "data_type": "numeric",
        "index": "32",
        "is_ignore": "false",
        "is_row_identifier": "false",
        "is_target": "false",
        "name": "FCFP4_1024b754",
        "number_of_missing_values": "0"
      },
      {
        "data_type": "numeric",
        "index": "33",
        "is_ignore": "false",
        "is_row_identifier": "false",
        "is_target": "false",
        "name": "FCFP4_1024b943",
        "number_of_missing_values": "0"
      },
      {
        "data_type": "numeric",
        "index": "34",
        "is_ignore": "false",
        "is_row_identifier": "false",
        "is_target": "false",
        "name": "FCFP4_1024b492",
        "number_of_missing_values": "0"
      },
      {
        "data_type": "numeric",
        "index": "35",
        "is_ignore": "false",
        "is_row_identifier": "false",
        "is_target": "false",
        "name": "FCFP4_1024b369",
        "number_of_missing_values": "0"
      },
      {
        "data_type": "numeric",
        "index": "36",
        "is_ignore": "false",
        "is_row_identifier": "false",
        "is_target": "false",
        "name": "FCFP4_1024b1",
        "number_of_missing_values": "0"
      },
      {
        "data_type": "numeric",
        "index": "37",
        "is_ignore": "false",
        "is_row_identifier": "false",
        "is_target": "false",
        "name": "FCFP4_1024b10",
        "number_of_missing_values": "0"
      },
      {
        "data_type": "numeric",
        "index": "38",
        "is_ignore": "false",
        "is_row_identifier": "false",
        "is_target": "false",
        "name": "FCFP4_1024b100",
        "number_of_missing_values": "0"
      },
      {
        "data_type": "numeric",
        "index": "39",
        "is_ignore": "false",
        "is_row_identifier": "false",
        "is_target": "false",
        "name": "FCFP4_1024b1000",
        "number_of_missing_values": "0"
      },
      {
        "data_type": "numeric",
        "index": "40",
        "is_ignore": "false",
        "is_row_identifier": "false",
        "is_target": "false",
        "name": "FCFP4_1024b1001",
        "number_of_missing_values": "0"
      },
      {
        "data_type": "numeric",
        "index": "41",
        "is_ignore": "false",
        "is_row_identifier": "false",
        "is_target": "false",
        "name": "FCFP4_1024b1002",
        "number_of_missing_values": "0"
      },
      {
        "data_type": "numeric",
        "index": "42",
        "is_ignore": "false",
        "is_row_identifier": "false",
        "is_target": "false",
        "name": "FCFP4_1024b1003",
        "number_of_missing_values": "0"
      },
      {
        "data_type": "numeric",
        "index": "43",
        "is_ignore": "false",
        "is_row_identifier": "false",
        "is_target": "false",
        "name": "FCFP4_1024b1004",
        "number_of_missing_values": "0"
      },
      {
        "data_type": "numeric",
        "index": "44",
        "is_ignore": "false",
        "is_row_identifier": "false",
        "is_target": "false",
        "name": "FCFP4_1024b1005",
        "number_of_missing_values": "0"
      },
      {
        "data_type": "numeric",
        "index": "45",
        "is_ignore": "false",
        "is_row_identifier": "false",
        "is_target": "false",
        "name": "FCFP4_1024b1006",
        "number_of_missing_values": "0"
      },
      {
        "data_type": "numeric",
        "index": "46",
        "is_ignore": "false",
        "is_row_identifier": "false",
        "is_target": "false",
        "name": "FCFP4_1024b1007",
        "number_of_missing_values": "0"
      },
      {
        "data_type": "numeric",
        "index": "47",
        "is_ignore": "false",
        "is_row_identifier": "false",
        "is_target": "false",
        "name": "FCFP4_1024b1008",
        "number_of_missing_values": "0"
      },
      {
        "data_type": "numeric",
        "index": "48",
        "is_ignore": "false",
        "is_row_identifier": "false",
        "is_target": "false",
        "name": "FCFP4_1024b1009",
        "number_of_missing_values": "0"
      },
      {
        "data_type": "numeric",
        "index": "49",
        "is_ignore": "false",
        "is_row_identifier": "false",
        "is_target": "false",
        "name": "FCFP4_1024b101",
        "number_of_missing_values": "0"
      },
      {
        "data_type": "numeric",
        "index": "50",
        "is_ignore": "false",
        "is_row_identifier": "false",
        "is_target": "false",
        "name": "FCFP4_1024b1010",
        "number_of_missing_values": "0"
      },
      {
        "data_type": "numeric",
        "index": "51",
        "is_ignore": "false",
        "is_row_identifier": "false",
        "is_target": "false",
        "name": "FCFP4_1024b1011",
        "number_of_missing_values": "0"
      },
      {
        "data_type": "numeric",
        "index": "52",
        "is_ignore": "false",
        "is_row_identifier": "false",
        "is_target": "false",
        "name": "FCFP4_1024b1012",
        "number_of_missing_values": "0"
      },
      {
        "data_type": "numeric",
        "index": "53",
        "is_ignore": "false",
        "is_row_identifier": "false",
        "is_target": "false",
        "name": "FCFP4_1024b1013",
        "number_of_missing_values": "0"
      },
      {
        "data_type": "numeric",
        "index": "54",
        "is_ignore": "false",
        "is_row_identifier": "false",
        "is_target": "false",
        "name": "FCFP4_1024b1014",
        "number_of_missing_values": "0"
      },
      {
        "data_type": "numeric",
        "index": "55",
        "is_ignore": "false",
        "is_row_identifier": "false",
        "is_target": "false",
        "name": "FCFP4_1024b1015",
        "number_of_missing_values": "0"
      },
      {
        "data_type": "numeric",
        "index": "56",
        "is_ignore": "false",
        "is_row_identifier": "false",
        "is_target": "false",
        "name": "FCFP4_1024b1016",
        "number_of_missing_values": "0"
      },
      {
        "data_type": "numeric",
        "index": "57",
        "is_ignore": "false",
        "is_row_identifier": "false",
        "is_target": "false",
        "name": "FCFP4_1024b1017",
        "number_of_missing_values": "0"
      },
      {
        "data_type": "numeric",
        "index": "58",
        "is_ignore": "false",
        "is_row_identifier": "false",
        "is_target": "false",
        "name": "FCFP4_1024b1018",
        "number_of_missing_values": "0"
      },
      {
        "data_type": "numeric",
        "index": "59",
        "is_ignore": "false",
        "is_row_identifier": "false",
        "is_target": "false",
        "name": "FCFP4_1024b1019",
        "number_of_missing_values": "0"
      },
      {
        "data_type": "numeric",
        "index": "60",
        "is_ignore": "false",
        "is_row_identifier": "false",
        "is_target": "false",
        "name": "FCFP4_1024b102",
        "number_of_missing_values": "0"
      },
      {
        "data_type": "numeric",
        "index": "61",
        "is_ignore": "false",
        "is_row_identifier": "false",
        "is_target": "false",
        "name": "FCFP4_1024b1020",
        "number_of_missing_values": "0"
      },
      {
        "data_type": "numeric",
        "index": "62",
        "is_ignore": "false",
        "is_row_identifier": "false",
        "is_target": "false",
        "name": "FCFP4_1024b1021",
        "number_of_missing_values": "0"
      },
      {
        "data_type": "numeric",
        "index": "63",
        "is_ignore": "false",
        "is_row_identifier": "false",
        "is_target": "false",
        "name": "FCFP4_1024b1022",
        "number_of_missing_values": "0"
      },
      {
        "data_type": "numeric",
        "index": "64",
        "is_ignore": "false",
        "is_row_identifier": "false",
        "is_target": "false",
        "name": "FCFP4_1024b1023",
        "number_of_missing_values": "0"
      },
      {
        "data_type": "numeric",
        "index": "65",
        "is_ignore": "false",
        "is_row_identifier": "false",
        "is_target": "false",
        "name": "FCFP4_1024b1024",
        "number_of_missing_values": "0"
      },
      {
        "data_type": "numeric",
        "index": "66",
        "is_ignore": "false",
        "is_row_identifier": "false",
        "is_target": "false",
        "name": "FCFP4_1024b103",
        "number_of_missing_values": "0"
      },
      {
        "data_type": "numeric",
        "index": "67",
        "is_ignore": "false",
        "is_row_identifier": "false",
        "is_target": "false",
        "name": "FCFP4_1024b104",
        "number_of_missing_values": "0"
      },
      {
        "data_type": "numeric",
        "index": "68",
        "is_ignore": "false",
        "is_row_identifier": "false",
        "is_target": "false",
        "name": "FCFP4_1024b105",
        "number_of_missing_values": "0"
      },
      {
        "data_type": "numeric",
        "index": "69",
        "is_ignore": "false",
        "is_row_identifier": "false",
        "is_target": "false",
        "name": "FCFP4_1024b106",
        "number_of_missing_values": "0"
      },
      {
        "data_type": "numeric",
        "index": "70",
        "is_ignore": "false",
        "is_row_identifier": "false",
        "is_target": "false",
        "name": "FCFP4_1024b108",
        "number_of_missing_values": "0"
      },
      {
        "data_type": "numeric",
        "index": "71",
        "is_ignore": "false",
        "is_row_identifier": "false",
        "is_target": "false",
        "name": "FCFP4_1024b109",
        "number_of_missing_values": "0"
      },
      {
        "data_type": "numeric",
        "index": "72",
        "is_ignore": "false",
        "is_row_identifier": "false",
        "is_target": "false",
        "name": "FCFP4_1024b11",
        "number_of_missing_values": "0"
      },
      {
        "data_type": "numeric",
        "index": "73",
        "is_ignore": "false",
        "is_row_identifier": "false",
        "is_target": "false",
        "name": "FCFP4_1024b111",
        "number_of_missing_values": "0"
      },
      {
        "data_type": "numeric",
        "index": "74",
        "is_ignore": "false",
        "is_row_identifier": "false",
        "is_target": "false",
        "name": "FCFP4_1024b112",
        "number_of_missing_values": "0"
      },
      {
        "data_type": "numeric",
        "index": "75",
        "is_ignore": "false",
        "is_row_identifier": "false",
        "is_target": "false",
        "name": "FCFP4_1024b113",
        "number_of_missing_values": "0"
      },
      {
        "data_type": "numeric",
        "index": "76",
        "is_ignore": "false",
        "is_row_identifier": "false",
        "is_target": "false",
        "name": "FCFP4_1024b114",
        "number_of_missing_values": "0"
      },
      {
        "data_type": "numeric",
        "index": "77",
        "is_ignore": "false",
        "is_row_identifier": "false",
        "is_target": "false",
        "name": "FCFP4_1024b115",
        "number_of_missing_values": "0"
      },
      {
        "data_type": "numeric",
        "index": "78",
        "is_ignore": "false",
        "is_row_identifier": "false",
        "is_target": "false",
        "name": "FCFP4_1024b116",
        "number_of_missing_values": "0"
      },
      {
        "data_type": "numeric",
        "index": "79",
        "is_ignore": "false",
        "is_row_identifier": "false",
        "is_target": "false",
        "name": "FCFP4_1024b117",
        "number_of_missing_values": "0"
      },
      {
        "data_type": "numeric",
        "index": "80",
        "is_ignore": "false",
        "is_row_identifier": "false",
        "is_target": "false",
        "name": "FCFP4_1024b118",
        "number_of_missing_values": "0"
      },
      {
        "data_type": "numeric",
        "index": "81",
        "is_ignore": "false",
        "is_row_identifier": "false",
        "is_target": "false",
        "name": "FCFP4_1024b119",
        "number_of_missing_values": "0"
      },
      {
        "data_type": "numeric",
        "index": "82",
        "is_ignore": "false",
        "is_row_identifier": "false",
        "is_target": "false",
        "name": "FCFP4_1024b12",
        "number_of_missing_values": "0"
      },
      {
        "data_type": "numeric",
        "index": "83",
        "is_ignore": "false",
        "is_row_identifier": "false",
        "is_target": "false",
        "name": "FCFP4_1024b120",
        "number_of_missing_values": "0"
      },
      {
        "data_type": "numeric",
        "index": "84",
        "is_ignore": "false",
        "is_row_identifier": "false",
        "is_target": "false",
        "name": "FCFP4_1024b121",
        "number_of_missing_values": "0"
      },
      {
        "data_type": "numeric",
        "index": "85",
        "is_ignore": "false",
        "is_row_identifier": "false",
        "is_target": "false",
        "name": "FCFP4_1024b122",
        "number_of_missing_values": "0"
      },
      {
        "data_type": "numeric",
        "index": "86",
        "is_ignore": "false",
        "is_row_identifier": "false",
        "is_target": "false",
        "name": "FCFP4_1024b123",
        "number_of_missing_values": "0"
      },
      {
        "data_type": "numeric",
        "index": "87",
        "is_ignore": "false",
        "is_row_identifier": "false",
        "is_target": "false",
        "name": "FCFP4_1024b124",
        "number_of_missing_values": "0"
      },
      {
        "data_type": "numeric",
        "index": "88",
        "is_ignore": "false",
        "is_row_identifier": "false",
        "is_target": "false",
        "name": "FCFP4_1024b125",
        "number_of_missing_values": "0"
      },
      {
        "data_type": "numeric",
        "index": "89",
        "is_ignore": "false",
        "is_row_identifier": "false",
        "is_target": "false",
        "name": "FCFP4_1024b126",
        "number_of_missing_values": "0"
      },
      {
        "data_type": "numeric",
        "index": "90",
        "is_ignore": "false",
        "is_row_identifier": "false",
        "is_target": "false",
        "name": "FCFP4_1024b127",
        "number_of_missing_values": "0"
      },
      {
        "data_type": "numeric",
        "index": "91",
        "is_ignore": "false",
        "is_row_identifier": "false",
        "is_target": "false",
        "name": "FCFP4_1024b128",
        "number_of_missing_values": "0"
      },
      {
        "data_type": "numeric",
        "index": "92",
        "is_ignore": "false",
        "is_row_identifier": "false",
        "is_target": "false",
        "name": "FCFP4_1024b129",
        "number_of_missing_values": "0"
      },
      {
        "data_type": "numeric",
        "index": "93",
        "is_ignore": "false",
        "is_row_identifier": "false",
        "is_target": "false",
        "name": "FCFP4_1024b13",
        "number_of_missing_values": "0"
      },
      {
        "data_type": "numeric",
        "index": "94",
        "is_ignore": "false",
        "is_row_identifier": "false",
        "is_target": "false",
        "name": "FCFP4_1024b130",
        "number_of_missing_values": "0"
      },
      {
        "data_type": "numeric",
        "index": "95",
        "is_ignore": "false",
        "is_row_identifier": "false",
        "is_target": "false",
        "name": "FCFP4_1024b131",
        "number_of_missing_values": "0"
      },
      {
        "data_type": "numeric",
        "index": "96",
        "is_ignore": "false",
        "is_row_identifier": "false",
        "is_target": "false",
        "name": "FCFP4_1024b132",
        "number_of_missing_values": "0"
      },
      {
        "data_type": "numeric",
        "index": "97",
        "is_ignore": "false",
        "is_row_identifier": "false",
        "is_target": "false",
        "name": "FCFP4_1024b133",
        "number_of_missing_values": "0"
      },
      {
        "data_type": "numeric",
        "index": "98",
        "is_ignore": "false",
        "is_row_identifier": "false",
        "is_target": "false",
        "name": "FCFP4_1024b134",
        "number_of_missing_values": "0"
      },
      {
        "data_type": "numeric",
        "index": "99",
        "is_ignore": "false",
        "is_row_identifier": "false",
        "is_target": "false",
        "name": "FCFP4_1024b135",
        "number_of_missing_values": "0"
      },
      {
        "data_type": "numeric",
        "index": "100",
        "is_ignore": "false",
        "is_row_identifier": "false",
        "is_target": "false",
        "name": "FCFP4_1024b136",
        "number_of_missing_values": "0"
      },
      {
        "data_type": "numeric",
        "index": "101",
        "is_ignore": "false",
        "is_row_identifier": "false",
        "is_target": "false",
        "name": "FCFP4_1024b137",
        "number_of_missing_values": "0"
      },
      {
        "data_type": "numeric",
        "index": "102",
        "is_ignore": "false",
        "is_row_identifier": "false",
        "is_target": "false",
        "name": "FCFP4_1024b138",
        "number_of_missing_values": "0"
      },
      {
        "data_type": "numeric",
        "index": "103",
        "is_ignore": "false",
        "is_row_identifier": "false",
        "is_target": "true",
        "name": "pXC50",
        "number_of_missing_values": "0"
      }
    ]
  }
}