{
  "data_set_description": {
    "collection_date": "November 2013",
    "creator": "Dr Jeremy Besnard, Dr Ivan Olier, Dr Noureddin Sadawi, Dr Larisa Soldatova, Dr Crina Grosan, Prof Ross King, Dr Richard Bickerton, Prof Andrew Hopkins and Dr Willem van Hoorn",
    "default_target_attribute": "pXC50",
    "description": "This dataset contains QSAR data (from ChEMBL version 17) showing activity values (unit is pseudo-pCI50) of several compounds on drug target ChEMBL_ID: CHEMBL4627 (TID: 12959), and it has 72 rows and 43 features (not including molecule IDs and class feature: molecule_id and pXC50). The features represent Basic Molecular Descriptors which were generated from SMILES strings.  Missing value imputation was applied to this dataset (By choosing the Median).",
    "description_version": "1",
    "file_id": "3589098",
    "format": "ARFF",
    "id": "36472",
    "licence": "Public",
    "md5_checksum": "321391f45bc238302ee66383383f2424",
    "minio_url": "https://data.openml.org/datasets/0003/36472/dataset_36472.pq",
    "name": "QSAR-DATASET-FOR-DRUG-TARGET-CHEMBL4627",
    "original_data_url": "https://www.ebi.ac.uk/chembl/target/inspect/CHEMBL4627",
    "parquet_url": "https://data.openml.org/datasets/0003/36472/dataset_36472.pq",
    "processing_date": "2018-10-04 04:49:20",
    "row_id_attribute": "molecule_id",
    "status": "deactivated",
    "tag": [
      "MetaQSAR",
      "study_13"
    ],
    "upload_date": "2016-07-15T21:20:29",
    "url": "https://api.openml.org/data/v1/download/3589098/QSAR-DATASET-FOR-DRUG-TARGET-CHEMBL4627.arff",
    "version": "10",
    "visibility": "public"
  }
}