{
  "data_features": {
    "feature": [
      {
        "data_type": "nominal",
        "index": "0",
        "is_ignore": "false",
        "is_row_identifier": "true",
        "is_target": "false",
        "name": "molecule_id",
        "nominal_value": [
          "CHEMBL1214795",
          "CHEMBL1299995",
          "CHEMBL1302463",
          "CHEMBL1308783",
          "CHEMBL1312377",
          "CHEMBL1318817",
          "CHEMBL1322745",
          "CHEMBL1325587",
          "CHEMBL1329129",
          "CHEMBL1329930",
          "CHEMBL1330332",
          "CHEMBL1334787",
          "CHEMBL1337591",
          "CHEMBL1338355",
          "CHEMBL1339013",
          "CHEMBL1339349",
          "CHEMBL1341159",
          "CHEMBL1342410",
          "CHEMBL1343814",
          "CHEMBL1344648",
          "CHEMBL1344977",
          "CHEMBL1345979",
          "CHEMBL1347253",
          "CHEMBL1363086",
          "CHEMBL1365833",
          "CHEMBL1371983",
          "CHEMBL1372651",
          "CHEMBL1375373",
          "CHEMBL1382826",
          "CHEMBL1383926",
          "CHEMBL1401989",
          "CHEMBL1405490",
          "CHEMBL1414923",
          "CHEMBL1417967",
          "CHEMBL1417992",
          "CHEMBL1418314",
          "CHEMBL1419292",
          "CHEMBL1419857",
          "CHEMBL1426637",
          "CHEMBL1430796",
          "CHEMBL1432378",
          "CHEMBL1432648",
          "CHEMBL1434002",
          "CHEMBL1438779",
          "CHEMBL1443750",
          "CHEMBL1444253",
          "CHEMBL1444349",
          "CHEMBL1447097",
          "CHEMBL1451037",
          "CHEMBL1454194",
          "CHEMBL1461181",
          "CHEMBL1461738",
          "CHEMBL1464186",
          "CHEMBL1465938",
          "CHEMBL1466110",
          "CHEMBL1469731",
          "CHEMBL1470212",
          "CHEMBL1470492",
          "CHEMBL1471660",
          "CHEMBL1478479",
          "CHEMBL1482926",
          "CHEMBL1486322",
          "CHEMBL1492662",
          "CHEMBL1498652",
          "CHEMBL1501771",
          "CHEMBL1502049",
          "CHEMBL1502683",
          "CHEMBL1505625",
          "CHEMBL1516663",
          "CHEMBL1519071",
          "CHEMBL1523347",
          "CHEMBL1527942",
          "CHEMBL1528481",
          "CHEMBL1541566",
          "CHEMBL1543739",
          "CHEMBL1545605",
          "CHEMBL1545792",
          "CHEMBL1546933",
          "CHEMBL1547176",
          "CHEMBL1550584",
          "CHEMBL1553908",
          "CHEMBL1557023",
          "CHEMBL1558692",
          "CHEMBL1558854",
          "CHEMBL1559226",
          "CHEMBL1564699",
          "CHEMBL1567670",
          "CHEMBL1576392",
          "CHEMBL1578843",
          "CHEMBL1578997",
          "CHEMBL1579263",
          "CHEMBL1582527",
          "CHEMBL1587286",
          "CHEMBL1588820",
          "CHEMBL1589350",
          "CHEMBL1604990",
          "CHEMBL1617055",
          "CHEMBL169811",
          "CHEMBL1699628",
          "CHEMBL1701797",
          "CHEMBL1702026",
          "CHEMBL1704311",
          "CHEMBL1705535",
          "CHEMBL1705697",
          "CHEMBL1706082",
          "CHEMBL1706392",
          "CHEMBL1708020",
          "CHEMBL1708074",
          "CHEMBL1708343",
          "CHEMBL1709153",
          "CHEMBL1713955",
          "CHEMBL1717079",
          "CHEMBL1721577",
          "CHEMBL1724744",
          "CHEMBL1725990",
          "CHEMBL1727666",
          "CHEMBL1730685",
          "CHEMBL1733942",
          "CHEMBL1734083",
          "CHEMBL1863929",
          "CHEMBL1864601",
          "CHEMBL1865285",
          "CHEMBL1865481",
          "CHEMBL1865517",
          "CHEMBL1865883",
          "CHEMBL1866012",
          "CHEMBL1867264",
          "CHEMBL1867414",
          "CHEMBL1867735",
          "CHEMBL1868007",
          "CHEMBL1868062",
          "CHEMBL1868199",
          "CHEMBL1868677",
          "CHEMBL1869612",
          "CHEMBL1870195",
          "CHEMBL1870359",
          "CHEMBL1870948",
          "CHEMBL1871042",
          "CHEMBL1871173",
          "CHEMBL1871292",
          "CHEMBL1871308",
          "CHEMBL1871970",
          "CHEMBL1872154",
          "CHEMBL1872415",
          "CHEMBL1872727",
          "CHEMBL1872793",
          "CHEMBL1872978",
          "CHEMBL1875259",
          "CHEMBL1875709",
          "CHEMBL1875828",
          "CHEMBL1875858",
          "CHEMBL1876362",
          "CHEMBL1877088",
          "CHEMBL1877469",
          "CHEMBL1877532",
          "CHEMBL1877571",
          "CHEMBL1877830",
          "CHEMBL1878374",
          "CHEMBL1879611",
          "CHEMBL1879703",
          "CHEMBL1879859",
          "CHEMBL1880038",
          "CHEMBL1880360",
          "CHEMBL1880647",
          "CHEMBL1880882",
          "CHEMBL1881317",
          "CHEMBL1881788",
          "CHEMBL1881953",
          "CHEMBL1882018",
          "CHEMBL1882595",
          "CHEMBL1883114",
          "CHEMBL1883547",
          "CHEMBL1884599",
          "CHEMBL1884740",
          "CHEMBL1885709",
          "CHEMBL1886203",
          "CHEMBL1887151",
          "CHEMBL1887735",
          "CHEMBL1888094",
          "CHEMBL1888104",
          "CHEMBL1888198",
          "CHEMBL1888270",
          "CHEMBL1888880",
          "CHEMBL1889180",
          "CHEMBL1889188",
          "CHEMBL1889345",
          "CHEMBL1889661",
          "CHEMBL1889670",
          "CHEMBL1889695",
          "CHEMBL1889913",
          "CHEMBL1890081",
          "CHEMBL1890734",
          "CHEMBL1891326",
          "CHEMBL1892332",
          "CHEMBL1893231",
          "CHEMBL1893603",
          "CHEMBL1895627",
          "CHEMBL1895705",
          "CHEMBL1896481",
          "CHEMBL1896660",
          "CHEMBL1898021",
          "CHEMBL1898878",
          "CHEMBL1899387",
          "CHEMBL1900041",
          "CHEMBL1900318",
          "CHEMBL1901046",
          "CHEMBL1901426",
          "CHEMBL1901940",
          "CHEMBL1902190",
          "CHEMBL1903268",
          "CHEMBL1903537",
          "CHEMBL1903920",
          "CHEMBL1903921",
          "CHEMBL1904169",
          "CHEMBL1904466",
          "CHEMBL1905037",
          "CHEMBL1905369",
          "CHEMBL1906648",
          "CHEMBL1968355",
          "CHEMBL1968669",
          "CHEMBL1975118",
          "CHEMBL1976317",
          "CHEMBL1994123",
          "CHEMBL2000342",
          "CHEMBL2000686",
          "CHEMBL263972",
          "CHEMBL297908",
          "CHEMBL51085",
          "CHEMBL584458",
          "CHEMBL600862",
          "CHEMBL75913"
        ],
        "number_of_missing_values": "0"
      },
      {
        "data_type": "numeric",
        "index": "1",
        "is_ignore": "false",
        "is_row_identifier": "false",
        "is_target": "false",
        "name": "N.072",
        "number_of_missing_values": "0"
      },
      {
        "data_type": "numeric",
        "index": "2",
        "is_ignore": "false",
        "is_row_identifier": "false",
        "is_target": "false",
        "name": "SpMAD_AEA.dm.",
        "number_of_missing_values": "0"
      },
      {
        "data_type": "numeric",
        "index": "3",
        "is_ignore": "false",
        "is_row_identifier": "false",
        "is_target": "false",
        "name": "Eig01_AEA.bo.",
        "number_of_missing_values": "0"
      },
      {
        "data_type": "numeric",
        "index": "4",
        "is_ignore": "false",
        "is_row_identifier": "false",
        "is_target": "false",
        "name": "SpMax_AEA.bo.",
        "number_of_missing_values": "0"
      },
      {
        "data_type": "numeric",
        "index": "5",
        "is_ignore": "false",
        "is_row_identifier": "false",
        "is_target": "false",
        "name": "SpMax1_Bh.m.",
        "number_of_missing_values": "0"
      },
      {
        "data_type": "numeric",
        "index": "6",
        "is_ignore": "false",
        "is_row_identifier": "false",
        "is_target": "false",
        "name": "C.039",
        "number_of_missing_values": "0"
      },
      {
        "data_type": "numeric",
        "index": "7",
        "is_ignore": "false",
        "is_row_identifier": "false",
        "is_target": "false",
        "name": "Eig01_EA.bo.",
        "number_of_missing_values": "0"
      },
      {
        "data_type": "numeric",
        "index": "8",
        "is_ignore": "false",
        "is_row_identifier": "false",
        "is_target": "false",
        "name": "SM11_AEA.ri.",
        "number_of_missing_values": "0"
      },
      {
        "data_type": "numeric",
        "index": "9",
        "is_ignore": "false",
        "is_row_identifier": "false",
        "is_target": "false",
        "name": "SpMax_EA.bo.",
        "number_of_missing_values": "0"
      },
      {
        "data_type": "numeric",
        "index": "10",
        "is_ignore": "false",
        "is_row_identifier": "false",
        "is_target": "false",
        "name": "SpDiam_EA.bo.",
        "number_of_missing_values": "0"
      },
      {
        "data_type": "numeric",
        "index": "11",
        "is_ignore": "false",
        "is_row_identifier": "false",
        "is_target": "false",
        "name": "SM15_EA.bo.",
        "number_of_missing_values": "0"
      },
      {
        "data_type": "numeric",
        "index": "12",
        "is_ignore": "false",
        "is_row_identifier": "false",
        "is_target": "false",
        "name": "SpMax3_Bh.p.",
        "number_of_missing_values": "0"
      },
      {
        "data_type": "numeric",
        "index": "13",
        "is_ignore": "false",
        "is_row_identifier": "false",
        "is_target": "false",
        "name": "P_VSA_LogP_2",
        "number_of_missing_values": "0"
      },
      {
        "data_type": "numeric",
        "index": "14",
        "is_ignore": "false",
        "is_row_identifier": "false",
        "is_target": "false",
        "name": "GATS6e",
        "number_of_missing_values": "0"
      },
      {
        "data_type": "numeric",
        "index": "15",
        "is_ignore": "false",
        "is_row_identifier": "false",
        "is_target": "false",
        "name": "SM14_EA.bo.",
        "number_of_missing_values": "0"
      },
      {
        "data_type": "numeric",
        "index": "16",
        "is_ignore": "false",
        "is_row_identifier": "false",
        "is_target": "false",
        "name": "nArC.N",
        "number_of_missing_values": "0"
      },
      {
        "data_type": "numeric",
        "index": "17",
        "is_ignore": "false",
        "is_row_identifier": "false",
        "is_target": "false",
        "name": "GATS5v",
        "number_of_missing_values": "0"
      },
      {
        "data_type": "numeric",
        "index": "18",
        "is_ignore": "false",
        "is_row_identifier": "false",
        "is_target": "false",
        "name": "Eig02_AEA.dm.",
        "number_of_missing_values": "0"
      },
      {
        "data_type": "numeric",
        "index": "19",
        "is_ignore": "false",
        "is_row_identifier": "false",
        "is_target": "false",
        "name": "SM04_EA.dm.",
        "number_of_missing_values": "0"
      },
      {
        "data_type": "numeric",
        "index": "20",
        "is_ignore": "false",
        "is_row_identifier": "false",
        "is_target": "false",
        "name": "SM06_EA.dm.",
        "number_of_missing_values": "0"
      },
      {
        "data_type": "numeric",
        "index": "21",
        "is_ignore": "false",
        "is_row_identifier": "false",
        "is_target": "false",
        "name": "GATS8p",
        "number_of_missing_values": "0"
      },
      {
        "data_type": "numeric",
        "index": "22",
        "is_ignore": "false",
        "is_row_identifier": "false",
        "is_target": "false",
        "name": "SM11_EA.bo.",
        "number_of_missing_values": "0"
      },
      {
        "data_type": "numeric",
        "index": "23",
        "is_ignore": "false",
        "is_row_identifier": "false",
        "is_target": "false",
        "name": "P_VSA_s_3",
        "number_of_missing_values": "0"
      },
      {
        "data_type": "numeric",
        "index": "24",
        "is_ignore": "false",
        "is_row_identifier": "false",
        "is_target": "false",
        "name": "SpMax3_Bh.v.",
        "number_of_missing_values": "0"
      },
      {
        "data_type": "numeric",
        "index": "25",
        "is_ignore": "false",
        "is_row_identifier": "false",
        "is_target": "false",
        "name": "NdsN",
        "number_of_missing_values": "0"
      },
      {
        "data_type": "numeric",
        "index": "26",
        "is_ignore": "false",
        "is_row_identifier": "false",
        "is_target": "false",
        "name": "SdsN",
        "number_of_missing_values": "0"
      },
      {
        "data_type": "numeric",
        "index": "27",
        "is_ignore": "false",
        "is_row_identifier": "false",
        "is_target": "false",
        "name": "SpDiam_AEA.bo.",
        "number_of_missing_values": "0"
      },
      {
        "data_type": "numeric",
        "index": "28",
        "is_ignore": "false",
        "is_row_identifier": "false",
        "is_target": "false",
        "name": "Eig01_EA.dm.",
        "number_of_missing_values": "0"
      },
      {
        "data_type": "numeric",
        "index": "29",
        "is_ignore": "false",
        "is_row_identifier": "false",
        "is_target": "false",
        "name": "SM08_EA.dm.",
        "number_of_missing_values": "0"
      },
      {
        "data_type": "numeric",
        "index": "30",
        "is_ignore": "false",
        "is_row_identifier": "false",
        "is_target": "false",
        "name": "SM10_EA.dm.",
        "number_of_missing_values": "0"
      },
      {
        "data_type": "numeric",
        "index": "31",
        "is_ignore": "false",
        "is_row_identifier": "false",
        "is_target": "false",
        "name": "SM12_EA.dm.",
        "number_of_missing_values": "0"
      },
      {
        "data_type": "numeric",
        "index": "32",
        "is_ignore": "false",
        "is_row_identifier": "false",
        "is_target": "false",
        "name": "SM14_EA.dm.",
        "number_of_missing_values": "0"
      },
      {
        "data_type": "numeric",
        "index": "33",
        "is_ignore": "false",
        "is_row_identifier": "false",
        "is_target": "false",
        "name": "SpMax_EA.dm.",
        "number_of_missing_values": "0"
      },
      {
        "data_type": "numeric",
        "index": "34",
        "is_ignore": "false",
        "is_row_identifier": "false",
        "is_target": "false",
        "name": "SpDiam_EA.dm.",
        "number_of_missing_values": "0"
      },
      {
        "data_type": "numeric",
        "index": "35",
        "is_ignore": "false",
        "is_row_identifier": "false",
        "is_target": "false",
        "name": "SM10_EA.bo.",
        "number_of_missing_values": "0"
      },
      {
        "data_type": "numeric",
        "index": "36",
        "is_ignore": "false",
        "is_row_identifier": "false",
        "is_target": "false",
        "name": "Eig01_AEA.dm.",
        "number_of_missing_values": "0"
      },
      {
        "data_type": "numeric",
        "index": "37",
        "is_ignore": "false",
        "is_row_identifier": "false",
        "is_target": "false",
        "name": "SpDiam_AEA.dm.",
        "number_of_missing_values": "0"
      },
      {
        "data_type": "numeric",
        "index": "38",
        "is_ignore": "false",
        "is_row_identifier": "false",
        "is_target": "false",
        "name": "SpMax_AEA.dm.",
        "number_of_missing_values": "0"
      },
      {
        "data_type": "numeric",
        "index": "39",
        "is_ignore": "false",
        "is_row_identifier": "false",
        "is_target": "false",
        "name": "SM05_EA.dm.",
        "number_of_missing_values": "0"
      },
      {
        "data_type": "numeric",
        "index": "40",
        "is_ignore": "false",
        "is_row_identifier": "false",
        "is_target": "false",
        "name": "SM09_EA.bo.",
        "number_of_missing_values": "0"
      },
      {
        "data_type": "numeric",
        "index": "41",
        "is_ignore": "false",
        "is_row_identifier": "false",
        "is_target": "false",
        "name": "SsssN",
        "number_of_missing_values": "0"
      },
      {
        "data_type": "numeric",
        "index": "42",
        "is_ignore": "false",
        "is_row_identifier": "false",
        "is_target": "false",
        "name": "SpMAD_EA.ed.",
        "number_of_missing_values": "0"
      },
      {
        "data_type": "numeric",
        "index": "43",
        "is_ignore": "false",
        "is_row_identifier": "false",
        "is_target": "false",
        "name": "SM13_EA.bo.",
        "number_of_missing_values": "0"
      },
      {
        "data_type": "numeric",
        "index": "44",
        "is_ignore": "false",
        "is_row_identifier": "false",
        "is_target": "false",
        "name": "CATS2D_06_LL",
        "number_of_missing_values": "0"
      },
      {
        "data_type": "numeric",
        "index": "45",
        "is_ignore": "false",
        "is_row_identifier": "false",
        "is_target": "false",
        "name": "Eta_sh_y",
        "number_of_missing_values": "0"
      },
      {
        "data_type": "numeric",
        "index": "46",
        "is_ignore": "false",
        "is_row_identifier": "false",
        "is_target": "false",
        "name": "SM02_EA.dm.",
        "number_of_missing_values": "0"
      },
      {
        "data_type": "numeric",
        "index": "47",
        "is_ignore": "false",
        "is_row_identifier": "false",
        "is_target": "false",
        "name": "P_VSA_LogP_8",
        "number_of_missing_values": "0"
      },
      {
        "data_type": "numeric",
        "index": "48",
        "is_ignore": "false",
        "is_row_identifier": "false",
        "is_target": "false",
        "name": "SM12_EA.bo.",
        "number_of_missing_values": "0"
      },
      {
        "data_type": "numeric",
        "index": "49",
        "is_ignore": "false",
        "is_row_identifier": "false",
        "is_target": "false",
        "name": "N.073",
        "number_of_missing_values": "0"
      },
      {
        "data_type": "numeric",
        "index": "50",
        "is_ignore": "false",
        "is_row_identifier": "false",
        "is_target": "false",
        "name": "ICR",
        "number_of_missing_values": "0"
      },
      {
        "data_type": "numeric",
        "index": "51",
        "is_ignore": "false",
        "is_row_identifier": "false",
        "is_target": "false",
        "name": "GATS5p",
        "number_of_missing_values": "0"
      },
      {
        "data_type": "numeric",
        "index": "52",
        "is_ignore": "false",
        "is_row_identifier": "false",
        "is_target": "false",
        "name": "Hy",
        "number_of_missing_values": "0"
      },
      {
        "data_type": "numeric",
        "index": "53",
        "is_ignore": "false",
        "is_row_identifier": "false",
        "is_target": "false",
        "name": "nN.C.N.",
        "number_of_missing_values": "0"
      },
      {
        "data_type": "numeric",
        "index": "54",
        "is_ignore": "false",
        "is_row_identifier": "false",
        "is_target": "false",
        "name": "NdS",
        "number_of_missing_values": "0"
      },
      {
        "data_type": "numeric",
        "index": "55",
        "is_ignore": "false",
        "is_row_identifier": "false",
        "is_target": "false",
        "name": "S.108",
        "number_of_missing_values": "0"
      },
      {
        "data_type": "numeric",
        "index": "56",
        "is_ignore": "false",
        "is_row_identifier": "false",
        "is_target": "false",
        "name": "SpMin3_Bh.e.",
        "number_of_missing_values": "0"
      },
      {
        "data_type": "numeric",
        "index": "57",
        "is_ignore": "false",
        "is_row_identifier": "false",
        "is_target": "false",
        "name": "SpMin3_Bh.i.",
        "number_of_missing_values": "0"
      },
      {
        "data_type": "numeric",
        "index": "58",
        "is_ignore": "false",
        "is_row_identifier": "false",
        "is_target": "false",
        "name": "MATS5m",
        "number_of_missing_values": "0"
      },
      {
        "data_type": "numeric",
        "index": "59",
        "is_ignore": "false",
        "is_row_identifier": "false",
        "is_target": "false",
        "name": "P_VSA_i_2",
        "number_of_missing_values": "0"
      },
      {
        "data_type": "numeric",
        "index": "60",
        "is_ignore": "false",
        "is_row_identifier": "false",
        "is_target": "false",
        "name": "ATS8p",
        "number_of_missing_values": "0"
      },
      {
        "data_type": "numeric",
        "index": "61",
        "is_ignore": "false",
        "is_row_identifier": "false",
        "is_target": "false",
        "name": "SdS",
        "number_of_missing_values": "0"
      },
      {
        "data_type": "numeric",
        "index": "62",
        "is_ignore": "false",
        "is_row_identifier": "false",
        "is_target": "false",
        "name": "TIC2",
        "number_of_missing_values": "0"
      },
      {
        "data_type": "numeric",
        "index": "63",
        "is_ignore": "false",
        "is_row_identifier": "false",
        "is_target": "false",
        "name": "CATS2D_07_LL",
        "number_of_missing_values": "0"
      },
      {
        "data_type": "numeric",
        "index": "64",
        "is_ignore": "false",
        "is_row_identifier": "false",
        "is_target": "false",
        "name": "P_VSA_s_5",
        "number_of_missing_values": "0"
      },
      {
        "data_type": "numeric",
        "index": "65",
        "is_ignore": "false",
        "is_row_identifier": "false",
        "is_target": "false",
        "name": "Eig03_EA.dm.",
        "number_of_missing_values": "0"
      },
      {
        "data_type": "numeric",
        "index": "66",
        "is_ignore": "false",
        "is_row_identifier": "false",
        "is_target": "false",
        "name": "nArCONR2",
        "number_of_missing_values": "0"
      },
      {
        "data_type": "numeric",
        "index": "67",
        "is_ignore": "false",
        "is_row_identifier": "false",
        "is_target": "true",
        "name": "pXC50",
        "number_of_missing_values": "0"
      }
    ]
  }
}