"molecule_id","FCFP4_1024b1020","FCFP4_1024b357","FCFP4_1024b1","FCFP4_1024b10","FCFP4_1024b100","FCFP4_1024b1000","FCFP4_1024b1001","FCFP4_1024b1002","FCFP4_1024b1003","FCFP4_1024b1004","FCFP4_1024b1005","FCFP4_1024b1006","FCFP4_1024b1007","FCFP4_1024b1008","FCFP4_1024b1009","FCFP4_1024b101","FCFP4_1024b1010","FCFP4_1024b1011","FCFP4_1024b1012","FCFP4_1024b1013","FCFP4_1024b1014","FCFP4_1024b1015","FCFP4_1024b1016","FCFP4_1024b1017","FCFP4_1024b1018","FCFP4_1024b1019","FCFP4_1024b102","FCFP4_1024b1021","FCFP4_1024b1022","FCFP4_1024b1023","FCFP4_1024b1024","FCFP4_1024b103","FCFP4_1024b104","FCFP4_1024b105","FCFP4_1024b106","FCFP4_1024b107","FCFP4_1024b108","FCFP4_1024b109","FCFP4_1024b11","FCFP4_1024b110","FCFP4_1024b111","FCFP4_1024b112","FCFP4_1024b113","FCFP4_1024b114","FCFP4_1024b115","FCFP4_1024b116","FCFP4_1024b117","FCFP4_1024b118","FCFP4_1024b119","FCFP4_1024b12","FCFP4_1024b120","pXC50"
{3 1,52 4.796}
{0 CHEMBL122254,3 1,5 1,52 4.432}
{0 CHEMBL122258,3 1,47 1,52 5.229}
{0 CHEMBL122335,3 1,52 4.456}
{0 CHEMBL122451,3 1,52 5.523}
{0 CHEMBL122544,3 1,37 1,48 1,52 4.959}
{0 CHEMBL122617,52 5.699}
{0 CHEMBL122809,3 1,52 4.886}
{0 CHEMBL122962,3 1,52 5.569}
{0 CHEMBL122986,3 1,52 5.06}
{0 CHEMBL123054,3 1,52 4.745}
{0 CHEMBL138218,3 1,52 4.921}
{0 CHEMBL138241,3 1,52 4.009}
{0 CHEMBL138557,3 1,52 4}
{0 CHEMBL138895,1 1,3 1,52 6}
{0 CHEMBL138923,3 1,26 1,52 4.398}
{0 CHEMBL172049,3 1,37 1,52 4.244}
{0 CHEMBL1907766,1 1,3 1,34 1,36 1,50 1,52 6.398}
{0 CHEMBL1907769,1 1,3 1,36 1,50 1,52 5.854}
{0 CHEMBL19490,3 1,52 4.824}
{0 CHEMBL25146,1 1,2 1,3 1,52 6.699}
{0 CHEMBL268501,3 1,52 7.155}
{0 CHEMBL27620,1 1,2 1,3 1,52 6.523}
{0 CHEMBL27873,3 1,36 1,52 4.222}
{0 CHEMBL280872,1 1,2 1,3 1,52 4.167}
{0 CHEMBL281012,1 1,2 1,3 1,52 7.523}
{0 CHEMBL282824,1 1,2 1,3 1,52 6.222}
{0 CHEMBL282828,1 1,2 1,3 1,52 6.699}
{0 CHEMBL28309,1 1,2 1,3 1,52 6.046}
{0 CHEMBL283267,1 1,2 1,3 1,52 7.097}
{0 CHEMBL283661,1 1,2 1,3 1,52 6.046}
{0 CHEMBL284189,1 1,2 1,3 1,52 4.523}
{0 CHEMBL284211,1 1,2 1,3 1,26 1,52 4.523}
{0 CHEMBL284647,1 1,2 1,3 1,52 6.523}
{0 CHEMBL28469,1 1,2 1,3 1,52 6.222}
{0 CHEMBL284879,1 1,2 1,3 1,26 1,52 6.155}
{0 CHEMBL284889,1 1,2 1,3 1,52 4.432}
{0 CHEMBL28507,1 1,2 1,3 1,52 7.699}
{0 CHEMBL28508,1 1,2 1,3 1,52 7.699}
{0 CHEMBL28511,1 1,2 1,3 1,26 1,52 6.398}
{0 CHEMBL285278,1 1,3 1,28 1,36 1,50 1,52 5.745}
{0 CHEMBL28543,1 1,2 1,3 1,52 7.155}
{0 CHEMBL28557,1 1,2 1,3 1,26 1,52 6}
{0 CHEMBL285781,1 1,2 1,3 1,52 6}
{0 CHEMBL286635,1 1,3 1,36 1,50 1,52 5.553}
{0 CHEMBL286716,1 1,2 1,3 1,52 7}
{0 CHEMBL28700,1 1,2 1,3 1,52 6.523}
{0 CHEMBL28703,1 1,2 1,3 1,52 6.523}
{0 CHEMBL28716,1 1,2 1,3 1,52 6}
{0 CHEMBL287336,1 1,3 1,36 1,50 1,52 6.699}
{0 CHEMBL28928,1 1,2 1,3 1,50 1,52 6}
{0 CHEMBL28955,1 1,2 1,3 1,52 6.699}
{0 CHEMBL28976,1 1,2 1,3 1,52 7.699}
{0 CHEMBL29028,1 1,2 1,3 1,26 1,52 4.959}
{0 CHEMBL29047,1 1,2 1,3 1,52 7.398}
{0 CHEMBL29112,1 1,2 1,3 1,52 6.097}
{0 CHEMBL291487,1 1,3 1,20 1,52 6}
{0 CHEMBL29174,1 1,2 1,3 1,52 4.921}
{0 CHEMBL292239,3 1,20 1,52 7.523}
{0 CHEMBL29291,1 1,2 1,3 1,52 7}
{0 CHEMBL29327,1 1,3 1,52 5.523}
{0 CHEMBL294159,3 1,20 1,52 5.699}
{0 CHEMBL300670,3 1,20 1,36 1,52 6.097}
{0 CHEMBL300982,3 1,20 1,52 6.678}
{0 CHEMBL301264,3 1,20 1,52 5.495}
{0 CHEMBL301693,3 1,20 1,52 5.444}
{0 CHEMBL31313,1 1,2 1,3 1,52 7.155}
{0 CHEMBL31870,1 1,2 1,3 1,52 4.301}
{0 CHEMBL32037,1 1,2 1,3 1,52 7}
{0 CHEMBL32342,1 1,2 1,3 1,52 5.268}
{0 CHEMBL331629,3 1,52 4.284}
{0 CHEMBL332663,3 1,52 4.886}
{0 CHEMBL33824,1 1,3 1,36 1,50 1,52 6.398}
{0 CHEMBL341922,3 1,26 1,52 5.469}
{0 CHEMBL36075,1 1,3 1,36 1,50 1,52 5.678}
{0 CHEMBL418035,1 1,2 1,3 1,52 7.301}
{0 CHEMBL432463,1 1,2 1,3 1,52 8.097}
{0 CHEMBL434588,1 1,2 1,3 1,26 1,52 4.77}
{0 CHEMBL435759,1 1,2 1,3 1,52 6.699}
{0 CHEMBL436147,1 1,2 1,3 1,26 1,52 7}
{0 CHEMBL436193,3 1,25 1,52 4.745}
{0 CHEMBL441960,1 1,2 1,3 1,26 1,52 6.155}
{0 CHEMBL52,3 1,26 1,52 4.854}
{0 CHEMBL527,3 1,36 1,52 4.187}
{0 CHEMBL538408,1 1,2 1,3 1,52 7.301}
{0 CHEMBL542142,3 1,26 1,52 4.208}
{0 CHEMBL544593,1 1,3 1,52 4.745}
{0 CHEMBL54485,3 1,20 1,52 5.347}
{0 CHEMBL54486,3 1,20 1,52 4.921}
{0 CHEMBL54506,3 1,20 1,52 7}
{0 CHEMBL54658,3 1,20 1,52 5.796}
{0 CHEMBL55414,3 1,20 1,52 5.699}
{0 CHEMBL554340,3 1,26 1,52 4.149}
{0 CHEMBL56033,3 1,20 1,52 4.921}
{0 CHEMBL56034,3 1,20 1,52 4.745}
{0 CHEMBL56161,3 1,20 1,52 7}
{0 CHEMBL56294,3 1,20 1,52 4.215}
{0 CHEMBL56600,3 1,20 1,52 5.469}
{0 CHEMBL57062,3 1,5 1,20 1,52 4.699}
{0 CHEMBL6,3 1,25 1,52 5.852}
{0 CHEMBL751,1 1,2 1,3 1,52 7.097}
{0 CHEMBL7568,3 1,4 1,13 1,36 1,52 4.487}
{0 CHEMBL7660,3 1,52 5.161}
{0 CHEMBL85000,3 1,52 5.469}
