{
  "data_qualities": {
    "quality": [
      {
        "name": "AutoCorrelation",
        "value": "-0.6302142857142863"
      },
      {
        "name": "CfsSubsetEval_DecisionStumpAUC",
        "value": []
      },
      {
        "name": "CfsSubsetEval_DecisionStumpErrRate",
        "value": []
      },
      {
        "name": "CfsSubsetEval_DecisionStumpKappa",
        "value": []
      },
      {
        "name": "CfsSubsetEval_NaiveBayesAUC",
        "value": []
      },
      {
        "name": "CfsSubsetEval_NaiveBayesErrRate",
        "value": []
      },
      {
        "name": "CfsSubsetEval_NaiveBayesKappa",
        "value": []
      },
      {
        "name": "CfsSubsetEval_kNN1NAUC",
        "value": []
      },
      {
        "name": "CfsSubsetEval_kNN1NErrRate",
        "value": []
      },
      {
        "name": "CfsSubsetEval_kNN1NKappa",
        "value": []
      },
      {
        "name": "ClassEntropy",
        "value": []
      },
      {
        "name": "DecisionStumpAUC",
        "value": []
      },
      {
        "name": "DecisionStumpErrRate",
        "value": []
      },
      {
        "name": "DecisionStumpKappa",
        "value": []
      },
      {
        "name": "Dimensionality",
        "value": "35.37931034482759"
      },
      {
        "name": "EquivalentNumberOfAtts",
        "value": []
      },
      {
        "name": "J48.00001.AUC",
        "value": []
      },
      {
        "name": "J48.00001.ErrRate",
        "value": []
      },
      {
        "name": "J48.00001.Kappa",
        "value": []
      },
      {
        "name": "J48.0001.AUC",
        "value": []
      },
      {
        "name": "J48.0001.ErrRate",
        "value": []
      },
      {
        "name": "J48.0001.Kappa",
        "value": []
      },
      {
        "name": "J48.001.AUC",
        "value": []
      },
      {
        "name": "J48.001.ErrRate",
        "value": []
      },
      {
        "name": "J48.001.Kappa",
        "value": []
      },
      {
        "name": "MajorityClassPercentage",
        "value": []
      },
      {
        "name": "MajorityClassSize",
        "value": []
      },
      {
        "name": "MaxAttributeEntropy",
        "value": []
      },
      {
        "name": "MaxKurtosisOfNumericAtts",
        "value": "29.000000000000032"
      },
      {
        "name": "MaxMeansOfNumericAtts",
        "value": "6.132586206896552"
      },
      {
        "name": "MaxMutualInformation",
        "value": []
      },
      {
        "name": "MaxNominalAttDistinctValues",
        "value": []
      },
      {
        "name": "MaxSkewnessOfNumericAtts",
        "value": "5.385164807134503"
      },
      {
        "name": "MaxStdDevOfNumericAtts",
        "value": "1.5356610609404244"
      },
      {
        "name": "MeanAttributeEntropy",
        "value": []
      },
      {
        "name": "MeanKurtosisOfNumericAtts",
        "value": "16.448057156063896"
      },
      {
        "name": "MeanMeansOfNumericAtts",
        "value": "0.03959108494533223"
      },
      {
        "name": "MeanMutualInformation",
        "value": []
      },
      {
        "name": "MeanNoiseToSignalRatio",
        "value": []
      },
      {
        "name": "MeanNominalAttDistinctValues",
        "value": []
      },
      {
        "name": "MeanSkewnessOfNumericAtts",
        "value": "3.7043799570167297"
      },
      {
        "name": "MeanStdDevOfNumericAtts",
        "value": "0.07015219829626705"
      },
      {
        "name": "MinAttributeEntropy",
        "value": []
      },
      {
        "name": "MinKurtosisOfNumericAtts",
        "value": "-2.148148148148149"
      },
      {
        "name": "MinMeansOfNumericAtts",
        "value": "0.0"
      },
      {
        "name": "MinMutualInformation",
        "value": []
      },
      {
        "name": "MinNominalAttDistinctValues",
        "value": []
      },
      {
        "name": "MinSkewnessOfNumericAtts",
        "value": "-2.7484939487504345"
      },
      {
        "name": "MinStdDevOfNumericAtts",
        "value": "0.0"
      },
      {
        "name": "MinorityClassPercentage",
        "value": []
      },
      {
        "name": "MinorityClassSize",
        "value": []
      },
      {
        "name": "NaiveBayesAUC",
        "value": []
      },
      {
        "name": "NaiveBayesErrRate",
        "value": []
      },
      {
        "name": "NaiveBayesKappa",
        "value": []
      },
      {
        "name": "NumberOfBinaryFeatures",
        "value": "0.0"
      },
      {
        "name": "NumberOfClasses",
        "value": "0.0"
      },
      {
        "name": "NumberOfFeatures",
        "value": "1026.0"
      },
      {
        "name": "NumberOfInstances",
        "value": "29.0"
      },
      {
        "name": "NumberOfInstancesWithMissingValues",
        "value": "0.0"
      },
      {
        "name": "NumberOfMissingValues",
        "value": "0.0"
      },
      {
        "name": "NumberOfNumericFeatures",
        "value": "1025.0"
      },
      {
        "name": "NumberOfSymbolicFeatures",
        "value": "1.0"
      },
      {
        "name": "PercentageOfBinaryFeatures",
        "value": "0.0"
      },
      {
        "name": "PercentageOfInstancesWithMissingValues",
        "value": "0.0"
      },
      {
        "name": "PercentageOfMissingValues",
        "value": "0.0"
      },
      {
        "name": "PercentageOfNumericFeatures",
        "value": "99.90253411306043"
      },
      {
        "name": "PercentageOfSymbolicFeatures",
        "value": "0.09746588693957114"
      },
      {
        "name": "Quartile1AttributeEntropy",
        "value": []
      },
      {
        "name": "Quartile1KurtosisOfNumericAtts",
        "value": "5.961428884505803"
      },
      {
        "name": "Quartile1MeansOfNumericAtts",
        "value": "0.0"
      },
      {
        "name": "Quartile1MutualInformation",
        "value": []
      },
      {
        "name": "Quartile1SkewnessOfNumericAtts",
        "value": "2.7484939487504314"
      },
      {
        "name": "Quartile1StdDevOfNumericAtts",
        "value": "0.0"
      },
      {
        "name": "Quartile2AttributeEntropy",
        "value": []
      },
      {
        "name": "Quartile2KurtosisOfNumericAtts",
        "value": "11.695473251028815"
      },
      {
        "name": "Quartile2MeansOfNumericAtts",
        "value": "0.0"
      },
      {
        "name": "Quartile2MutualInformation",
        "value": []
      },
      {
        "name": "Quartile2SkewnessOfNumericAtts",
        "value": "3.5905202400442784"
      },
      {
        "name": "Quartile2StdDevOfNumericAtts",
        "value": "0.0"
      },
      {
        "name": "Quartile3AttributeEntropy",
        "value": []
      },
      {
        "name": "Quartile3KurtosisOfNumericAtts",
        "value": "29.00000000000001"
      },
      {
        "name": "Quartile3MeansOfNumericAtts",
        "value": "0.03448275862068965"
      },
      {
        "name": "Quartile3MutualInformation",
        "value": []
      },
      {
        "name": "Quartile3SkewnessOfNumericAtts",
        "value": "5.385164807134492"
      },
      {
        "name": "Quartile3StdDevOfNumericAtts",
        "value": "0.1856953381770519"
      },
      {
        "name": "REPTreeDepth1AUC",
        "value": []
      },
      {
        "name": "REPTreeDepth1ErrRate",
        "value": []
      },
      {
        "name": "REPTreeDepth1Kappa",
        "value": []
      },
      {
        "name": "REPTreeDepth2AUC",
        "value": []
      },
      {
        "name": "REPTreeDepth2ErrRate",
        "value": []
      },
      {
        "name": "REPTreeDepth2Kappa",
        "value": []
      },
      {
        "name": "REPTreeDepth3AUC",
        "value": []
      },
      {
        "name": "REPTreeDepth3ErrRate",
        "value": []
      },
      {
        "name": "REPTreeDepth3Kappa",
        "value": []
      },
      {
        "name": "RandomTreeDepth1AUC",
        "value": []
      },
      {
        "name": "RandomTreeDepth1ErrRate",
        "value": []
      },
      {
        "name": "RandomTreeDepth1Kappa",
        "value": []
      },
      {
        "name": "RandomTreeDepth2AUC",
        "value": []
      },
      {
        "name": "RandomTreeDepth2ErrRate",
        "value": []
      },
      {
        "name": "RandomTreeDepth2Kappa",
        "value": []
      },
      {
        "name": "RandomTreeDepth3AUC",
        "value": []
      },
      {
        "name": "RandomTreeDepth3ErrRate",
        "value": []
      },
      {
        "name": "RandomTreeDepth3Kappa",
        "value": []
      },
      {
        "name": "StdvNominalAttDistinctValues",
        "value": []
      },
      {
        "name": "kNN1NAUC",
        "value": []
      },
      {
        "name": "kNN1NErrRate",
        "value": []
      },
      {
        "name": "kNN1NKappa",
        "value": []
      }
    ]
  }
}