"molecule_id","FCFP4_1024b142","FCFP4_1024b173","FCFP4_1024b281","FCFP4_1024b68","FCFP4_1024b711","FCFP4_1024b712","FCFP4_1024b825","FCFP4_1024b891","FCFP4_1024b940","FCFP4_1024b492","FCFP4_1024b859","FCFP4_1024b922","FCFP4_1024b574","FCFP4_1024b524","FCFP4_1024b61","FCFP4_1024b902","FCFP4_1024b171","FCFP4_1024b669","FCFP4_1024b1","FCFP4_1024b10","FCFP4_1024b100","FCFP4_1024b1000","FCFP4_1024b1001","FCFP4_1024b1002","FCFP4_1024b1003","FCFP4_1024b1004","FCFP4_1024b1005","FCFP4_1024b1006","FCFP4_1024b1007","FCFP4_1024b1008","FCFP4_1024b1009","FCFP4_1024b101","FCFP4_1024b1010","FCFP4_1024b1011","FCFP4_1024b1012","FCFP4_1024b1013","FCFP4_1024b1014","FCFP4_1024b1015","FCFP4_1024b1016","FCFP4_1024b1017","FCFP4_1024b1018","FCFP4_1024b1019","FCFP4_1024b102","FCFP4_1024b1020","FCFP4_1024b1021","FCFP4_1024b1022","FCFP4_1024b1023","FCFP4_1024b1024","FCFP4_1024b103","FCFP4_1024b104","FCFP4_1024b105","pXC50"
{13 1,15 1,16 1,19 1,52 4.91}
{0 CHEMBL1672291,14 1,15 1,16 1,18 1,19 1,52 4.377}
{0 CHEMBL1672292,15 1,16 1,18 1,19 1,52 4.301}
{0 CHEMBL1672293,15 1,16 1,18 1,19 1,52 4.495}
{0 CHEMBL1672294,15 1,16 1,18 1,19 1,42 1,52 4.409}
{0 CHEMBL1672295,15 1,16 1,18 1,19 1,52 4.301}
{0 CHEMBL1672296,15 1,16 1,18 1,19 1,38 1,52 4.301}
{0 CHEMBL1773168,11 1,12 1,13 1,19 1,52 4.301}
{0 CHEMBL1773180,18 1,19 1,20 1,44 1,52 4.301}
{0 CHEMBL1773181,18 1,19 1,20 1,44 1,52 4.301}
{0 CHEMBL2000194,10 1,15 1,16 1,19 1,42 1,52 5}
{0 CHEMBL2057662,10 1,13 1,19 1,42 1,52 4}
{0 CHEMBL2062528,1 1,2 1,3 1,4 1,5 1,6 1,7 1,8 1,9 1,10 1,11 1,12 1,13 1,14 1,19 1,52 4}
{0 CHEMBL2062590,1 1,2 1,3 1,4 1,5 1,6 1,7 1,8 1,9 1,10 1,11 1,12 1,13 1,14 1,17 1,19 1,52 4}
{0 CHEMBL2062591,1 1,2 1,3 1,4 1,5 1,6 1,7 1,8 1,9 1,10 1,11 1,12 1,13 1,14 1,17 1,19 1,42 1,52 4}
{0 CHEMBL2062592,1 1,2 1,3 1,4 1,5 1,6 1,7 1,8 1,9 1,10 1,11 1,12 1,13 1,14 1,17 1,19 1,52 4}
{0 CHEMBL2062593,1 1,2 1,3 1,4 1,5 1,6 1,7 1,8 1,9 1,10 1,11 1,12 1,13 1,14 1,17 1,19 1,52 4}
{0 CHEMBL2062594,1 1,2 1,3 1,4 1,5 1,6 1,7 1,8 1,9 1,10 1,11 1,12 1,13 1,14 1,17 1,19 1,52 4}
{0 CHEMBL2062595,1 1,2 1,3 1,4 1,5 1,6 1,7 1,8 1,9 1,10 1,11 1,12 1,13 1,14 1,17 1,19 1,52 4}
{0 CHEMBL2062596,1 1,2 1,3 1,4 1,5 1,6 1,7 1,8 1,9 1,10 1,11 1,12 1,13 1,14 1,17 1,19 1,52 4}
{0 CHEMBL2062597,1 1,2 1,3 1,4 1,5 1,6 1,7 1,8 1,9 1,10 1,11 1,12 1,13 1,14 1,17 1,19 1,52 4}
{0 CHEMBL2062598,1 1,2 1,3 1,4 1,5 1,6 1,7 1,8 1,9 1,10 1,11 1,12 1,13 1,14 1,17 1,19 1,52 4}
{0 CHEMBL2062599,1 1,2 1,3 1,4 1,5 1,6 1,7 1,8 1,9 1,10 1,11 1,12 1,13 1,14 1,17 1,19 1,52 4}
{0 CHEMBL2062707,1 1,2 1,3 1,4 1,5 1,6 1,7 1,8 1,9 1,10 1,11 1,12 1,13 1,14 1,17 1,19 1,52 4}
{0 CHEMBL2062708,1 1,2 1,3 1,4 1,5 1,6 1,7 1,8 1,9 1,10 1,11 1,12 1,13 1,14 1,17 1,19 1,52 4}
{0 CHEMBL2062709,1 1,2 1,3 1,4 1,5 1,6 1,7 1,8 1,9 1,10 1,11 1,12 1,13 1,14 1,17 1,19 1,52 4}
{0 CHEMBL2062710,1 1,2 1,3 1,4 1,5 1,6 1,7 1,8 1,9 1,10 1,11 1,12 1,13 1,14 1,19 1,52 4}
{0 CHEMBL2062711,1 1,2 1,3 1,4 1,5 1,6 1,7 1,8 1,9 1,10 1,11 1,12 1,13 1,14 1,19 1,52 4}
{0 CHEMBL2062712,1 1,2 1,3 1,4 1,5 1,6 1,7 1,8 1,9 1,10 1,11 1,12 1,13 1,14 1,19 1,52 4}
{0 CHEMBL2062713,1 1,2 1,3 1,4 1,5 1,6 1,7 1,8 1,9 1,10 1,11 1,12 1,13 1,14 1,19 1,52 4}
{0 CHEMBL2062714,1 1,2 1,3 1,4 1,5 1,6 1,7 1,8 1,9 1,10 1,11 1,12 1,13 1,14 1,19 1,52 4}
