"molecule_id","FCFP4_1024b1","FCFP4_1024b10","FCFP4_1024b100","FCFP4_1024b1000","FCFP4_1024b1001","FCFP4_1024b1002","FCFP4_1024b1003","FCFP4_1024b1004","FCFP4_1024b1005","FCFP4_1024b1006","FCFP4_1024b1007","FCFP4_1024b1008","FCFP4_1024b1009","FCFP4_1024b101","FCFP4_1024b1010","FCFP4_1024b1011","FCFP4_1024b1012","FCFP4_1024b1013","FCFP4_1024b1014","FCFP4_1024b1015","FCFP4_1024b1016","FCFP4_1024b1017","FCFP4_1024b1018","FCFP4_1024b1019","FCFP4_1024b102","FCFP4_1024b1020","FCFP4_1024b1021","FCFP4_1024b1022","FCFP4_1024b1023","FCFP4_1024b1024","FCFP4_1024b103","FCFP4_1024b104","FCFP4_1024b105","FCFP4_1024b106","FCFP4_1024b107","FCFP4_1024b108","FCFP4_1024b109","FCFP4_1024b11","FCFP4_1024b110","FCFP4_1024b111","FCFP4_1024b112","FCFP4_1024b113","FCFP4_1024b114","FCFP4_1024b115","FCFP4_1024b116","FCFP4_1024b117","FCFP4_1024b118","FCFP4_1024b119","FCFP4_1024b12","FCFP4_1024b120","FCFP4_1024b121","pXC50"
{1 1,39 1,52 7.983}
{0 CHEMBL1684194,1 1,19 1,35 1,52 6.886}
{0 CHEMBL1910411,1 1,2 1,35 1,52 5.469}
{0 CHEMBL27769,1 1,52 6.357}
{0 CHEMBL295827,1 1,39 1,52 8.371}
{0 CHEMBL313220,1 1,52 8.699}
{0 CHEMBL313343,1 1,52 6.627}
{0 CHEMBL313352,1 1,52 5}
{0 CHEMBL313374,1 1,52 6.833}
{0 CHEMBL313532,1 1,52 7.161}
{0 CHEMBL313626,1 1,52 8.114}
{0 CHEMBL314118,1 1,52 5}
{0 CHEMBL314154,1 1,36 1,52 7.31}
{0 CHEMBL314384,1 1,52 7.979}
{0 CHEMBL314419,1 1,52 5.86}
{0 CHEMBL314475,1 1,52 7.775}
{0 CHEMBL314477,1 1,52 7.013}
{0 CHEMBL315787,1 1,52 7.284}
{0 CHEMBL315817,1 1,2 1,52 5.861}
{0 CHEMBL315989,1 1,52 8.523}
{0 CHEMBL315991,1 1,52 8.276}
{0 CHEMBL409,1 1,2 1,35 1,49 1,52 5.252}
{0 CHEMBL420978,1 1,52 7.046}
{0 CHEMBL421536,1 1,52 5.659}
{0 CHEMBL422241,1 1,52 8.638}
{0 CHEMBL423844,1 1,39 1,52 7.096}
{0 CHEMBL445368,1 1,52 5}
{0 CHEMBL45777,1 1,39 1,52 8.742}
{0 CHEMBL47639,1 1,39 1,52 7.4}
{0 CHEMBL82911,1 1,7 1,52 6.262}
{0 CHEMBL82955,1 1,52 6}
{0 CHEMBL83064,1 1,52 6.07}
{0 CHEMBL83347,1 1,52 5}
{0 CHEMBL83471,1 1,52 5.755}
{0 CHEMBL84715,1 1,25 1,35 1,52 5.803}
{0 CHEMBL84895,1 1,2 1,52 7.387}
{0 CHEMBL85037,1 1,52 5.523}
{0 CHEMBL85157,1 1,52 8.187}
{0 CHEMBL85269,1 1,52 7.137}
{0 CHEMBL85438,1 1,52 5.723}
{0 CHEMBL85482,1 1,52 6.202}
{0 CHEMBL85513,1 1,52 5}
{0 CHEMBL85760,1 1,52 6.788}
{0 CHEMBL85780,1 1,52 6.161}
{0 CHEMBL85782,1 1,52 7.924}
{0 CHEMBL85913,1 1,23 1,52 5.397}
{0 CHEMBL86134,1 1,52 7.249}
{0 CHEMBL86141,1 1,52 8.222}
{0 CHEMBL86199,1 1,3 1,52 6}
{0 CHEMBL86310,1 1,52 8.495}
{0 CHEMBL87361,1 1,52 7.896}
{0 CHEMBL87362,1 1,52 8.046}
{0 CHEMBL87609,1 1,46 1,52 6.74}
{0 CHEMBL87692,1 1,52 5}
