"molecule_id","Sp","nAT","nBT","Si","Sv","nC","nH","nBO","MW","nSK","nCsp3","SCBO","Se","pXC50"
{1 49.409,2 79,3 80,4 89.568,5 48.576,6 29,7 36,8 44,9 604.67,10 43,11 12,12 55,13 81.152,14 4.523}
{0 CHEMBL106993,1 56.699,2 91,3 92,4 103.312,5 55.178,6 33,7 43,8 49,9 673.79,10 48,11 15,12 61,13 92.905,14 4.523}
{0 CHEMBL107729,1 64.676,2 102,3 104,4 115.352,5 62.946,6 39,7 47,8 57,9 765.89,10 55,11 15,12 72,13 104,14 4.523}
{0 CHEMBL1077438,1 61.25,2 100,3 102,4 113.308,5 58.274,6 36,7 52,8 50,9 676.88,10 48,11 22,12 58,13 100.901,14 4.357}
{0 CHEMBL1095726,1 47.949,2 76,3 77,4 86.141,5 44.12,6 27,7 41,8 36,9 503.78,10 35,11 17,12 44,13 75.479,14 4.914}
{0 CHEMBL1097720,1 49.063,2 79,3 80,4 89.637,5 45.459,6 29,7 43,8 37,9 497.75,10 36,11 17,12 45.5,13 78.287,14 4.818}
{0 CHEMBL1099219,1 47.847,2 76,3 78,4 86.012,5 44.218,6 29,7 41,8 37,9 479.73,10 35,11 17,12 45.5,13 75.076,14 5.018}
{0 CHEMBL1161222,1 33.739,2 50,3 51,4 57.46,5 32.518,6 18,7 20,8 31,9 470.32,10 30,11 6,12 39,13 52.451,14 4.041}
{0 CHEMBL1224683,1 29.864,2 41,3 43,4 45.495,5 26.996,6 18,7 19,8 24,9 375.36,10 22,11 5,12 31,13 40.462,14 5.742}
{0 CHEMBL1271266,1 25.04,2 35,3 37,4 38.747,5 24.229,6 16,7 13,8 24,9 315.37,10 22,12 34.5,13 35.789,14 6.475}
{0 CHEMBL1301519,1 38.097,2 59,3 60,4 67.089,5 34.905,6 20,7 31,8 29,9 427.07,10 28,11 12,12 34,13 58.832,14 4.928}
{0 CHEMBL1302298,1 30.029,2 45,3 46,4 50.784,5 29.04,6 17,7 19,8 27,9 377.46,10 26,11 3,12 37,13 46.087,14 5.384}
{0 CHEMBL1303831,1 39.568,2 59,3 61,4 66.03,5 38.841,6 26,7 24,8 37,9 476.52,10 35,11 4,12 50,13 60.214,14 4.783}
{0 CHEMBL1304265,1 25.778,2 36,3 38,4 40.495,5 25.734,6 15,7 11,8 27,9 357.38,10 25,11 1,12 38.5,13 37.545,14 5.613}
{0 CHEMBL1304345,1 29.449,2 41,3 44,4 45.531,5 27.654,6 19,7 17,8 27,9 335.46,10 24,11 3,12 38,13 40.894,14 6.22}
{0 CHEMBL1308781,1 32.381,2 44,3 46,4 48.756,5 30.672,6 20,7 17,8 29,9 495.18,10 27,11 4,12 38,13 44.822,14 4.23}
{0 CHEMBL1310336,1 44.108,2 63,3 67,4 70.401,5 42.421,6 28,7 25,8 42,9 527.65,10 38,11 4,12 59,13 63.731,14 5.53}
{0 CHEMBL1314093,1 34.256,2 52,3 53,4 58.607,5 31.288,6 20,7 27,8 26,9 357.57,10 25,11 8,12 33,13 51.312,14 5.767}
{0 CHEMBL1314584,1 31.523,2 44,3 47,4 49.099,5 29.723,6 19,7 18,8 29,9 387.92,10 26,11 5,12 38,13 44.429,14 5.706}
{0 CHEMBL1329712,1 33.682,2 49,3 52,4 54.571,5 32.643,6 23,7 20,8 32,9 388.45,10 29,11 3,12 44,13 49.465,14 6.434}
{0 CHEMBL1330962,1 40.284,2 61,3 63,4 68.571,5 38.367,6 24,7 28,8 35,9 472.61,10 33,11 8,12 46.5,13 61.731,14 5.041}
{0 CHEMBL1331139,1 29.159,2 41,3 43,4 45.573,5 26.158,6 17,7 20,8 23,9 316.53,10 21,11 6,12 29.5,13 40.309,14 5.509}
{0 CHEMBL1331149,1 43.898,2 65,3 68,4 73.511,5 41.016,6 23,7 30,8 38,9 540.17,10 35,11 10,12 47,13 65.782,14 5.959}
{0 CHEMBL1331791,1 24.949,2 37,3 39,4 41.614,5 24.369,6 16,7 15,8 24,9 297.34,10 22,11 2,12 32,13 37.589,14 4.721}
{0 CHEMBL1334491,1 33.836,2 49,3 51,4 54.906,5 31.136,6 19,7 23,8 28,9 389.59,10 26,11 6,12 37,13 48.949,14 5.504}
{0 CHEMBL1340607,1 30.353,2 46,3 47,4 52.136,5 27.588,6 16,7 24,8 23,9 341.95,10 22,11 9,12 27,13 45.752,14 6}
{0 CHEMBL1343331,1 31.568,2 45,3 47,4 50.076,5 30.304,6 20,7 18,8 29,9 382.47,10 27,11 3,12 39,13 45.658,14 5.021}
{0 CHEMBL1344075,1 33.04,2 49,3 51,4 54.982,5 30.046,6 20,7 25,8 26,9 339.55,10 24,11 7,12 33,13 48.101,14 5.488}
{0 CHEMBL1345966,1 26.642,2 38,3 40,4 42.409,5 26.557,6 18,7 13,8 27,9 335.34,10 25,12 39.5,13 39.033,14 5.229}
{0 CHEMBL1349800,1 9.932,2 15,3 15,4 17.412,5 10.515,6 5,7 4,8 11,9 152.13,10 11,12 16,13 16.062,14 5.658}
{0 CHEMBL1350887,1 34.108,2 44,3 48,4 48.794,5 33.013,6 21,7 13,8 35,9 470.36,10 31,11 1,12 49,13 45.305,14 6.388}
{0 CHEMBL1353918,1 38.324,2 58,3 60,4 65.228,5 34.627,6 23,7 31,8 29,9 381.64,10 27,11 10,12 36,13 56.752,14 6.03}
{0 CHEMBL1359614,1 31.795,2 42,3 44,4 46.295,5 30.339,6 18,7 14,8 30,9 434.55,10 28,11 2,12 40.5,13 43.371,14 5.824}
{0 CHEMBL1360394,1 36.018,2 55,3 56,4 62.022,5 32.815,6 21,7 29,8 27,9 371.6,10 26,11 9,12 34,13 54.196,14 4.821}
{0 CHEMBL1364175,1 28.506,2 42,3 44,4 47.416,5 27.687,6 17,7 17,8 27,9 364.43,10 25,11 4,12 36,13 43.171,14 5.333}
{0 CHEMBL1364192,1 34.233,2 50,3 52,4 55.86,5 32.95,6 23,7 21,8 31,9 387.47,10 29,11 2,12 43,13 50.24,14 5.4}
{0 CHEMBL1367604,1 24.966,2 38,3 39,4 42.863,5 22.686,6 14,7 20,8 19,9 264.43,10 18,11 7,12 23,13 37.56,14 5.409}
{0 CHEMBL1368444,1 28.619,2 35,3 37,4 38.256,5 27,6 17,7 10,8 27,9 432.34,10 25,11 1,12 38.5,13 35.876,14 5.106}
{0 CHEMBL1370165,1 38.511,2 53,3 57,4 58.914,5 37.708,6 26,7 18,8 39,9 487.54,10 35,11 2,12 53,13 54.273,14 6.354}
{0 CHEMBL1381413,1 32.182,2 49,3 52,4 55.734,5 31.675,6 19,7 20,8 32,9 396.45,10 29,11 6,12 43.5,13 50.105,14 6.132}
{0 CHEMBL1381758,1 29.551,2 41,3 42,4 45.66,5 27.556,6 17,7 17,8 25,9 359.51,10 24,11 4,12 34.5,13 41.298,14 5.623}
{0 CHEMBL1383849,1 34.83,2 48,3 50,4 53.336,5 33.758,6 21,7 17,8 33,9 505.37,10 31,11 3,12 44,13 49.542,14 5.199}
{0 CHEMBL1383966,1 40.886,2 62,3 64,4 69.784,5 39.985,6 24,7 26,8 38,9 518.59,10 36,11 7,12 50.5,13 63.829,14 5.815}
{0 CHEMBL1385949,1 39.16,2 61,3 62,4 69.212,5 35.222,6 21,7 34,8 28,9 412.1,10 27,11 14,12 32,13 60.17,14 6.17}
{0 CHEMBL1387238,1 36.034,2 51,3 54,4 57.18,5 35.481,6 23,7 18,8 36,9 463.91,10 33,11 2,12 49,13 52.327,14 5.703}
{0 CHEMBL1398814,1 25.25,2 35,3 37,4 38.771,5 24.869,6 17,7 12,8 25,9 329.75,10 23,11 1,12 34,13 36.036,14 5.55}
{0 CHEMBL1405203,1 24.103,2 34,3 35,4 38.08,5 21.47,6 13,7 17,8 18,9 313.29,10 17,11 6,12 22,13 33.578,14 5.726}
{0 CHEMBL140524,1 38.648,2 56,3 58,4 63.879,5 37.947,6 22,7 20,8 38,9 550.36,10 36,11 4,12 49,13 59.105,14 4.495}
{0 CHEMBL1405311,1 24.313,2 33,3 35,4 36.751,5 23.677,6 16,7 11,8 24,9 314.36,10 22,12 33,13 33.865,14 5.658}
{0 CHEMBL1406679,1 26.835,2 38,3 40,4 42.582,5 25.73,6 17,7 15,8 25,9 330.41,10 23,11 3,12 33,13 38.633,14 5.503}
{0 CHEMBL1407021,1 33.239,2 49,3 51,4 54.91,5 32.26,6 20,7 20,8 31,9 416.49,10 29,11 4,12 42,13 50.196,14 5.166}
{0 CHEMBL1407203,1 32.728,2 47,3 50,4 52.278,5 30.213,6 21,7 22,8 28,9 350.52,10 25,11 6,12 37,13 46.443,14 5.262}
{0 CHEMBL1408579,1 25.705,2 34,3 35,4 37.711,5 23.573,6 15,7 14,8 21,9 325.28,10 20,11 2,12 28,13 34.113,14 5.24}
{0 CHEMBL140954,1 38.648,2 56,3 58,4 63.879,5 37.947,6 22,7 20,8 38,9 550.36,10 36,11 4,12 49,13 59.105,14 4.796}
{0 CHEMBL1410244,1 23.608,2 34,3 35,4 38.182,5 21.272,6 13,7 17,8 18,9 268.84,10 17,11 6,12 22,13 33.673,14 6.498}
{0 CHEMBL1412602,1 28.25,2 45,3 46,4 51.108,5 25.266,6 15,7 26,8 20,9 282.5,10 19,11 13,12 22,13 44.211,14 5.005}
{0 CHEMBL1412803,1 35.239,2 52,3 55,4 58.358,5 33.971,6 23,7 22,8 33,9 402.49,10 30,11 5,12 44.5,13 52.342,14 4.928}
{0 CHEMBL1417141,1 29.921,2 43,3 45,4 48.068,5 29.526,6 20,7 16,8 29,9 390.81,10 27,11 4,12 38,13 44.425,14 5.606}
{0 CHEMBL1419452,1 40.284,2 59,3 61,4 66.301,5 36.356,6 22,7 30,8 31,9 452.14,10 29,11 11,12 37.5,13 58.48,14 5.17}
{0 CHEMBL1421470,1 45.256,2 69,3 72,4 78.191,5 42.43,6 24,7 33,8 39,9 535.76,10 36,11 11,12 48,13 69.669,14 6.05}
{0 CHEMBL1421970,1 22.352,2 34,3 35,4 38.451,5 21.062,6 12,7 16,8 19,9 268.37,10 18,11 6,12 23.5,13 34.447,14 5.742}
{0 CHEMBL1423213,1 26.04,2 37,3 39,4 41.196,5 24.94,6 18,7 15,8 24,9 289.36,10 22,11 2,12 35,13 36.934,14 4.097}
{0 CHEMBL1426299,1 24.921,2 35,3 36,4 39.336,5 22.814,6 13,7 16,8 20,9 319.28,10 19,11 6,12 24,13 35.324,14 5.701}
{0 CHEMBL1429265,1 38.239,2 60,3 62,4 68.145,5 35.077,6 21,7 32,8 30,9 404.64,10 28,11 13,12 35,13 59.509,14 4.747}
{0 CHEMBL1430499,1 26.676,2 38,3 41,4 42.828,5 26.533,6 18,7 13,8 28,9 336.35,10 25,11 1,12 39.5,13 38.993,14 5.278}
{0 CHEMBL1432675,1 27.529,2 42,3 42,4 47.7,5 25.324,6 13,7 21,8 21,9 331.51,10 21,11 6,12 27,13 42.393,14 6.113}
{0 CHEMBL1433062,1 29.472,2 42,3 45,4 46.894,5 29.132,6 19,7 15,8 30,9 386.81,10 27,11 4,12 39,13 43.349,14 6.329}
{0 CHEMBL1434855,1 31.824,2 45,3 48,4 50.286,5 30.448,6 20,7 18,8 30,9 428.31,10 27,11 4,12 39,13 45.585,14 5.349}
{0 CHEMBL1438892,1 38.54,2 60,3 61,4 67.852,5 34.868,6 22,7 33,8 28,9 387.65,10 27,11 11,12 34.5,13 58.963,14 5.345}
{0 CHEMBL1445488,1 37.579,2 52,3 55,4 57.624,5 36.635,6 23,7 18,8 37,9 498.57,10 34,11 4,12 49.5,13 53.716,14 5.967}
{0 CHEMBL1451261,1 36.711,2 55,3 57,4 61.816,5 34.003,6 22,7 27,8 30,9 397.59,10 28,11 8,12 38,13 54.64,14 5.475}
{0 CHEMBL1451962,1 30.023,2 44,3 46,4 49.285,5 29.018,6 18,7 18,8 28,9 374.45,10 26,11 3,12 38.5,13 44.985,14 5.509}
{0 CHEMBL1453902,1 34.103,2 46,3 49,4 50.949,5 31.862,6 21,7 18,8 31,9 406.57,10 28,11 3,12 43,13 46.073,14 6.114}
{0 CHEMBL1460292,1 28.319,2 42,3 44,4 46.943,5 26.499,6 19,7 20,8 24,9 292.41,10 22,11 4,12 33,13 41.483,14 4.097}
{0 CHEMBL1460464,1 27.557,2 40,3 42,4 44.528,5 25.972,6 19,7 18,8 24,9 290.39,10 22,11 3,12 33.5,13 39.6,14 4.097}
{0 CHEMBL1461216,1 31.466,2 46,3 48,4 51.744,5 32.438,6 20,7 14,8 34,9 438.38,10 32,12 49,13 48.444,14 6.341}
{0 CHEMBL1463248,1 39.506,2 57,3 60,4 63.74,5 37.092,6 23,7 25,8 35,9 471.65,10 32,11 6,12 46.5,13 57.487,14 6.177}
{0 CHEMBL1466912,1 28.313,2 42,3 44,4 47.243,5 28.514,6 18,7 15,8 29,9 369.36,10 27,11 2,12 40,13 43.571,14 5.249}
{0 CHEMBL1467623,1 33.653,2 49,3 52,4 54.562,5 33.099,6 22,7 19,8 33,9 430.86,10 30,11 6,12 42,13 50.451,14 5.821}
{0 CHEMBL1470628,1 32.688,2 48,3 49,4 53.902,5 29.233,6 18,7 25,8 24,9 347.6,10 23,11 7,12 30.5,13 47.178,14 5.472}
{0 CHEMBL1477633,1 21.188,2 32,3 33,4 36.199,5 20.843,6 13,7 13,8 20,9 259.29,10 19,11 1,12 28,13 32.705,14 5.096}
{0 CHEMBL1478082,1 26.943,2 38,3 41,4 42.116,5 26.348,6 19,7 14,8 27,9 318.35,10 24,11 2,12 37,13 38.487,14 5.947}
{0 CHEMBL1480960,1 27.449,2 37,3 38,4 40.98,5 26.363,6 17,7 13,8 25,9 360.84,10 24,12 35,13 37.887,14 5.23}
{0 CHEMBL1484595,1 26.636,2 37,3 40,4 40.91,5 26.536,6 19,7 12,8 28,9 332.33,10 25,12 39.5,13 37.931,14 5.708}
{0 CHEMBL1485717,1 24.466,2 34,3 35,4 38.126,5 22.099,6 13,7 16,8 19,9 303.28,10 18,11 6,12 23,13 33.996,14 6.074}
{0 CHEMBL1487101,1 24.557,2 35,3 36,4 39.289,5 22.184,6 13,7 17,8 19,9 329.29,10 18,11 6,12 23,13 34.905,14 5.476}
{0 CHEMBL1487426,1 28.017,2 42,3 44,4 47.235,5 26.708,6 18,7 19,8 25,9 309.4,10 23,11 5,12 34,13 42.029,14 4.097}
{0 CHEMBL1489399,1 23.205,2 35,3 36,4 39.448,5 21.159,6 13,7 18,8 18,9 250.4,10 17,11 6,12 22,13 34.676,14 6.148}
{0 CHEMBL1489711,1 33.239,2 49,3 51,4 54.91,5 32.26,6 20,7 20,8 31,9 416.49,10 29,11 4,12 42,13 50.196,14 5.939}
{0 CHEMBL1500616,1 35.745,2 53,3 56,4 59.773,5 33.277,6 21,7 25,8 31,9 395.58,10 28,11 7,12 40,13 52.749,14 5.462}
{0 CHEMBL1502703,1 23.932,2 35,3 37,4 39.661,5 22.322,6 14,7 16,8 21,9 277.4,10 19,11 6,12 26,13 35.08,14 5.049}
{0 CHEMBL1503182,1 26.085,2 37,3 39,4 41.701,5 25.546,6 15,7 13,8 26,9 343.4,10 24,11 1,12 37.5,13 38.102,14 6.279}
{0 CHEMBL1504939,1 24.801,2 35,3 36,4 39.372,5 22.679,6 13,7 16,8 20,9 342.29,10 19,11 5,12 25,13 35.123,14 6.366}
{0 CHEMBL1505300,1 25.171,2 34,3 37,4 37.783,5 24.095,6 16,7 12,8 25,9 308.39,10 22,11 1,12 34,13 34.345,14 5.767}
{0 CHEMBL1506021,1 33.944,2 50,3 55,4 55.903,5 31.454,6 21,7 24,8 31,9 368.54,10 26,11 12,12 36,13 49.654,14 4.824}
{0 CHEMBL1506538,1 28.591,2 43,3 44,4 48.72,5 26.062,6 15,7 22,8 22,9 327.92,10 21,11 8,12 26,13 42.869,14 5.724}
{0 CHEMBL1509369,1 27.807,2 40,3 42,4 44.661,5 26.777,6 17,7 16,8 26,9 344.42,10 24,11 4,12 34,13 40.774,14 5.355}
{0 CHEMBL1511981,1 36.375,2 51,3 53,4 56.996,5 35.436,6 21,7 18,8 35,9 486.57,10 33,11 1,12 50,13 52.709,14 5.955}
{0 CHEMBL1515727,1 25.625,2 35,3 38,4 38.993,5 24.81,6 16,7 12,8 26,9 324.39,10 23,11 1,12 35,13 35.673,14 5.035}
{0 CHEMBL1517266,1 43.739,2 65,3 68,4 72.78,5 42.082,6 27,7 28,8 40,9 524.64,10 37,11 7,12 53,13 66.058,14 5.607}
{0 CHEMBL1518926,1 34.029,2 48,3 51,4 53.681,5 33.46,6 22,7 17,8 34,9 436.88,10 31,11 2,12 48,13 49.225,14 5.67}
{0 CHEMBL1523808,1 25.54,2 35,3 37,4 39.041,5 24.868,6 16,7 12,8 25,9 374.21,10 23,11 1,12 34.5,13 35.934,14 5.367}
{0 CHEMBL1528944,1 30.046,2 40,3 43,4 44.078,5 26.819,6 17,7 18,8 25,9 346.58,10 22,11 6,12 31,13 39.502,14 5.278}
{0 CHEMBL1528986,1 31.239,2 40,3 43,4 43.854,5 30.142,6 21,7 12,8 31,9 405.88,10 28,12 45.5,13 40.778,14 5.889}
{0 CHEMBL1529185,1 36.273,2 56,3 58,4 63.022,5 34.036,6 23,7 28,8 30,9 380.53,10 28,11 9,12 38,13 55.672,14 5.32}
{0 CHEMBL1529345,1 34.688,2 50,3 52,4 55.621,5 33.953,6 22,7 19,8 33,9 441.49,10 31,11 4,12 44,13 51.422,14 5.489}
{0 CHEMBL1531641,1 31.284,2 41,3 45,4 44.83,5 30.723,6 22,7 12,8 33,9 400.43,10 29,12 47,13 42.007,14 5.205}
{0 CHEMBL1533277,1 33.347,2 49,3 50,4 55.117,5 31.502,6 20,7 22,8 28,9 432.35,10 27,11 5,12 37,13 49.352,14 5.499}
{0 CHEMBL1535692,1 39.392,2 61,3 64,4 68.568,5 37.685,6 25,7 29,8 35,9 439.55,10 32,11 12,12 44,13 61.436,14 5.271}
{0 CHEMBL1537922,1 36.063,2 55,3 57,4 62.527,5 33.42,6 18,7 27,8 30,9 425.64,10 28,11 10,12 37,13 55.363,14 5.699}
{0 CHEMBL1540065,1 43.455,2 67,3 69,4 75.769,5 40.319,6 25,7 34,8 35,9 470.7,10 33,11 11,12 43,13 66.72,14 5.499}
{0 CHEMBL1540317,1 29.273,2 44,3 45,4 49.867,5 28.534,6 16,7 18,8 27,9 378.45,10 26,11 6,12 36.5,13 45.305,14 5.642}
{0 CHEMBL1545441,1 43.097,2 64,3 67,4 72.089,5 39.905,6 25,7 31,8 36,9 487.12,10 33,11 10,12 45,13 63.832,14 5.684}
{0 CHEMBL1547640,1 38.648,2 55,3 57,4 61.245,5 36.974,6 23,7 22,8 35,9 486.61,10 33,11 5,12 46,13 56.156,14 5.439}
{0 CHEMBL1550032,1 31.744,2 46,3 48,4 51.143,5 30.67,6 21,7 19,8 29,9 386.85,10 27,11 5,12 38,13 46.796,14 5.81}
{0 CHEMBL1558648,1 43.097,2 64,3 67,4 72.089,5 39.905,6 25,7 31,8 36,9 487.12,10 33,11 10,12 45,13 63.832,14 5.684}
{0 CHEMBL1564440,1 21.506,2 28,3 30,4 30.999,5 20.448,6 12,7 9,8 21,9 291.38,10 19,12 31,13 28.764,14 5.409}
{0 CHEMBL1566674,1 27.284,2 41,3 42,4 46.515,5 25.25,6 14,7 20,8 22,9 329.89,10 21,11 7,12 26,13 41.313,14 5.113}
{0 CHEMBL1569105,1 35.33,2 54,3 56,4 61.175,5 32.357,6 19,7 28,8 28,9 398.02,10 26,11 12,12 32,13 53.847,14 5.438}
{0 CHEMBL1569991,1 38.722,2 59,3 62,4 66.813,5 36.045,6 22,7 29,8 33,9 427.63,10 30,11 11,12 40.5,13 58.843,14 6.223}
{0 CHEMBL1580036,1 21.489,2 31,3 32,4 34.458,5 20.922,6 13,7 12,8 20,9 280.32,10 19,11 2,12 28.5,13 32.015,14 6.11}
{0 CHEMBL1584150,1 19.847,2 25,3 28,4 27.083,5 19.219,6 14,7 7,8 21,9 253.29,10 18,12 30.5,13 25.484,14 5.488}
{0 CHEMBL1585855,1 34.881,2 50,3 53,4 55.78,5 33.137,6 22,7 21,8 32,9 407.53,10 29,11 5,12 43.5,13 50.316,14 4.947}
{0 CHEMBL1586360,1 22.341,2 31,3 32,4 34.665,5 19.943,6 12,7 15,8 17,9 299.26,10 16,11 5,12 21,13 30.694,14 5.821}
{0 CHEMBL1586977,1 25.443,2 34,3 36,4 37.482,5 24.341,6 16,7 12,8 24,9 333.81,10 22,11 1,12 34.5,13 34.785,14 4.839}
{0 CHEMBL1594597,1 20.472,2 26,3 28,4 28.838,5 20.014,6 13,7 7,8 21,9 292.13,10 19,12 29.5,13 26.931,14 5.184}
{0 CHEMBL1595181,1 28.546,2 45,3 45,4 51.116,5 27.072,6 15,7 22,8 23,9 342.46,10 23,11 8,12 28.5,13 45.753,14 5.367}
{0 CHEMBL1597485,1 25.557,2 38,3 39,4 43.158,5 23.577,6 12,7 18,8 21,9 314.48,10 20,11 5,12 27,13 38.4,14 5.184}
{0 CHEMBL1605157,1 21.671,2 31,3 33,4 34.867,5 21.81,6 14,7 10,8 23,9 282.28,10 21,12 33.5,13 32.04,14 5.703}
{0 CHEMBL1608180,1 34.904,2 47,3 51,4 51.74,5 33.369,6 24,7 17,8 34,9 411.51,10 30,11 1,12 48.5,13 47.222,14 5.074}
{0 CHEMBL1608642,1 22.654,2 34,3 35,4 38.159,5 20.853,6 13,7 17,8 18,9 251.38,10 17,11 6,12 22,13 33.902,14 5.921}
{0 CHEMBL1642763,1 31.853,2 49,3 52,4 55.168,5 29.346,6 18,7 25,8 27,9 352.4,10 24,11 12,12 31,13 49.098,14 4.701}
{0 CHEMBL1667953,1 62.336,2 95,3 100,4 106.684,5 60.033,6 40,7 43,8 57,9 709.86,10 52,11 13,12 72.5,13 95.923,14 4.301}
{0 CHEMBL1667954,1 64.404,2 99,3 104,4 111.305,5 61.372,6 41,7 47,8 57,9 709.91,10 52,11 15,12 71.5,13 99.363,14 4.301}
{0 CHEMBL1667955,1 62.336,2 95,3 100,4 106.684,5 60.033,6 40,7 43,8 57,9 709.86,10 52,11 13,12 72.5,13 95.923,14 4.301}
{0 CHEMBL1667956,1 64.097,2 98,3 103,4 110.099,5 61.56,6 41,7 45,8 58,9 723.89,10 53,11 14,12 73.5,13 98.807,14 4.301}
{0 CHEMBL1667957,1 69.404,2 104,3 110,4 116.305,5 66.372,6 46,7 47,8 63,9 769.96,10 57,11 13,12 81.5,13 104.363,14 4.804}
{0 CHEMBL1667958,1 69.858,2 105,3 111,4 117.514,5 67.087,6 46,7 47,8 64,9 785.96,10 58,11 13,12 82.5,13 105.69,14 4.686}
{0 CHEMBL1667959,1 69.404,2 104,3 110,4 116.305,5 66.372,6 46,7 47,8 63,9 769.96,10 57,11 13,12 81.5,13 104.363,14 4.759}
{0 CHEMBL1667960,1 69.858,2 105,3 111,4 117.514,5 67.087,6 46,7 47,8 64,9 785.96,10 58,11 13,12 82.5,13 105.69,14 4.478}
{0 CHEMBL1667961,1 31.932,2 48,3 50,4 54.152,5 31.159,6 20,7 20,8 30,9 380.44,10 28,11 4,12 40.5,13 48.785,14 4.301}
{0 CHEMBL1667962,1 30.171,2 45,3 47,4 50.737,5 29.632,6 19,7 18,8 29,9 366.41,10 27,11 3,12 39.5,13 45.902,14 4.301}
{0 CHEMBL1672291,1 41.619,2 59,3 62,4 65.684,5 40.141,6 26,7 23,8 39,9 527.03,10 36,11 6,12 51,13 60.287,14 5.489}
{0 CHEMBL1714422,1 30.926,2 45,3 47,4 50.206,5 30.427,6 19,7 17,8 30,9 403.44,10 28,11 3,12 41,13 46.538,14 6.03}
{0 CHEMBL1721094,1 41.227,2 62,3 64,4 69.946,5 40.071,6 24,7 26,8 38,9 514.61,10 36,11 6,12 51,13 63.494,14 5.947}
{0 CHEMBL1721577,1 30.285,2 46,3 48,4 52.065,5 27.541,6 17,7 24,8 24,9 316.52,10 22,11 10,12 29,13 45.32,14 5.218}
{0 CHEMBL1724282,1 15.773,2 24,3 24,4 26.917,5 16.396,6 10,7 8,8 16,9 224.18,10 16,11 1,12 22,13 25.498,14 6.425}
{0 CHEMBL1725497,1 24.193,2 36,3 37,4 40.697,5 23.864,6 15,7 14,8 23,9 298.33,10 22,12 32,13 36.807,14 5.406}
{0 CHEMBL1731009,1 11.847,2 17,3 17,4 19.083,5 11.219,6 6,7 7,8 10,9 157.21,10 10,12 15,13 17.484,14 5.075}
{0 CHEMBL1733061,1 21.443,2 32,3 33,4 35.751,5 22.352,6 14,7 10,8 23,9 306.24,10 22,11 2,12 31,13 34.036,14 6.796}
{0 CHEMBL1733383,1 30.477,2 43,3 45,4 47.625,5 29.34,6 20,7 17,8 28,9 417.27,10 26,11 4,12 37,13 43.818,14 5.129}
{0 CHEMBL1735536,1 19.051,2 24,3 26,4 26.688,5 18.154,6 11,7 7,8 19,9 262.74,10 17,12 27,13 24.575,14 5.201}
{0 CHEMBL1756,1 43.074,2 65,3 68,4 73.425,5 39.844,6 23,7 32,8 36,9 520.43,10 33,11 16,12 41,13 65.709,14 4.767}
{0 CHEMBL176252,1 37.12,2 54,3 58,4 59.97,5 34.82,6 25,7 25,8 33,9 408.95,10 29,11 10,12 41,13 53.792,14 5.678}
{0 CHEMBL1765357,1 34.21,2 48,3 51,4 53.744,5 34.217,6 21,7 15,8 36,9 465.48,10 33,12 52.5,13 49.967,14 6.155}
{0 CHEMBL1773168,1 32.875,2 47,3 50,4 52.282,5 31.116,6 21,7 20,8 30,9 380.5,10 27,11 4,12 41.5,13 47.214,14 4.301}
{0 CHEMBL1773180,1 42.387,2 64,3 67,4 72.148,5 39.98,6 25,7 30,8 37,9 482.66,10 34,11 9,12 47,13 64.28,14 4.301}
{0 CHEMBL1773181,1 41.659,2 62,3 65,4 70.152,5 39.429,6 25,7 28,8 37,9 481.65,10 34,11 8,12 47.5,13 62.356,14 4.301}
{0 CHEMBL1795950,1 71.841,2 111,3 116,4 125.052,5 68.877,6 45,7 52,8 64,9 809.01,10 59,11 17,12 80.5,13 111.887,14 4.322}
{0 CHEMBL1800273,1 23.443,2 34,3 35,4 38.382,5 23.957,6 11,7 10,8 25,9 378.37,10 24,11 2,12 35,13 36.837,14 5.337}
{0 CHEMBL1800274,1 20.432,2 30,3 31,4 33.834,5 20.626,6 11,7 10,8 21,9 298.3,10 20,11 2,12 29,13 31.778,14 4.387}
{0 CHEMBL1822606,1 65.392,2 99,3 104,4 111.106,5 64.366,6 42,7 41,8 63,9 795.86,10 58,11 12,12 81.5,13 101.349,14 4.265}
{0 CHEMBL1822607,1 67.154,2 102,3 107,4 114.521,5 65.893,6 43,7 43,8 64,9 809.89,10 59,11 13,12 82.5,13 104.232,14 4.462}
{0 CHEMBL1875123,1 25.71,2 37,3 39,4 41.479,5 25.605,6 16,7 13,8 26,9 348.76,10 24,11 2,12 34,13 38.465,14 5.381}
{0 CHEMBL1888077,1 31.415,2 43,3 45,4 48.102,5 29.405,6 17,7 17,8 28,9 408.97,10 26,11 5,12 37,13 43.724,14 5.262}
{0 CHEMBL1888617,1 23.58,2 34,3 36,4 38.286,5 24.24,6 15,7 10,8 26,9 326.29,10 24,12 37.5,13 35.695,14 5.521}
{0 CHEMBL1893914,1 21.881,2 32,3 33,4 35.993,5 22.031,6 14,7 11,8 22,9 285.28,10 21,12 32,13 33.149,14 5.622}
{0 CHEMBL1893949,1 31.335,2 47,3 49,4 52.989,5 29.852,6 18,7 21,8 28,9 375.49,10 26,11 6,12 37,13 47.643,14 5.312}
{0 CHEMBL1898589,1 11.966,2 13,3 13,4 14.603,5 11.406,6 5,7 2,8 11,9 231.89,10 11,12 14,13 14.266,14 5.839}
{0 CHEMBL1964442,1 18.875,2 28,3 29,4 31.495,5 19.009,6 12,7 10,8 19,9 246.24,10 18,12 26.5,13 29.047,14 6.021}
{0 CHEMBL1965710,1 26.636,2 37,3 40,4 40.91,5 26.536,6 19,7 12,8 28,9 332.33,10 25,12 40,13 37.931,14 4.476}
{0 CHEMBL1966746,1 24.182,2 34,3 35,4 38.332,5 23.426,6 12,7 12,8 23,9 340.42,10 22,11 1,12 33.5,13 35.404,14 5.672}
{0 CHEMBL1971015,1 36.506,2 51,3 53,4 57.087,5 35.221,6 21,7 19,8 34,9 496.4,10 32,11 5,12 44,13 52.618,14 5.658}
{0 CHEMBL1971404,1 26.75,2 38,3 40,4 42.934,5 26.901,6 16,7 12,8 28,9 373.78,10 26,11 1,12 40,13 39.676,14 5.466}
{0 CHEMBL1971786,1 32.869,2 48,3 50,4 54.03,5 32.842,6 21,7 17,8 33,9 419.43,10 31,11 1,12 47,13 49.447,14 5.216}
{0 CHEMBL1973036,1 28.608,2 40,3 42,4 44.662,5 27.207,6 18,7 16,8 26,9 386.27,10 24,11 3,12 35,13 40.374,14 5.139}
{0 CHEMBL1973855,1 27.131,2 39,3 42,4 44.037,5 27.247,6 18,7 13,8 29,9 352.35,10 26,11 1,12 39.5,13 40.32,14 5.289}
{0 CHEMBL1976414,1 34.08,2 50,3 52,4 56.156,5 34.062,6 22,7 18,8 34,9 434.44,10 32,11 1,12 48,13 51.556,14 5.618}
{0 CHEMBL1976599,1 34.233,2 50,3 52,4 55.86,5 32.95,6 23,7 21,8 31,9 387.47,10 29,11 2,12 43,13 50.24,14 5.697}
{0 CHEMBL19805,1 62.426,2 101,3 101,4 115.494,5 61.245,6 32,7 46,8 55,9 803.8,10 55,11 17,12 68,13 104.603,14 4}
{0 CHEMBL1982044,1 25.955,2 37,3 39,4 41.562,5 26.1,6 16,7 12,8 27,9 361.76,10 25,11 2,12 37,13 38.684,14 5.714}
{0 CHEMBL1982391,1 21.665,2 28,3 29,4 31.13,5 21.001,6 12,7 8,8 21,9 354.2,10 20,12 30.5,13 29.244,14 5.668}
{0 CHEMBL1984990,1 34.136,2 50,3 52,4 56.411,5 32.963,6 18,7 20,8 32,9 452.56,10 30,11 6,12 43.5,13 51.593,14 4.839}
{0 CHEMBL1985091,1 22.779,2 31,3 32,4 34.626,5 22.341,6 14,7 10,8 22,9 348.17,10 21,12 32,13 32.051,14 5.179}
{0 CHEMBL1985932,1 34.744,2 48,3 50,4 53.672,5 33.695,6 20,7 17,8 33,9 482.37,10 31,11 4,12 43,13 49.735,14 5.355}
{0 CHEMBL1986343,1 23.483,2 34,3 35,4 38.488,5 21.928,6 13,7 15,8 20,9 273.4,10 19,11 2,12 27.5,13 34.003,14 5.502}
{0 CHEMBL1986392,1 20.671,2 26,3 27,4 28.759,5 19.63,6 12,7 8,8 19,9 372.02,10 18,12 26.5,13 26.851,14 5.04}
{0 CHEMBL1991021,1 29.472,2 44,3 46,4 49.445,5 28.423,6 19,7 19,8 27,9 337.41,10 25,11 3,12 37,13 44.356,14 5.783}
{0 CHEMBL1991426,1 31.46,2 43,3 45,4 47.977,5 30.405,6 19,7 15,8 30,9 414.9,10 28,12 43,13 44.091,14 5.585}
{0 CHEMBL1991440,1 35.142,2 52,3 54,4 58.279,5 34.379,6 23,7 21,8 33,9 419.47,10 31,11 2,12 45,13 52.894,14 5.903}
{0 CHEMBL1993173,1 28.529,2 39,3 41,4 43.376,5 27.918,6 19,7 13,8 28,9 368.41,10 26,12 39.5,13 40.076,14 5.863}
{0 CHEMBL1993643,1 23.199,2 28,3 30,4 31.004,5 21.56,6 12,7 8,8 22,9 366.29,10 20,12 31,13 28.658,14 5.332}
{0 CHEMBL1993711,1 32.926,2 48,3 50,4 53.654,5 32.138,6 22,7 19,8 31,9 389.44,10 29,11 1,12 43,13 48.683,14 5.375}
{0 CHEMBL1996139,1 30.358,2 42,3 44,4 46.847,5 29.504,6 20,7 15,8 29,9 378.84,10 27,12 41,13 42.687,14 5.297}
{0 CHEMBL1996666,1 25.642,2 37,3 39,4 41.409,5 25.557,6 17,7 13,8 26,9 323.33,10 24,12 36,13 38.033,14 5.268}
{0 CHEMBL201515,1 50.092,2 82,3 86,4 92.802,5 45.502,6 30,7 48,8 38,9 472.78,10 34,11 27,12 40,13 80.516,14 4.398}
{0 CHEMBL2092743,1 65.727,2 104,3 105,4 118.202,5 64.036,6 36,7 47,8 58,9 822.84,10 57,11 16,12 73,13 107.058,14 4}
{0 CHEMBL220259,1 17.517,2 25,3 26,4 27.917,5 17.175,6 10,7 9,8 17,9 239.27,10 16,12 24.5,13 26.022,14 5.983}
{0 CHEMBL227622,1 35.949,2 52,3 57,4 58.299,5 33.896,6 23,7 23,8 34,9 406.95,10 29,11 10,12 42.5,13 51.894,14 5.886}
{0 CHEMBL230006,1 49.33,2 80,3 84,4 90.387,5 44.976,6 30,7 46,8 38,9 470.76,10 34,11 26,12 41,13 78.632,14 5.018}
{0 CHEMBL2311593,1 30.784,2 43,3 46,4 47.839,5 30.84,6 23,7 14,8 32,9 392.37,10 29,12 45,13 44.403,14 5.301}
{0 CHEMBL2316894,1 33.245,2 48,3 51,4 54.009,5 33.277,6 24,7 17,8 34,9 426.41,10 31,11 3,12 46,13 49.683,14 5.347}
{0 CHEMBL2316895,1 33.699,2 49,3 52,4 55.218,5 33.992,6 24,7 17,8 35,9 442.41,10 32,11 3,12 47,13 51.011,14 5.284}
{0 CHEMBL2316896,1 39.648,2 56,3 60,4 61.614,5 38.369,6 29,7 22,8 38,9 450.51,10 34,11 2,12 53,13 56.356,14 5.444}
{0 CHEMBL2316897,1 32.938,2 47,3 50,4 52.803,5 33.465,6 24,7 15,8 35,9 440.39,10 32,11 1,12 48,13 49.127,14 5.347}
{0 CHEMBL2316898,1 31.608,2 45,3 48,4 49.914,5 30.984,6 23,7 17,8 31,9 376.4,10 28,11 2,12 43,13 45.774,14 4.963}
{0 CHEMBL2316899,1 52.432,2 78,3 84,4 86.73,5 49.771,6 36,7 36,8 48,9 564.72,10 42,11 16,12 61,13 77.869,14 4.523}
{0 CHEMBL2316900,1 24.841,2 35,3 37,4 38.538,5 24.735,6 18,7 12,8 25,9 308.3,10 23,11 1,12 36,13 35.938,14 4}
{0 CHEMBL2316901,1 22.625,2 31,3 33,4 33.914,5 22.493,6 17,7 10,8 23,9 278.27,10 21,12 34,13 31.727,14 4.509}
{0 CHEMBL2316902,1 31.722,2 44,3 47,4 49.178,5 32.224,6 24,7 13,8 34,9 422.37,10 31,11 1,12 48,13 45.916,14 5.745}
{0 CHEMBL2316903,1 30.148,2 41,3 44,4 44.744,5 29.547,6 23,7 14,8 30,9 354.37,10 27,12 44,13 41.494,14 5.398}
{0 CHEMBL2316904,1 30.085,2 41,3 44,4 45.084,5 29.93,6 23,7 13,8 31,9 372.36,10 28,12 45,13 42.007,14 5.444}
{0 CHEMBL2316905,1 31.006,2 41,3 44,4 44.688,5 30.374,6 23,7 13,8 31,9 388.81,10 28,12 45,13 41.818,14 5.638}
{0 CHEMBL2316906,1 30.023,2 41,3 44,4 45.423,5 30.313,6 23,7 12,8 32,9 390.35,10 29,12 46,13 42.52,14 5.658}
{0 CHEMBL2316907,1 32.176,2 45,3 48,4 50.388,5 32.938,6 24,7 13,8 35,9 438.37,10 32,11 1,12 49,13 47.243,14 5.745}
{0 CHEMBL2316908,1 38.125,2 52,3 56,4 56.784,5 37.315,6 29,7 18,8 38,9 446.47,10 34,12 55,13 52.589,14 6.222}
{0 CHEMBL2316909,1 32.364,2 45,3 48,4 49.369,5 31.788,6 24,7 16,8 32,9 384.4,10 29,11 1,12 46,13 45.705,14 4.42}
{0 CHEMBL2316910,1 30.023,2 41,3 44,4 45.423,5 30.313,6 23,7 12,8 32,9 390.35,10 29,12 46,13 42.52,14 5.548}
{0 CHEMBL2349150,1 40.983,2 56,3 59,4 61.909,5 39.039,6 26,7 21,8 38,9 503.64,10 35,11 1,12 54.5,13 56.72,14 5.161}
{0 CHEMBL2349151,1 40.466,2 54,3 57,4 59.577,5 39.007,6 26,7 18,8 39,9 514.62,10 36,12 57.5,13 55.054,14 5.108}
{0 CHEMBL2349152,1 42.199,2 59,3 62,4 65.534,5 40.28,6 26,7 23,8 39,9 521.66,10 36,11 3,12 54.5,13 59.931,14 5.097}
{0 CHEMBL260920,1 44.909,2 64,3 69,4 71.192,5 43.928,6 31,7 24,8 45,9 532.59,10 40,11 3,12 63,13 64.88,14 4.444}
{0 CHEMBL263010,1 103.325,2 171,3 171,4 196.032,5 100.023,6 55,7 85,8 86,9 1220.51,10 86,11 34,12 104,13 174.359,14 4.658}
{0 CHEMBL271751,1 22.909,2 28,3 30,4 30.734,5 21.561,6 13,7 8,8 22,9 321.83,10 20,12 30.5,13 28.76,14 4.264}
{0 CHEMBL272444,1 24.267,2 32,3 34,4 35.415,5 22.975,6 14,7 11,8 23,9 317.42,10 21,11 1,12 31.5,13 32.647,14 4.932}
{0 CHEMBL28721,1 11.398,2 16,3 15,4 17.923,5 10.814,6 4,7 6,8 9,9 182.24,10 10,11 2,12 11,13 17.113,14 6.286}
{0 CHEMBL301982,1 45.285,2 71,3 75,4 79.726,5 41.868,6 29,7 38,8 37,9 450.67,10 33,11 19,12 43,13 70.098,14 5.481}
{0 CHEMBL326115,1 44.79,2 68,3 69,4 78.417,5 44.683,6 23,7 25,8 44,9 657.45,10 43,11 7,12 56,13 72.276,14 5}
{0 CHEMBL337604,1 38.648,2 56,3 58,4 63.879,5 37.947,6 22,7 20,8 38,9 550.36,10 36,11 4,12 49,13 59.105,14 4.222}
{0 CHEMBL358290,1 27.551,2 39,3 40,4 43.66,5 25.556,6 15,7 17,8 23,9 335.49,10 22,11 2,12 32,13 39.298,14 5.234}
{0 CHEMBL374829,1 27.5,2 29,3 30,4 31.378,5 25.171,6 13,7 6,8 24,9 705.59,10 23,11 1,12 30,13 30.985,14 4.301}
{0 CHEMBL376571,1 40.012,2 56,3 61,4 61.973,5 37.502,6 26,7 24,8 37,9 466.03,10 32,11 10,12 46,13 56.087,14 5.658}
{0 CHEMBL377360,1 78.001,2 125,3 128,4 142.287,5 73.64,6 45,7 64,8 64,9 845.17,10 61,11 24,12 79,13 125.174,14 4}
{0 CHEMBL409618,1 79.762,2 128,3 131,4 145.702,5 75.167,6 46,7 66,8 65,9 859.2,10 62,11 25,12 80,13 128.057,14 4}
{0 CHEMBL414193,1 22.909,2 28,3 30,4 30.734,5 21.561,6 13,7 8,8 22,9 321.83,10 20,12 30.5,13 28.76,14 4.491}
{0 CHEMBL420456,1 38.142,2 57,3 61,4 64.806,5 36.407,6 23,7 25,8 36,9 427.57,10 32,11 6,12 47.5,13 56.985,14 5.301}
{0 CHEMBL432519,1 43.069,2 67,3 71,4 75.102,5 39.627,6 28,7 36,8 35,9 420.64,10 31,11 18,12 41,13 65.887,14 4.21}
{0 CHEMBL436670,1 24.722,2 33,3 35,4 36.624,5 23.69,6 14,7 11,8 24,9 333.42,10 22,11 1,12 32.5,13 33.975,14 4.592}
{0 CHEMBL438997,1 101.552,2 167,3 167,4 191.546,5 97.232,6 52,7 84,8 83,9 1198.44,10 83,11 33,12 100,13 170.006,14 5.812}
{0 CHEMBL439324,1 79.916,2 129,3 131,4 147.204,5 76.091,6 45,7 65,8 66,9 892.19,10 64,11 24,12 81,13 129.93,14 4}
{0 CHEMBL446483,1 25.233,2 36,3 38,4 40.704,5 25.449,6 14,7 11,8 27,9 361.37,10 25,12 40,13 37.873,14 4.924}
{0 CHEMBL459497,1 36.603,2 53,3 57,4 59.1,5 34.489,6 25,7 24,8 33,9 410.94,10 29,11 10,12 41,13 52.978,14 5.676}
{0 CHEMBL459711,1 30.835,2 44,3 45,4 48.724,5 29.24,6 21,7 19,8 26,9 354.85,10 25,11 4,12 36,13 44.142,14 6.347}
{0 CHEMBL459712,1 32.835,2 46,3 48,4 50.724,5 31.24,6 23,7 19,8 29,9 378.87,10 27,11 2,12 40,13 46.142,14 4.701}
{0 CHEMBL460350,1 33.131,2 45,3 47,4 49.564,5 30.614,6 20,7 19,8 28,9 406.98,10 26,11 5,12 36,13 45.294,14 4.991}
{0 CHEMBL460351,1 34.12,2 51,3 52,4 56.97,5 31.82,6 22,7 25,8 27,9 372.92,10 26,11 7,12 35,13 50.792,14 5.27}
{0 CHEMBL461199,1 33.358,2 49,3 51,4 54.555,5 31.294,6 22,7 23,8 28,9 370.9,10 26,11 7,12 36,13 48.909,14 5.194}
{0 CHEMBL461415,1 40.642,2 60,3 64,4 66.8,5 37.874,6 27,7 29,8 35,9 437.01,10 31,11 12,12 43,13 59.56,14 5.644}
{0 CHEMBL461620,1 40.887,2 60,3 64,4 66.883,5 38.368,6 27,7 28,8 36,9 450.01,10 32,11 11,12 45,13 59.778,14 5.342}
{0 CHEMBL461827,1 37.671,2 55,3 59,4 61.259,5 35.127,6 25,7 26,8 33,9 407.97,10 29,11 10,12 41,13 54.567,14 5.738}
{0 CHEMBL472003,1 43.364,2 69,3 74,4 78.637,5 40.46,6 25,7 36,8 38,9 452.67,10 33,11 18,12 43.5,13 68.519,14 5.605}
{0 CHEMBL472004,1 32.301,2 44,3 47,4 48.877,5 32.076,6 19,7 13,8 34,9 459.49,10 31,12 50,13 46.167,14 6.498}
{0 CHEMBL486649,1 29.029,2 38,3 41,4 41.83,5 27.502,6 18,7 13,8 28,9 367.48,10 25,11 1,12 39,13 38.531,14 4.642}
{0 CHEMBL487850,1 40.051,2 57,3 62,4 63.53,5 37.378,6 24,7 25,8 37,9 467.66,10 32,11 11,12 45.5,13 57.16,14 4.91}
{0 CHEMBL488850,1 31.699,2 43,3 46,4 47.664,5 30.458,6 19,7 15,8 31,9 413.51,10 28,11 2,12 42,13 44.069,14 4.742}
{0 CHEMBL488851,1 27.966,2 36,3 39,4 39.707,5 27.185,6 17,7 10,8 29,9 382.45,10 26,12 42,13 37.193,14 4.79}
{0 CHEMBL497509,1 24.335,2 35,3 37,4 39.203,5 24.745,6 16,7 11,8 26,9 325.3,10 24,12 37,13 36.476,14 4.801}
{0 CHEMBL497510,1 35.029,2 49,3 52,4 54.681,5 34.46,6 23,7 17,8 35,9 448.89,10 32,11 1,12 49,13 50.225,14 4.652}
{0 CHEMBL498473,1 37.705,2 53,3 56,4 60.245,5 38.038,6 23,7 16,8 40,9 552.95,10 37,11 2,12 55,13 56.051,14 5.081}
{0 CHEMBL498474,1 37.705,2 53,3 56,4 60.245,5 38.038,6 23,7 16,8 40,9 552.95,10 37,11 2,12 55,13 56.051,14 4.975}
{0 CHEMBL498475,1 22.426,2 32,3 34,4 35.784,5 22.316,6 15,7 11,8 23,9 281.29,10 21,12 33,13 32.822,14 4.222}
{0 CHEMBL498479,1 22.426,2 32,3 34,4 35.784,5 22.316,6 15,7 11,8 23,9 281.29,10 21,12 33,13 32.822,14 4.222}
{0 CHEMBL49860,1 41.25,2 66,3 67,4 75.786,5 39.619,6 20,7 31,8 36,9 514.54,10 35,11 10,12 44,13 67.691,14 8.301}
{0 CHEMBL498650,1 21.671,2 31,3 33,4 34.867,5 21.81,6 14,7 10,8 23,9 282.28,10 21,12 34,13 32.04,14 4.222}
{0 CHEMBL499061,1 36.131,2 50,3 53,4 55.811,5 35.362,6 22,7 17,8 36,9 484.95,10 33,11 1,12 51,13 51.629,14 5.229}
{0 CHEMBL499329,1 31.273,2 46,3 48,4 51.867,5 30.534,6 18,7 18,8 30,9 402.47,10 28,11 3,12 42,13 47.305,14 5.347}
{0 CHEMBL500677,1 38.75,2 53,3 56,4 59.17,5 37.716,6 23,7 18,8 38,9 533.42,10 35,11 2,12 53,13 54.836,14 5.284}
{0 CHEMBL501993,1 32.301,2 44,3 47,4 48.877,5 32.076,6 19,7 13,8 34,9 459.49,10 31,12 50,13 46.167,14 6.509}
{0 CHEMBL502006,1 36.131,2 50,3 53,4 55.811,5 35.362,6 22,7 17,8 36,9 484.95,10 33,11 1,12 51,13 51.629,14 5.26}
{0 CHEMBL502013,1 35.21,2 50,3 53,4 56.206,5 34.918,6 22,7 17,8 36,9 468.5,10 33,11 1,12 51,13 51.818,14 6}
{0 CHEMBL502014,1 36.068,2 50,3 53,4 56.15,5 35.745,6 22,7 16,8 37,9 502.94,10 34,11 1,12 52,13 52.142,14 5.319}
{0 CHEMBL502257,1 24.682,2 35,3 37,4 39.415,5 25.142,6 14,7 10,8 27,9 362.35,10 25,12 40,13 37.098,14 4.33}
{0 CHEMBL502539,1 35.273,2 50,3 53,4 55.867,5 34.534,6 22,7 18,8 35,9 450.51,10 32,11 1,12 50,13 51.305,14 5.886}
{0 CHEMBL502540,1 36.131,2 50,3 53,4 55.811,5 35.362,6 22,7 17,8 36,9 484.95,10 33,11 1,12 51,13 51.629,14 5.42}
{0 CHEMBL502815,1 36.131,2 50,3 53,4 55.811,5 35.362,6 22,7 17,8 36,9 484.95,10 33,11 1,12 51,13 51.629,14 5.854}
{0 CHEMBL504967,1 29.029,2 38,3 41,4 41.83,5 27.502,6 18,7 13,8 28,9 367.48,10 25,11 1,12 39,13 38.531,14 4.932}
{0 CHEMBL518627,1 35.358,2 51,3 55,4 56.555,5 33.294,6 24,7 23,8 32,9 394.92,10 28,11 9,12 40,13 50.909,14 5.408}
{0 CHEMBL520705,1 27.966,2 36,3 39,4 39.707,5 27.185,6 17,7 10,8 29,9 382.45,10 26,12 42,13 37.193,14 4.542}
{0 CHEMBL521563,1 21.671,2 31,3 33,4 34.867,5 21.81,6 14,7 10,8 23,9 282.28,10 21,12 34,13 32.04,14 4.222}
{0 CHEMBL525078,1 36.131,2 50,3 53,4 55.811,5 35.362,6 22,7 17,8 36,9 484.95,10 33,11 1,12 51,13 51.629,14 5.131}
{0 CHEMBL525630,1 43.364,2 69,3 74,4 78.637,5 40.46,6 25,7 36,8 38,9 452.67,10 33,11 18,12 43.5,13 68.519,14 5.602}
{0 CHEMBL525768,1 44.171,2 66,3 68,4 75.94,5 43.478,6 26,7 26,8 42,9 608.68,10 40,11 8,12 55,13 68.996,14 5.745}
{0 CHEMBL525812,1 35.375,2 49,3 52,4 54.894,5 34.856,6 21,7 16,8 36,9 485.94,10 33,11 1,12 52,13 50.847,14 5.357}
{0 CHEMBL526177,1 37.705,2 53,3 56,4 60.245,5 38.038,6 23,7 16,8 40,9 552.95,10 37,11 2,12 55,13 56.051,14 4.64}
{0 CHEMBL526369,1 35.21,2 50,3 53,4 56.206,5 34.918,6 22,7 17,8 36,9 468.5,10 33,11 1,12 51,13 51.818,14 5.201}
{0 CHEMBL526644,1 24.335,2 35,3 37,4 39.203,5 24.745,6 16,7 11,8 26,9 325.3,10 24,12 37,13 36.476,14 6.097}
{0 CHEMBL526866,1 31.273,2 46,3 48,4 51.867,5 30.534,6 18,7 18,8 30,9 402.47,10 28,11 3,12 42,13 47.305,14 5.347}
{0 CHEMBL527109,1 37.034,2 53,3 56,4 59.282,5 36.061,6 23,7 20,8 36,9 464.54,10 33,11 2,12 51,13 54.189,14 5.301}
{0 CHEMBL527428,1 29.483,2 39,3 42,4 43.039,5 28.217,6 18,7 13,8 29,9 383.48,10 26,11 1,12 40,13 39.858,14 4.042}
{0 CHEMBL528331,1 32.852,2 45,3 48,4 50.166,5 32.383,6 19,7 14,8 34,9 458.51,10 31,11 2,12 47,13 46.942,14 4.889}
{0 CHEMBL541940,1 56.433,2 88,3 94,4 98.965,5 51.589,6 36,7 48,8 46,9 540.86,10 40,11 25,12 53.5,13 86.181,14 4.398}
{0 CHEMBL562059,1 51.671,2 82,3 87,4 92.55,5 47.062,6 32,7 46,8 41,9 490.8,10 36,11 25,12 46,13 80.297,14 4.398}
{0 CHEMBL572899,1 58.194,2 91,3 97,4 102.38,5 53.116,6 37,7 50,8 47,9 554.89,10 41,11 25,12 54.5,13 89.065,14 4.398}
{0 CHEMBL574391,1 50.671,2 81,3 86,4 91.55,5 46.062,6 31,7 46,8 40,9 478.79,10 35,11 25,12 44.5,13 79.297,14 4.398}
{0 CHEMBL576164,1 51.671,2 82,3 87,4 92.55,5 47.062,6 32,7 46,8 41,9 490.8,10 36,11 25,12 46,13 80.297,14 4.398}
{0 CHEMBL578429,1 52.319,2 82,3 87,4 92.47,5 47.249,6 31,7 46,8 41,9 510.86,10 36,11 25,12 45.5,13 80.374,14 4.398}
{0 CHEMBL582862,1 50.12,2 80,3 85,4 90.261,5 45.755,6 31,7 45,8 40,9 479.77,10 35,11 25,12 44.5,13 78.523,14 4.398}
{0 CHEMBL590043,1 48.222,2 69,3 74,4 76.896,5 46.761,6 33,7 27,8 47,9 557.65,10 42,11 3,12 65.5,13 69.538,14 5.26}
{0 CHEMBL590051,1 46.682,2 69,3 74,4 77.604,5 45.497,6 30,7 28,8 46,9 552.64,10 41,11 6,12 61.5,13 69.967,14 5.108}
{0 CHEMBL590063,1 47.46,2 67,3 73,4 74.481,5 46.234,6 33,7 25,8 48,9 555.63,10 42,11 3,12 66.5,13 67.654,14 4.983}
{0 CHEMBL590471,1 46.46,2 66,3 71,4 73.481,5 45.234,6 32,7 25,8 46,9 543.62,10 41,11 2,12 64.5,13 66.654,14 5.032}
{0 CHEMBL597609,1 49.983,2 72,3 77,4 80.312,5 48.288,6 34,7 29,8 48,9 571.68,10 43,11 4,12 66.5,13 72.421,14 4.921}
{0 CHEMBL602930,1 52.631,2 74,3 80,4 82.232,5 50.475,6 35,7 29,8 51,9 615.76,10 45,11 5,12 69.5,13 74.498,14 5.097}
{0 CHEMBL604717,1 41.83,2 58,3 63,4 64.654,5 40.862,6 27,7 20,8 43,9 524.6,10 38,11 2,12 60.5,13 59.182,14 5.041}
{0 CHEMBL605541,1 40.699,2 59,3 63,4 66.066,5 39.707,6 27,7 23,8 40,9 481.55,10 36,11 3,12 55.5,13 59.771,14 4.066}
{0 CHEMBL95255,1 21.091,2 34,3 35,4 39.647,5 20.278,6 10,7 16,8 19,9 248.34,10 18,11 5,12 24.5,13 34.349,14 4.854}
{0 CHEMBL96952,1 30.62,2 47,3 50,4 53.976,5 29.353,6 17,7 21,8 29,9 351.47,10 26,11 6,12 37.5,13 47.218,14 5.046}
