{
  "data_set_description": {
    "collection_date": "November 2013",
    "creator": "Dr Jeremy Besnard, Dr Ivan Olier, Dr Noureddin Sadawi, Dr Larisa Soldatova, Dr Crina Grosan, Prof Ross King, Dr Richard Bickerton, Prof Andrew Hopkins and Dr Willem van Hoorn",
    "default_target_attribute": "pXC50",
    "description": "This dataset contains QSAR data (from ChEMBL version 17) showing activity values (unit is pseudo-pCI50) of several compounds on drug target ChEMBL_ID: CHEMBL1075022 (TID: 102972), and it has 35 rows and 1177 features (not including molecule IDs and class feature: molecule_id and pXC50). The features represent Molecular Descriptors which were generated from SMILES strings. Missing value imputation was applied to this dataset (By choosing the Median).",
    "description_version": "1",
    "file_id": "3586400",
    "format": "ARFF",
    "id": "36368",
    "licence": "Public",
    "md5_checksum": "a5a928dbfb369c472e9fecba56de4ec9",
    "minio_url": "https://data.openml.org/datasets/0003/36368/dataset_36368.pq",
    "name": "QSAR-DATASET-FOR-DRUG-TARGET-CHEMBL1075022",
    "original_data_url": "https://www.ebi.ac.uk/chembl/target/inspect/CHEMBL1075022",
    "parquet_url": "https://data.openml.org/datasets/0003/36368/dataset_36368.pq",
    "processing_date": "2018-10-04 04:45:42",
    "row_id_attribute": "molecule_id",
    "status": "deactivated",
    "tag": [
      "MetaQSAR",
      "study_13"
    ],
    "upload_date": "2016-07-15T20:58:54",
    "url": "https://api.openml.org/data/v1/download/3586400/QSAR-DATASET-FOR-DRUG-TARGET-CHEMBL1075022.arff",
    "version": "11",
    "visibility": "public"
  }
}