"molecule_id","AMW","C.","H.","Me","Mi","Mp","Mv","MW","N.","nAB","nAT","nB","nBM","nBO","nBR","nBT","nC","nCL","nCsp","nCsp2","nCsp3","nDB","nF","nH","nHet","nHM","nI","nN","nO","nP","nS","nSK","nTB","nX","O.","RBF","RBN","SCBO","Se","Si","Sp","Sv","X.","pXC50"
{1 8.107,2 40.7,3 43,4 1.024,5 1.125,6 0.658,7 0.642,8 697.19,9 2.3,10 17,11 86,13 22,14 53,16 90,17 35,18 1,20 23,21 12,22 5,24 37,25 14,26 1,28 2,29 11,32 49,34 1,35 12.8,36 0.111,37 10,38 66.5,39 88.032,40 96.718,41 56.574,42 55.215,43 1.2,44 5.301}
{0 CHEMBL1172557,1 8.373,2 53.2,3 36.4,4 1.008,5 1.099,6 0.723,7 0.704,8 644.71,9 2.6,10 36,11 77,13 40,14 55,16 83,17 41,20 40,21 1,22 4,24 28,25 8,28 2,29 6,32 49,35 7.8,36 0.096,37 8,38 77,39 77.654,40 84.651,41 55.637,42 54.18,44 6.046}
{0 CHEMBL1172616,1 8.264,2 52.9,3 37.3,4 1.007,5 1.099,6 0.719,7 0.698,8 421.47,9 2,10 24,11 51,13 26,14 36,16 55,17 27,20 26,21 1,22 2,24 19,25 5,28 1,29 4,32 32,35 7.8,36 0.073,37 4,38 50,39 51.363,40 56.073,41 36.676,42 35.622,44 5.167}
{0 CHEMBL1172759,1 10.486,2 51.9,3 32.7,4 1.023,5 1.097,6 0.777,7 0.745,8 545.25,9 1.9,10 18,11 52,13 22,14 39,16 56,17 27,18 4,20 24,21 3,22 4,24 17,25 8,26 4,28 1,29 3,32 35,34 4,35 5.8,36 0.071,37 4,38 52,39 53.215,40 57.055,41 40.415,42 38.744,43 7.7,44 5.745}
{0 CHEMBL1172911,1 8.519,2 52.9,3 35.3,4 1.011,5 1.101,6 0.724,7 0.708,8 434.47,9 3.9,10 28,11 51,13 30,14 37,16 55,17 27,20 27,22 2,24 18,25 6,28 2,29 4,32 33,35 7.8,36 0.073,37 4,38 53,39 51.582,40 56.156,41 36.921,42 36.116,44 5.444}
{0 CHEMBL1172912,1 7.9,2 50.9,3 40,4 1,5 1.105,6 0.709,7 0.681,8 434.52,9 3.6,10 27,11 55,13 29,14 37,16 59,17 28,20 26,21 2,22 2,24 22,25 5,28 2,29 3,32 33,35 5.5,36 0.085,37 5,38 52.5,39 55.022,40 60.777,41 38.989,42 37.455,44 5.252}
{0 CHEMBL1172977,1 8.109,2 54,3 38,4 1.001,5 1.097,6 0.724,7 0.698,8 405.47,9 2,10 24,11 50,13 26,14 35,16 54,17 27,20 26,21 1,22 2,24 19,25 4,28 1,29 3,32 31,35 6,36 0.074,37 4,38 49,39 50.036,40 54.863,41 36.222,42 34.907,44 5.337}
{0 CHEMBL1172978,1 8.56,2 55.1,3 34.7,4 1.01,5 1.095,6 0.733,7 0.716,8 419.45,9 2,10 24,11 49,13 27,14 36,16 53,17 27,20 27,22 3,24 17,25 5,28 1,29 4,32 32,35 8.2,36 0.075,37 4,38 51,39 49.48,40 53.658,41 35.915,42 35.095,44 5.553}
{0 CHEMBL1173036,1 8.709,2 54,3 34,4 1.016,5 1.097,6 0.727,7 0.716,8 435.45,9 2,10 24,11 50,13 27,14 37,16 54,17 27,20 27,22 3,24 17,25 6,28 1,29 5,32 33,35 10,36 0.074,37 4,38 52,39 50.807,40 54.867,41 36.369,42 35.81,44 5.495}
{0 CHEMBL1173451,1 8.109,2 54,3 38,4 1.001,5 1.097,6 0.724,7 0.698,8 405.47,9 2,10 24,11 50,13 26,14 35,16 54,17 27,20 26,21 1,22 2,24 19,25 4,28 1,29 3,32 31,35 6,36 0.074,37 4,38 49,39 50.036,40 54.863,41 36.222,42 34.907,44 5.377}
{0 CHEMBL1173452,1 8.109,2 54,3 38,4 1.001,5 1.097,6 0.724,7 0.698,8 405.47,9 2,10 24,11 50,13 26,14 35,16 54,17 27,20 26,21 1,22 2,24 19,25 4,28 1,29 3,32 31,35 6,36 0.074,37 4,38 49,39 50.036,40 54.863,41 36.222,42 34.907,44 5.097}
{0 CHEMBL1173453,1 8.469,2 54,3 36,4 1.011,5 1.104,6 0.723,7 0.706,8 423.46,9 2,10 24,11 50,13 26,14 36,16 54,17 27,20 26,21 1,22 2,23 1,24 18,25 5,28 1,29 3,32 32,34 1,35 6,36 0.074,37 4,38 50,39 50.549,40 55.203,41 36.159,42 35.29,43 2,44 5.42}
{0 CHEMBL1173811,1 8.202,2 56.1,3 36.8,4 0.999,5 1.093,6 0.737,7 0.709,8 467.54,9 1.8,10 33,11 57,13 35,14 41,16 62,17 32,20 32,22 2,24 21,25 4,28 1,29 3,32 36,35 5.3,36 0.065,37 4,38 59.5,39 56.92,40 62.279,41 41.983,42 40.434,44 5.585}
{0 CHEMBL1173812,1 9.487,2 54,3 34,4 1.014,5 1.095,6 0.759,7 0.731,8 474.35,9 2,10 24,11 50,13 26,14 37,16 54,17 27,18 2,20 26,21 1,22 2,24 17,25 6,26 2,28 1,29 3,32 33,34 2,35 6,36 0.074,37 4,38 51,39 50.684,40 54.751,41 37.938,42 36.562,43 4,44 5.481}
