"molecule_id","Si","nCsp3","pXC50"
{1 61.434,2 8,3 8.155}
{0 CHEMBL136420,1 66.348,2 10,3 8.398}
{0 CHEMBL136680,1 57.434,2 10,3 7.796}
{0 CHEMBL136900,1 71.178,2 13,3 8.398}
{0 CHEMBL139187,1 64.85,2 9,3 7.367}
{0 CHEMBL146805,1 45.112,2 5,3 6.481}
{0 CHEMBL147064,1 48.527,2 6,3 7.921}
{0 CHEMBL147197,1 47.9,2 6,3 6.77}
{0 CHEMBL147407,1 41.275,2 5,3 5.638}
{0 CHEMBL148436,1 53.559,2 8,3 6.721}
{0 CHEMBL148585,1 40.358,2 5,3 5.585}
{0 CHEMBL148647,1 45.402,2 5,3 6.426}
{0 CHEMBL148648,1 45.112,2 5,3 5.495}
{0 CHEMBL148822,1 47.69,2 5,3 6.051}
{0 CHEMBL148835,1 41.275,2 5,3 5.886}
{0 CHEMBL148935,1 40.246,2 5,3 6.31}
{0 CHEMBL148936,1 56.145,2 9,3 6.854}
{0 CHEMBL149048,1 51.315,2 7,3 7.638}
{0 CHEMBL149409,1 54.521,2 7,3 7.004}
{0 CHEMBL149981,1 52.73,2 8,3 7.398}
{0 CHEMBL150296,1 56.145,2 9,3 7.229}
{0 CHEMBL150642,1 48.817,2 6,3 7.456}
{0 CHEMBL150734,1 65.182,2 12,3 7.143}
{0 CHEMBL150803,1 56.145,2 9,3 7.097}
{0 CHEMBL151017,1 59.561,2 10,3 8}
{0 CHEMBL151033,1 42.192,2 5,3 5.523}
{0 CHEMBL151268,1 48.106,2 7,3 6.456}
{0 CHEMBL151311,1 47.9,2 6,3 7.495}
{0 CHEMBL151394,1 55.521,2 6,3 7.174}
{0 CHEMBL151439,1 51.521,2 8,3 7.638}
{0 CHEMBL151486,1 54.521,2 7,3 8.097}
{0 CHEMBL151560,1 59.561,2 10,3 7}
{0 CHEMBL151567,1 56.145,2 9,3 6.77}
{0 CHEMBL151602,1 56.145,2 9,3 6.699}
{0 CHEMBL151605,1 48.607,2 5,3 6.229}
{0 CHEMBL151615,1 52.73,2 8,3 7.699}
{0 CHEMBL151690,1 50.994,2 6,3 6.921}
{0 CHEMBL151704,1 58.936,2 7,3 6.658}
{0 CHEMBL151753,1 41.275,2 5,3 5.959}
{0 CHEMBL151764,1 48.817,2 6,3 7.432}
{0 CHEMBL151806,1 47.531,2 5,3 5.495}
{0 CHEMBL244743,1 21.083,3 4.081}
{0 CHEMBL277816,1 54.73,2 8,3 6.674}
{0 CHEMBL284537,1 59.561,2 10,3 6.08}
{0 CHEMBL286539,1 57.145,2 9,3 7.721}
{0 CHEMBL287890,1 59.561,2 10,3 7.481}
{0 CHEMBL325841,1 30.704,3 4.151}
{0 CHEMBL330334,1 51.777,2 9,3 6.313}
{0 CHEMBL341857,1 46.69,2 5,3 5.187}
{0 CHEMBL342697,1 54.019,2 9,3 8.155}
{0 CHEMBL345259,1 57.936,2 8,3 6.745}
{0 CHEMBL345725,1 54.73,2 8,3 6.569}
{0 CHEMBL346418,1 52.023,2 6,3 7.469}
{0 CHEMBL34667,1 57.145,2 9,3 8.222}
{0 CHEMBL346682,1 59.561,2 10,3 6.886}
{0 CHEMBL347575,1 48.106,2 7,3 6.959}
{0 CHEMBL347716,1 56.145,2 9,3 7.921}
{0 CHEMBL348427,1 58.351,2 10,3 7.097}
{0 CHEMBL348496,1 47.9,2 6,3 7.62}
{0 CHEMBL348663,1 45.9,2 6,3 5.959}
{0 CHEMBL34965,1 59.561,2 10,3 7.721}
{0 CHEMBL356692,1 47.9,2 6,3 7.097}
{0 CHEMBL357712,1 45.402,2 5,3 6.654}
{0 CHEMBL357720,1 53.521,2 7,3 5.319}
{0 CHEMBL358327,1 48.607,2 5,3 6.596}
{0 CHEMBL359089,1 51.521,2 8,3 7.509}
{0 CHEMBL359168,1 51.106,2 6,3 7.444}
{0 CHEMBL36368,1 59.561,2 10,3 7.553}
{0 CHEMBL36514,1 59.561,2 10,3 8}
{0 CHEMBL422143,1 43.109,2 5,3 5.027}
{0 CHEMBL423753,1 48.106,2 7,3 6.587}
{0 CHEMBL435428,1 62.933,2 9,3 7.886}
{0 CHEMBL50,1 35.542,3 4.449}
{0 CHEMBL556517,1 52.023,2 6,3 7.357}
{0 CHEMBL56337,1 37.458,2 2,3 4.169}
{0 CHEMBL90344,1 48.361,2 8,3 7.569}
{0 CHEMBL90488,1 44.946,2 7,3 6.609}
{0 CHEMBL91846,1 48.361,2 8,3 6.762}
