"molecule_id","H.","C.","nH","AMW","Me","Mi","Mp","Mv","MW","N.","nAB","nAT","nB","pXC50"
{1 21.1,2 42.1,3 4,4 11.324,5 1.102,6 1.187,7 0.674,8 0.736,9 215.15,10 15.8,11 6,12 19,14 4.301}
{0 CHEMBL1224070,1 37.8,2 43.2,3 14,4 8.967,5 1.025,6 1.123,7 0.697,8 0.681,9 331.78,10 8.1,11 12,12 37,14 4.481}
{0 CHEMBL1224147,1 38.9,2 44.4,3 14,4 8.315,5 1.022,6 1.132,7 0.679,8 0.668,9 299.33,10 8.3,11 12,12 36,14 4.301}
{0 CHEMBL1671877,1 40,2 40,3 14,4 8.466,5 1.04,6 1.149,7 0.645,8 0.647,9 296.3,10 5.7,12 35,14 6.523}
{0 CHEMBL1672639,1 42.1,2 39.5,3 16,4 8.167,5 1.034,6 1.148,7 0.641,8 0.636,9 310.33,10 5.3,12 38,14 5.951}
{0 CHEMBL201048,1 46.9,2 37.5,3 15,4 7.291,5 1.008,6 1.138,7 0.64,8 0.614,9 233.3,10 9.4,11 10,12 32,14 6.54}
{0 CHEMBL201278,1 36.7,2 46.7,3 11,4 8.443,5 1.016,6 1.119,7 0.699,8 0.687,9 253.28,10 10,11 16,12 30,14 5.04}
{0 CHEMBL201409,1 43.3,2 36.7,3 13,4 8.378,5 1.015,6 1.13,7 0.679,8 0.644,9 251.34,10 10,11 10,12 30,14 6.52}
{0 CHEMBL201513,1 35,2 40,3 7,4 8.859,5 1.036,6 1.137,7 0.672,8 0.677,9 177.18,10 15,11 10,12 20,14 5.7}
{0 CHEMBL201724,1 43.3,2 40,3 13,4 7.709,5 1.013,6 1.133,7 0.658,8 0.638,9 231.28,10 10,11 10,12 30,14 5.96}
{0 CHEMBL202157,1 40.7,2 37,3 11,4 8.194,5 1.03,6 1.14,7 0.645,8 0.641,9 221.24,10 11.1,11 10,12 27,14 6.5}
{0 CHEMBL202206,1 44.8,2 37.9,3 13,4 7.561,5 1.013,6 1.138,7 0.646,8 0.625,9 219.27,10 10.3,11 10,12 29,14 6.48}
{0 CHEMBL202351,1 43.3,2 36.7,3 13,4 7.842,5 1.024,6 1.14,7 0.64,8 0.628,9 235.27,10 10,11 10,12 30,14 6.59}
{0 CHEMBL202427,1 38.2,2 44.1,3 13,4 8.333,5 1.021,6 1.124,7 0.682,8 0.672,9 283.31,10 8.8,11 16,12 34,14 5.3}
{0 CHEMBL202586,1 44.8,2 37.9,3 13,4 7.561,5 1.013,6 1.138,7 0.646,8 0.625,9 219.27,10 10.3,11 10,12 29,14 6.16}
{0 CHEMBL202614,1 42.3,2 38.5,3 11,4 7.894,5 1.019,6 1.137,7 0.653,8 0.639,9 205.24,10 11.5,11 10,12 26,14 5.13}
{0 CHEMBL202657,1 30,2 46.7,3 9,4 9.642,5 1.051,6 1.142,7 0.695,8 0.712,9 289.26,10 10,11 16,12 30,14 5}
{0 CHEMBL2036813,1 41.4,2 37.9,3 12,4 8.147,5 1.032,6 1.135,7 0.643,8 0.639,9 236.25,10 6.9,12 29,14 6.721}
{0 CHEMBL2036948,1 43.8,2 37.5,3 14,4 7.821,5 1.025,6 1.135,7 0.637,8 0.627,9 250.28,10 6.3,12 32,14 5.886}
{0 CHEMBL2036951,1 34.5,2 37.9,3 10,4 9.387,5 1.067,6 1.158,7 0.638,8 0.666,9 272.23,10 6.9,12 29,14 7.229}
{0 CHEMBL2036954,1 42.4,2 39.4,3 14,4 7.948,5 1.025,6 1.131,7 0.648,8 0.638,9 262.29,10 6.1,12 33,14 7.174}
{0 CHEMBL2036955,1 42.4,2 39.4,3 14,4 7.948,5 1.025,6 1.131,7 0.648,8 0.638,9 262.29,10 6.1,12 33,14 6.854}
{0 CHEMBL2036958,1 44.4,2 38.9,3 16,4 7.676,5 1.019,6 1.132,7 0.643,8 0.627,9 276.32,10 5.6,12 36,14 7.018}
{0 CHEMBL219950,1 43.8,2 43.8,3 14,4 7.696,5 1.015,6 1.117,7 0.661,8 0.642,9 246.28,11 6,12 32,14 5.208}
{0 CHEMBL219980,1 34.6,2 46.2,3 9,4 11.427,5 1.037,6 1.106,7 0.73,8 0.712,9 297.11,11 6,12 26,14 4.854}
{0 CHEMBL220001,1 31,2 44.8,3 9,4 9.87,5 1.074,6 1.15,7 0.662,8 0.696,9 286.22,11 6,12 29,14 4.9}
{0 CHEMBL221282,1 30.4,2 43.5,3 7,4 11.247,5 1.054,6 1.103,7 0.755,8 0.738,9 258.69,11 5,12 23,14 5.767}
{0 CHEMBL222472,1 30.4,2 43.5,3 7,4 13.18,5 1.05,6 1.098,7 0.777,8 0.747,9 303.14,11 5,12 23,14 5.387}
{0 CHEMBL223013,1 34.6,2 46.2,3 9,4 13.235,5 1.031,6 1.101,7 0.78,8 0.723,9 344.11,11 6,12 26,14 5.292}
{0 CHEMBL223140,1 34.8,2 43.5,3 8,4 9.75,5 1.04,6 1.105,7 0.718,8 0.702,9 224.25,11 5,12 23,14 5.377}
{0 CHEMBL223566,1 38.5,2 42.3,3 10,4 9.165,5 1.031,6 1.109,7 0.703,8 0.68,9 238.28,11 5,12 26,14 6.569}
{0 CHEMBL223623,1 38.5,2 42.3,3 10,4 9.165,5 1.031,6 1.109,7 0.703,8 0.68,9 238.28,11 5,12 26,14 5.745}
{0 CHEMBL223700,1 30.8,2 46.2,3 8,4 9.777,5 1.067,6 1.138,7 0.673,8 0.702,9 254.2,11 6,12 26,14 4.481}
{0 CHEMBL235141,1 47.1,2 35.3,3 16,4 7.421,5 1.021,6 1.139,7 0.622,8 0.606,9 252.3,10 5.9,11 6,12 34,14 6.55}
{0 CHEMBL235144,1 42.9,2 35.7,3 12,4 8.009,5 1.033,6 1.14,7 0.63,8 0.626,9 224.24,10 7.1,11 6,12 28,14 6.59}
{0 CHEMBL235167,1 41.4,2 37.9,3 12,4 8.147,5 1.032,6 1.135,7 0.643,8 0.639,9 236.25,10 6.9,11 6,12 29,14 5}
{0 CHEMBL235168,1 42.1,2 36.8,3 8,4 8.009,5 1.027,6 1.14,7 0.642,8 0.634,9 152.17,10 10.5,11 6,12 19,14 5.13}
{0 CHEMBL235178,1 50,2 35.7,3 14,4 6.938,5 1.006,6 1.14,7 0.625,8 0.594,9 194.26,10 7.1,11 6,12 28,14 5}
{0 CHEMBL235230,1 38.1,2 33.3,3 8,4 8.391,5 1.024,6 1.162,7 0.657,8 0.65,9 176.21,10 28.6,11 10,12 21,14 5.467}
{0 CHEMBL235394,1 46.2,2 34.6,3 12,4 7.547,5 1.023,6 1.142,7 0.622,8 0.609,9 196.23,10 7.7,11 6,12 26,14 6.03}
{0 CHEMBL235615,1 43.5,2 39.1,3 10,4 7.748,5 1.017,6 1.134,7 0.651,8 0.634,9 178.21,10 8.7,11 6,12 23,14 6.49}
{0 CHEMBL236011,1 42.9,2 35.7,3 12,4 8.009,5 1.033,6 1.14,7 0.63,8 0.626,9 224.24,10 7.1,11 6,12 28,14 7.53}
{0 CHEMBL236013,1 38.5,2 38.5,3 10,4 8.547,5 1.04,6 1.134,7 0.649,8 0.654,9 222.22,10 7.7,11 6,12 26,14 7}
{0 CHEMBL236028,1 41.4,2 37.9,3 12,4 8.147,5 1.032,6 1.135,7 0.643,8 0.639,9 236.25,10 6.9,11 6,12 29,14 6.7}
{0 CHEMBL236219,1 45.2,2 35.5,3 14,4 7.686,5 1.026,6 1.14,7 0.626,8 0.615,9 238.27,10 6.5,11 6,12 31,14 6.8}
{0 CHEMBL237077,1 47.1,2 35.3,3 16,4 7.421,5 1.021,6 1.139,7 0.622,8 0.606,9 252.3,10 5.9,11 6,12 34,14 6.44}
{0 CHEMBL237296,1 34.5,2 44.8,3 10,4 8.905,5 1.036,6 1.121,7 0.685,8 0.69,9 258.25,10 6.9,11 12,12 29,14 5.61}
{0 CHEMBL237524,1 46.2,2 38.5,3 12,4 7.394,5 1.011,6 1.134,7 0.643,8 0.619,9 192.24,10 7.7,11 6,12 26,14 7.14}
{0 CHEMBL237525,1 52.9,2 35.3,3 18,4 6.539,5 0.998,6 1.139,7 0.618,8 0.579,9 222.32,10 5.9,11 6,12 34,14 5.2}
{0 CHEMBL237731,1 36.4,2 36.4,3 8,4 8.917,5 1.053,6 1.14,7 0.642,8 0.658,9 196.18,10 9.1,11 6,12 22,14 5.72}
{0 CHEMBL237732,1 45.5,2 36.4,3 10,4 7.555,5 1.018,6 1.14,7 0.635,8 0.617,9 166.2,10 9.1,11 6,12 22,14 6.4}
{0 CHEMBL237733,1 48,2 36,3 12,4 7.209,5 1.011,6 1.14,7 0.629,8 0.604,9 180.23,10 8,11 6,12 25,14 7.29}
{0 CHEMBL237735,1 48.3,2 37.9,3 14,4 7.113,5 1.006,6 1.135,7 0.638,8 0.608,9 206.27,10 6.9,11 6,12 29,14 6.41}
{0 CHEMBL237737,1 50,2 35.7,3 14,4 6.938,5 1.006,6 1.14,7 0.625,8 0.594,9 194.26,10 7.1,11 6,12 28,14 5.97}
{0 CHEMBL237738,1 38.5,2 46.2,3 10,4 8.24,5 1.015,6 1.118,7 0.691,8 0.676,9 214.24,10 7.7,11 12,12 26,14 5.49}
{0 CHEMBL237739,1 35.7,2 46.4,3 10,4 8.652,5 1.026,6 1.117,7 0.694,8 0.689,9 242.25,10 7.1,11 12,12 28,14 5.8}
{0 CHEMBL237945,1 50,2 35.7,3 14,4 6.938,5 1.006,6 1.14,7 0.625,8 0.594,9 194.26,10 7.1,11 6,12 28,14 7}
{0 CHEMBL237946,1 51.6,2 35.5,3 16,4 6.719,5 1.001,6 1.139,7 0.621,8 0.586,9 208.29,10 6.5,11 6,12 31,14 6.82}
{0 CHEMBL238002,1 47.6,2 33.3,3 10,4 7.342,5 1.019,6 1.146,7 0.617,8 0.599,9 154.19,10 9.5,11 5,12 21,14 4.38}
{0 CHEMBL238164,1 43.8,2 34.4,3 14,4 7.946,5 1.036,6 1.142,7 0.62,8 0.618,9 254.27,10 6.3,11 6,12 32,14 5.85}
{0 CHEMBL238358,1 38.5,2 38.5,3 10,4 8.547,5 1.04,6 1.134,7 0.649,8 0.654,9 222.22,10 7.7,11 6,12 26,14 6.51}
{0 CHEMBL238374,1 40,2 36,3 10,4 8.408,5 1.042,6 1.14,7 0.635,8 0.64,9 210.21,10 8,11 6,12 25,14 5.69}
{0 CHEMBL238375,1 45.2,2 35.5,3 14,4 7.686,5 1.026,6 1.14,7 0.626,8 0.615,9 238.27,10 6.5,11 6,12 31,14 7.28}
{0 CHEMBL238376,1 48.6,2 35.1,3 18,4 7.198,5 1.016,6 1.139,7 0.619,8 0.598,9 266.33,10 5.4,11 6,12 37,14 6.92}
{0 CHEMBL238385,1 48.3,2 34.5,3 14,4 7.25,5 1.017,6 1.142,7 0.619,8 0.598,9 210.26,10 6.9,11 6,12 29,14 5.49}
{0 CHEMBL238386,1 46.7,2 36.7,3 14,4 7.409,5 1.016,6 1.137,7 0.631,8 0.612,9 222.27,10 6.7,11 6,12 30,14 6.22}
{0 CHEMBL238387,1 50,2 35.7,3 14,4 6.938,5 1.006,6 1.14,7 0.625,8 0.594,9 194.26,10 7.1,11 6,12 28,14 5.79}
{0 CHEMBL247921,1 51.9,2 33.3,3 14,4 6.75,5 1.006,6 1.145,7 0.611,8 0.579,9 182.25,10 7.4,11 5,12 27,14 4.73}
{0 CHEMBL278488,1 38.5,2 46.2,3 10,4 8.393,5 1.028,6 1.112,7 0.678,8 0.673,9 218.22,11 6,12 26,14 5.523}
{0 CHEMBL370386,1 46.9,2 37.5,3 15,4 7.291,5 1.008,6 1.138,7 0.64,8 0.614,9 233.3,10 9.4,11 10,12 32,14 5.52}
{0 CHEMBL372727,1 44.8,2 37.9,3 13,4 7.561,5 1.013,6 1.138,7 0.646,8 0.625,9 219.27,10 10.3,11 10,12 29,14 6.59}
{0 CHEMBL373484,1 34.6,2 42.3,3 9,4 12.199,5 1.04,6 1.103,7 0.755,8 0.719,9 317.17,11 5,12 26,14 4.983}
{0 CHEMBL374111,1 34.6,2 46.2,3 9,4 9.718,5 1.04,6 1.11,7 0.711,8 0.705,9 252.66,11 6,12 26,14 4.658}
{0 CHEMBL375493,1 30.4,2 43.5,3 7,4 13.18,5 1.05,6 1.098,7 0.777,8 0.747,9 303.14,11 5,12 23,14 5.829}
{0 CHEMBL375625,1 30.8,2 46.2,3 8,4 9.777,5 1.067,6 1.138,7 0.673,8 0.702,9 254.2,11 6,12 26,14 4.444}
{0 CHEMBL375754,1 44.4,2 40.7,3 12,4 7.712,5 1.023,6 1.123,7 0.644,8 0.63,9 208.23,12 27,14 5.292}
{0 CHEMBL375762,1 34.6,2 46.2,3 9,4 9.085,5 1.048,6 1.125,7 0.675,8 0.688,9 236.21,11 6,12 26,14 5.004}
{0 CHEMBL376419,1 30.8,2 46.2,3 8,4 9.777,5 1.067,6 1.138,7 0.673,8 0.702,9 254.2,11 6,12 26,14 4.721}
{0 CHEMBL380939,1 37.5,2 41.7,3 9,4 8.468,5 1.025,6 1.132,7 0.675,8 0.67,9 203.22,10 12.5,11 10,12 24,14 5.63}
{0 CHEMBL381638,1 42.3,2 38.5,3 11,4 7.894,5 1.019,6 1.137,7 0.653,8 0.639,9 205.24,10 11.5,11 10,12 26,14 6.4}
{0 CHEMBL382096,1 43.3,2 36.7,3 13,4 7.842,5 1.024,6 1.14,7 0.64,8 0.628,9 235.27,10 10,11 10,12 30,14 6.7}
{0 CHEMBL382863,1 44.4,2 40.7,3 12,4 7.565,5 1.01,6 1.129,7 0.657,8 0.634,9 204.25,10 7.4,11 10,12 27,14 5.47}
{0 CHEMBL383099,1 45.5,2 39.4,3 15,4 7.434,5 1.008,6 1.133,7 0.651,8 0.626,9 245.31,10 9.1,11 10,12 33,14 5.23}
{0 CHEMBL383367,1 37.5,2 50,3 15,4 8.234,5 1.007,6 1.11,7 0.712,8 0.691,9 329.38,10 7.5,11 22,12 40,14 5}
{0 CHEMBL385103,1 30.8,2 46.2,3 8,4 9.777,5 1.067,6 1.138,7 0.673,8 0.702,9 254.2,11 6,12 26,14 4.62}
{0 CHEMBL391473,1 45.2,2 35.5,3 14,4 7.686,5 1.026,6 1.14,7 0.626,8 0.615,9 238.27,10 6.5,11 6,12 31,14 6.82}
{0 CHEMBL391547,1 40,2 36,3 10,4 8.408,5 1.042,6 1.14,7 0.635,8 0.64,9 210.21,10 8,11 6,12 25,14 6.64}
{0 CHEMBL392830,1 43.8,2 37.5,3 14,4 7.821,5 1.025,6 1.135,7 0.637,8 0.627,9 250.28,10 6.3,11 6,12 32,14 6.51}
{0 CHEMBL393064,1 43.5,2 30.4,3 10,4 7.749,5 1.016,6 1.166,7 0.633,8 0.617,9 178.23,10 26.1,11 10,12 23,14 6.14}
{0 CHEMBL393065,1 46.2,2 30.8,3 12,4 7.395,5 1.01,6 1.163,7 0.628,8 0.604,9 192.26,10 23.1,11 10,12 26,14 5.12}
{0 CHEMBL394288,1 45.5,2 36.4,3 10,4 7.555,5 1.018,6 1.14,7 0.635,8 0.617,9 166.2,10 9.1,11 6,12 22,14 5}
{0 CHEMBL394468,1 43.5,2 39.1,3 10,4 7.748,5 1.017,6 1.134,7 0.651,8 0.634,9 178.21,10 8.7,11 6,12 23,14 7.265}
{0 CHEMBL394469,1 48,2 36,3 12,4 7.209,5 1.011,6 1.14,7 0.629,8 0.604,9 180.23,10 8,11 6,12 25,14 6.22}
{0 CHEMBL394906,1 42.4,2 36.4,3 14,4 8.069,5 1.035,6 1.137,7 0.632,8 0.63,9 266.28,10 6.1,11 6,12 33,14 6.51}
{0 CHEMBL394907,1 45.2,2 35.5,3 14,4 7.686,5 1.026,6 1.14,7 0.626,8 0.615,9 238.27,10 6.5,11 6,12 31,14 6.2}
{0 CHEMBL396073,1 41.4,2 34.5,3 12,4 8.284,5 1.043,6 1.142,7 0.624,8 0.629,9 240.24,10 6.9,11 6,12 29,14 6.23}
{0 CHEMBL396382,1 51.6,2 35.5,3 16,4 6.719,5 1.001,6 1.139,7 0.621,8 0.586,9 208.29,10 6.5,11 6,12 31,14 5.88}
{0 CHEMBL396878,1 50,2 35.7,3 14,4 6.938,5 1.006,6 1.14,7 0.625,8 0.594,9 194.26,10 7.1,11 6,12 28,14 6.42}
{0 CHEMBL396879,1 51.6,2 35.5,3 16,4 6.719,5 1.001,6 1.139,7 0.621,8 0.586,9 208.29,10 6.5,11 6,12 31,14 6.57}
{0 CHEMBL397055,1 35,2 30,3 7,4 9.11,5 1.05,6 1.187,7 0.637,8 0.652,9 182.19,10 30,11 10,12 20,14 4.91}
{0 CHEMBL397616,1 47.1,2 35.3,3 16,4 7.421,5 1.021,6 1.139,7 0.622,8 0.606,9 252.3,10 5.9,11 6,12 34,14 7.24}
{0 CHEMBL424750,1 30.4,2 43.5,3 7,4 11.247,5 1.054,6 1.103,7 0.755,8 0.738,9 258.69,11 5,12 23,14 5.432}
{0 CHEMBL424938,1 38.5,2 42.3,3 10,4 9.165,5 1.031,6 1.109,7 0.703,8 0.68,9 238.28,11 5,12 26,14 6.745}
{0 CHEMBL428730,1 50,2 33.3,3 12,4 7.009,5 1.012,6 1.145,7 0.614,8 0.588,9 168.22,10 8.3,11 5,12 24,14 4.93}
{0 CHEMBL436301,1 41.4,2 44.8,3 12,4 8.009,5 1.021,6 1.115,7 0.668,8 0.656,9 232.25,11 6,12 29,14 5.319}
{0 CHEMBL439028,1 32.3,2 45.2,3 10,4 9.234,5 1.044,6 1.119,7 0.688,8 0.701,9 286.26,10 6.5,11 12,12 31,14 5.51}
{0 CHEMBL440041,1 40.7,2 40.7,3 11,4 8.046,5 1.018,6 1.132,7 0.666,8 0.652,9 217.25,10 11.1,11 10,12 27,14 5.51}
{0 CHEMBL440217,1 39.1,2 39.1,3 9,4 8.313,5 1.027,6 1.137,7 0.661,8 0.655,9 191.21,10 13,11 10,12 23,14 6.05}
{0 CHEMBL550153,1 38.2,2 41.2,3 13,4 8.923,5 1.023,6 1.121,7 0.701,8 0.677,9 303.37,10 8.8,11 15,12 34,14 5}
{0 CHEMBL550563,1 37.5,2 45,3 15,4 8.584,5 1.029,6 1.137,7 0.678,8 0.674,9 343.36,10 7.5,11 17,12 40,14 5.06}
{0 CHEMBL552399,1 51.7,2 31,3 15,4 6.802,5 1.009,6 1.152,7 0.603,8 0.574,9 197.27,10 10.3,11 5,12 29,14 5.17}
{0 CHEMBL553415,1 50,2 30.8,3 13,4 7.048,5 1.015,6 1.153,7 0.605,8 0.582,9 183.24,10 11.5,11 5,12 26,14 5.35}
{0 CHEMBL553912,1 58,2 32,3 29,4 5.91,5 0.989,6 1.146,7 0.596,8 0.547,9 295.48,10 6,11 5,12 50,14 5}
{0 CHEMBL557298,1 45.7,2 43.5,3 21,4 7.292,5 0.998,6 1.123,7 0.669,8 0.636,9 335.44,10 6.5,11 17,12 46,14 5.25}
{0 CHEMBL559204,1 38.2,2 41.2,3 13,4 9.395,5 1.016,6 1.113,7 0.736,8 0.691,9 319.44,10 8.8,11 15,12 34,14 6.85}
{0 CHEMBL560254,1 53.1,2 31.3,3 17,4 6.603,5 1.005,6 1.151,7 0.602,8 0.568,9 211.3,10 9.4,11 5,12 32,14 5.08}
{0 CHEMBL561720,1 50,2 35.3,3 17,4 6.921,5 1.004,6 1.142,7 0.625,8 0.594,9 235.32,10 8.8,11 5,12 34,14 5.4}
{0 CHEMBL561920,1 42.5,2 45,3 17,4 7.684,5 1.004,6 1.121,7 0.681,8 0.655,9 307.38,10 7.5,11 17,12 40,14 6.07}
{0 CHEMBL562675,1 38.2,2 41.2,3 13,4 9.395,5 1.016,6 1.113,7 0.736,8 0.691,9 319.44,10 8.8,11 15,12 34,14 6.59}
{0 CHEMBL562933,1 56.8,2 31.8,3 25,4 6.078,5 0.993,6 1.147,7 0.598,8 0.552,9 267.42,10 6.8,11 5,12 44,14 5}
{0 CHEMBL564064,1 37.5,2 45,3 15,4 8.584,5 1.029,6 1.137,7 0.678,8 0.674,9 343.36,10 7.5,11 17,12 40,14 5}
{0 CHEMBL564300,1 38.2,2 41.2,3 13,4 9.395,5 1.016,6 1.113,7 0.736,8 0.691,9 319.44,10 8.8,11 15,12 34,14 8.5}
{0 CHEMBL564907,1 37.5,2 45,3 15,4 8.584,5 1.029,6 1.137,7 0.678,8 0.674,9 343.36,10 7.5,11 17,12 40,14 5}
{0 CHEMBL564914,1 40.5,2 43.2,3 15,4 8.471,5 1.009,6 1.117,7 0.707,8 0.671,9 313.41,10 8.1,11 16,12 37,14 7.84}
{0 CHEMBL565055,1 38.2,2 41.2,3 13,4 8.45,5 1.03,6 1.13,7 0.666,8 0.663,9 287.3,10 8.8,11 15,12 34,14 5.05}
{0 CHEMBL573,1 35.7,2 42.9,3 5,4 8.794,5 1.037,6 1.125,7 0.674,8 0.679,9 123.12,10 7.1,11 6,12 14,14 4.12}
