"molecule_id","FCFP4_1024b793","FCFP4_1024b453","FCFP4_1024b352","FCFP4_1024b1020","FCFP4_1024b495","FCFP4_1024b937","FCFP4_1024b283","FCFP4_1024b855","FCFP4_1024b54","FCFP4_1024b400","FCFP4_1024b64","FCFP4_1024b438","FCFP4_1024b1","FCFP4_1024b10","FCFP4_1024b100","FCFP4_1024b1000","FCFP4_1024b1001","FCFP4_1024b1002","FCFP4_1024b1003","FCFP4_1024b1004","FCFP4_1024b1005","FCFP4_1024b1006","FCFP4_1024b1007","FCFP4_1024b1008","FCFP4_1024b1009","FCFP4_1024b101","FCFP4_1024b1010","FCFP4_1024b1011","FCFP4_1024b1012","FCFP4_1024b1013","FCFP4_1024b1014","FCFP4_1024b1015","FCFP4_1024b1016","FCFP4_1024b1017","FCFP4_1024b1018","FCFP4_1024b1019","FCFP4_1024b102","FCFP4_1024b1021","FCFP4_1024b1022","FCFP4_1024b1023","FCFP4_1024b1024","FCFP4_1024b103","FCFP4_1024b104","FCFP4_1024b105","FCFP4_1024b106","FCFP4_1024b107","FCFP4_1024b108","FCFP4_1024b109","FCFP4_1024b11","FCFP4_1024b110","FCFP4_1024b111","pXC50"
{13 1,28 1,36 1,52 5.2}
{0 CHEMBL101253,2 1,8 1,9 1,13 1,52 5.2}
{0 CHEMBL103667,2 1,3 1,8 1,9 1,13 1,14 1,46 1,52 5.2}
{0 CHEMBL105442,2 1,9 1,13 1,52 5}
{0 CHEMBL1082152,1 1,2 1,7 1,9 1,13 1,46 1,52 6.495}
{0 CHEMBL1082440,6 1,13 1,14 1,41 1,52 6.8}
{0 CHEMBL1084546,2 1,8 1,9 1,13 1,46 1,52 6.2}
{0 CHEMBL1090356,2 1,7 1,9 1,10 1,11 1,12 1,13 1,46 1,48 1,52 5.5}
{0 CHEMBL116070,13 1,52 5.4}
{0 CHEMBL1164265,8 1,13 1,14 1,46 1,52 6.3}
{0 CHEMBL1173442,13 1,47 1,52 6.585}
{0 CHEMBL1173655,2 1,8 1,9 1,12 1,13 1,14 1,46 1,52 5}
{0 CHEMBL117697,2 1,8 1,9 1,13 1,52 5.4}
{0 CHEMBL1190711,8 1,10 1,12 1,13 1,52 5.8}
{0 CHEMBL119385,13 1,19 1,30 1,52 5.2}
{0 CHEMBL1230020,2 1,9 1,13 1,46 1,52 5.456}
{0 CHEMBL1230122,13 1,46 1,52 5.4}
{0 CHEMBL1236107,5 1,13 1,52 5}
{0 CHEMBL1236126,13 1,46 1,50 1,52 5.4}
{0 CHEMBL1240703,13 1,20 1,52 6.071}
{0 CHEMBL1241473,2 1,8 1,9 1,13 1,32 1,52 8}
{0 CHEMBL1241674,1 1,4 1,8 1,9 1,13 1,52 7.155}
{0 CHEMBL1242373,1 1,2 1,3 1,4 1,7 1,8 1,9 1,13 1,33 1,38 1,46 1,52 6.6}
{0 CHEMBL124660,2 1,7 1,9 1,13 1,14 1,46 1,52 5.119}
{0 CHEMBL127898,6 1,13 1,14 1,31 1,52 5.4}
{0 CHEMBL1287853,2 1,8 1,9 1,13 1,14 1,52 7.018}
{0 CHEMBL1288582,5 1,9 1,13 1,16 1,52 5.418}
{0 CHEMBL1289926,13 1,16 1,38 1,47 1,52 7.796}
{0 CHEMBL1336,2 1,3 1,7 1,9 1,13 1,46 1,47 1,52 5.408}
{0 CHEMBL1375418,8 1,13 1,46 1,52 5.4}
{0 CHEMBL1375640,4 1,13 1,52 5.7}
{0 CHEMBL1381197,8 1,13 1,46 1,52 5.4}
{0 CHEMBL1419458,4 1,8 1,13 1,36 1,50 1,52 5.4}
{0 CHEMBL1421,8 1,9 1,13 1,14 1,28 1,46 1,52 5.35}
{0 CHEMBL143703,2 1,3 1,7 1,8 1,9 1,13 1,46 1,52 4.4}
{0 CHEMBL1461728,2 1,7 1,9 1,13 1,16 1,40 1,46 1,52 5.4}
{0 CHEMBL1472492,1 1,13 1,23 1,52 5.5}
{0 CHEMBL14762,3 1,8 1,13 1,46 1,52 5}
{0 CHEMBL1614701,2 1,9 1,13 1,50 1,52 5}
{0 CHEMBL1614705,13 1,16 1,52 5.4}
{0 CHEMBL162,13 1,47 1,52 9.125}
{0 CHEMBL1624529,13 1,23 1,52 5.4}
{0 CHEMBL1682345,9 1,13 1,16 1,40 1,52 5.6}
{0 CHEMBL1682357,9 1,13 1,16 1,40 1,52 5.4}
{0 CHEMBL1682540,9 1,12 1,16 1,40 1,49 1,52 5.4}
{0 CHEMBL1682545,2 1,9 1,16 1,40 1,49 1,52 5.5}
{0 CHEMBL1682546,9 1,13 1,16 1,32 1,40 1,46 1,49 1,52 5.4}
{0 CHEMBL1682552,8 1,9 1,12 1,13 1,16 1,40 1,46 1,52 5.4}
{0 CHEMBL1682553,8 1,9 1,12 1,13 1,16 1,40 1,46 1,52 5.4}
{0 CHEMBL1682558,9 1,11 1,13 1,14 1,16 1,40 1,52 5.4}
{0 CHEMBL1721885,2 1,9 1,13 1,14 1,46 1,52 6.745}
{0 CHEMBL1727312,2 1,9 1,13 1,46 1,52 4.6}
{0 CHEMBL17370,13 1,28 1,36 1,52 5.4}
{0 CHEMBL1789941,13 1,14 1,50 1,52 6.699}
{0 CHEMBL180022,2 1,5 1,6 1,9 1,12 1,13 1,14 1,46 1,52 5}
{0 CHEMBL1825138,4 1,8 1,13 1,52 6.3}
{0 CHEMBL183844,2 1,3 1,7 1,9 1,13 1,18 1,46 1,52 5.4}
{0 CHEMBL184847,2 1,3 1,7 1,9 1,13 1,46 1,52 5.4}
{0 CHEMBL185569,2 1,3 1,7 1,9 1,13 1,46 1,52 6.5}
{0 CHEMBL1908391,2 1,6 1,7 1,9 1,13 1,14 1,46 1,49 1,52 5}
{0 CHEMBL1908392,1 1,6 1,9 1,13 1,14 1,20 1,52 7.276}
{0 CHEMBL1908393,2 1,5 1,7 1,9 1,13 1,14 1,46 1,52 8.456}
{0 CHEMBL1908394,6 1,13 1,14 1,52 5}
{0 CHEMBL1908395,2 1,6 1,9 1,13 1,14 1,36 1,46 1,52 7.509}
{0 CHEMBL1908396,2 1,3 1,5 1,9 1,13 1,46 1,52 6.854}
{0 CHEMBL1908397,13 1,16 1,52 7.678}
{0 CHEMBL191003,2 1,4 1,9 1,13 1,35 1,52 6.921}
{0 CHEMBL1957190,13 1,47 1,52 4.456}
{0 CHEMBL1958401,13 1,52 5.4}
{0 CHEMBL196363,1 1,2 1,3 1,4 1,7 1,8 1,9 1,13 1,33 1,38 1,46 1,52 6.8}
{0 CHEMBL1964290,4 1,13 1,52 6.5}
{0 CHEMBL1964307,2 1,4 1,7 1,8 1,9 1,13 1,16 1,46 1,52 6.7}
{0 CHEMBL1964399,2 1,9 1,13 1,52 8.1}
{0 CHEMBL1964413,9 1,13 1,16 1,36 1,40 1,52 5.4}
{0 CHEMBL1964444,3 1,5 1,8 1,9 1,13 1,46 1,52 5.4}
{0 CHEMBL1964644,13 1,46 1,52 5.4}
{0 CHEMBL1964687,1 1,2 1,3 1,4 1,7 1,8 1,9 1,13 1,33 1,36 1,38 1,46 1,52 5.7}
{0 CHEMBL1964692,2 1,3 1,4 1,7 1,8 1,9 1,13 1,46 1,52 5.4}
{0 CHEMBL1964777,13 1,52 5.4}
{0 CHEMBL1964804,13 1,52 5.4}
{0 CHEMBL1964937,9 1,13 1,52 5.4}
{0 CHEMBL1965131,9 1,13 1,46 1,52 5.5}
{0 CHEMBL1965423,4 1,10 1,11 1,12 1,13 1,48 1,50 1,52 5.4}
{0 CHEMBL1965495,6 1,13 1,14 1,16 1,51 1,52 6.4}
{0 CHEMBL1965507,1 1,2 1,3 1,4 1,7 1,8 1,9 1,13 1,33 1,46 1,52 7.9}
{0 CHEMBL1965570,1 1,2 1,3 1,4 1,5 1,7 1,8 1,9 1,13 1,28 1,46 1,52 7}
{0 CHEMBL1965589,10 1,11 1,12 1,13 1,46 1,52 5.4}
{0 CHEMBL1965631,13 1,14 1,16 1,46 1,51 1,52 5.4}
{0 CHEMBL1965660,4 1,13 1,52 6.3}
{0 CHEMBL1965836,13 1,16 1,52 5.6}
{0 CHEMBL1965845,13 1,52 5.6}
{0 CHEMBL1965910,1 1,4 1,8 1,13 1,14 1,38 1,52 5.4}
{0 CHEMBL1965988,1 1,2 1,3 1,4 1,5 1,7 1,8 1,9 1,13 1,46 1,52 6.8}
{0 CHEMBL1966035,13 1,24 1,49 1,52 5.4}
{0 CHEMBL1966087,13 1,37 1,52 5.4}
{0 CHEMBL1966279,2 1,7 1,9 1,13 1,36 1,46 1,52 5.4}
{0 CHEMBL1966343,4 1,8 1,9 1,13 1,16 1,52 6.8}
{0 CHEMBL1966425,2 1,9 1,13 1,14 1,52 5.5}
{0 CHEMBL1966514,1 1,2 1,3 1,4 1,5 1,7 1,8 1,9 1,13 1,28 1,46 1,52 6.7}
{0 CHEMBL1966524,9 1,13 1,52 6.2}
{0 CHEMBL1966628,13 1,46 1,52 5.4}
{0 CHEMBL1966703,13 1,16 1,52 5.4}
{0 CHEMBL1966722,2 1,3 1,7 1,9 1,13 1,46 1,52 6.1}
{0 CHEMBL1966808,8 1,13 1,28 1,46 1,52 5.4}
{0 CHEMBL1966816,3 1,5 1,8 1,9 1,13 1,21 1,46 1,52 5.4}
{0 CHEMBL1967094,13 1,16 1,51 1,52 6.2}
{0 CHEMBL1967116,1 1,2 1,3 1,4 1,5 1,7 1,8 1,9 1,13 1,46 1,52 7.9}
{0 CHEMBL1967302,2 1,9 1,13 1,18 1,46 1,52 5.4}
{0 CHEMBL1967531,1 1,2 1,3 1,4 1,7 1,8 1,9 1,13 1,33 1,38 1,46 1,52 6.6}
{0 CHEMBL1967538,13 1,52 4.4}
{0 CHEMBL1967544,13 1,52 5.4}
{0 CHEMBL1967560,2 1,9 1,13 1,14 1,19 1,48 1,52 5.4}
{0 CHEMBL1967564,13 1,16 1,46 1,51 1,52 5.4}
{0 CHEMBL1967720,1 1,2 1,3 1,4 1,5 1,7 1,8 1,9 1,13 1,46 1,52 7.3}
{0 CHEMBL1967878,2 1,3 1,8 1,9 1,13 1,14 1,46 1,52 8.2}
{0 CHEMBL1967887,13 1,16 1,52 5.4}
{0 CHEMBL1968070,2 1,8 1,9 1,13 1,46 1,47 1,52 6.4}
{0 CHEMBL1968127,10 1,11 1,12 1,13 1,14 1,43 1,46 1,48 1,52 5.4}
{0 CHEMBL1968151,8 1,13 1,28 1,46 1,52 5.4}
{0 CHEMBL1968245,9 1,13 1,37 1,52 5.4}
{0 CHEMBL1968380,2 1,9 1,13 1,14 1,29 1,52 5.4}
{0 CHEMBL1968406,1 1,2 1,3 1,4 1,7 1,8 1,9 1,13 1,33 1,38 1,46 1,52 5.4}
{0 CHEMBL1968590,1 1,4 1,5 1,8 1,13 1,47 1,52 5.6}
{0 CHEMBL1968705,2 1,7 1,8 1,9 1,13 1,14 1,16 1,40 1,46 1,49 1,52 5.7}
{0 CHEMBL1968791,1 1,4 1,8 1,13 1,14 1,38 1,52 5.4}
{0 CHEMBL1968850,2 1,8 1,9 1,13 1,46 1,47 1,52 5.9}
{0 CHEMBL1968926,13 1,16 1,28 1,52 5.4}
{0 CHEMBL1969042,2 1,9 1,16 1,52 5.5}
{0 CHEMBL1969049,13 1,28 1,36 1,52 5.4}
{0 CHEMBL1969102,1 1,2 1,3 1,4 1,5 1,7 1,8 1,9 1,13 1,16 1,46 1,52 7.1}
{0 CHEMBL1969126,10 1,11 1,12 1,13 1,48 1,52 5.4}
{0 CHEMBL1969156,1 1,4 1,12 1,52 4.4}
{0 CHEMBL1969190,2 1,3 1,4 1,7 1,8 1,9 1,13 1,46 1,52 5.4}
{0 CHEMBL1969264,9 1,13 1,52 6.9}
{0 CHEMBL1969301,6 1,13 1,14 1,36 1,46 1,50 1,52 5.4}
{0 CHEMBL1969372,10 1,11 1,12 1,13 1,29 1,46 1,52 5.4}
{0 CHEMBL1969502,7 1,9 1,13 1,39 1,46 1,50 1,52 6.8}
{0 CHEMBL1969506,2 1,7 1,9 1,13 1,46 1,52 5.4}
{0 CHEMBL1969523,2 1,9 1,13 1,52 7.8}
{0 CHEMBL1969537,12 1,13 1,52 5.4}
{0 CHEMBL1969561,9 1,13 1,16 1,20 1,40 1,52 6.6}
{0 CHEMBL1969588,8 1,13 1,46 1,52 5.7}
{0 CHEMBL1969664,1 1,6 1,9 1,13 1,14 1,52 5.4}
{0 CHEMBL1969735,10 1,11 1,12 1,13 1,43 1,46 1,52 5.4}
{0 CHEMBL1969755,13 1,28 1,46 1,52 5.4}
{0 CHEMBL1969843,9 1,13 1,16 1,22 1,40 1,52 5.4}
{0 CHEMBL1969879,13 1,22 1,52 5.4}
{0 CHEMBL1970074,2 1,3 1,7 1,9 1,13 1,16 1,46 1,52 5.4}
{0 CHEMBL1970083,1 1,2 1,3 1,4 1,5 1,7 1,8 1,9 1,13 1,28 1,46 1,52 7.3}
{0 CHEMBL1970104,9 1,13 1,15 1,16 1,42 1,52 6.7}
{0 CHEMBL1970142,1 1,2 1,3 1,4 1,5 1,7 1,8 1,9 1,13 1,46 1,47 1,52 7.8}
{0 CHEMBL1970189,13 1,14 1,16 1,28 1,52 5.4}
{0 CHEMBL1970203,1 1,2 1,3 1,4 1,7 1,8 1,9 1,13 1,33 1,36 1,46 1,52 7.7}
{0 CHEMBL1970217,13 1,28 1,52 5.4}
{0 CHEMBL1970314,2 1,4 1,5 1,9 1,13 1,18 1,52 5.7}
{0 CHEMBL1970317,1 1,2 1,3 1,4 1,5 1,7 1,8 1,9 1,13 1,46 1,52 7.8}
{0 CHEMBL1970340,4 1,8 1,52 5.7}
{0 CHEMBL1970369,9 1,13 1,16 1,20 1,40 1,52 5.4}
{0 CHEMBL1970522,13 1,52 5.7}
{0 CHEMBL1970709,2 1,3 1,7 1,9 1,13 1,16 1,40 1,46 1,52 5.4}
{0 CHEMBL1970735,4 1,6 1,8 1,9 1,13 1,14 1,46 1,52 5.4}
{0 CHEMBL1970806,8 1,13 1,46 1,52 5.4}
{0 CHEMBL1970873,2 1,9 1,13 1,36 1,46 1,52 4.6}
{0 CHEMBL1970879,1 1,2 1,4 1,8 1,9 1,13 1,14 1,18 1,46 1,52 6.4}
{0 CHEMBL1970903,9 1,13 1,16 1,52 5.4}
{0 CHEMBL1970913,8 1,13 1,46 1,52 5.4}
{0 CHEMBL1971017,13 1,52 6.7}
{0 CHEMBL1971021,2 1,3 1,7 1,9 1,13 1,36 1,46 1,52 5.9}
{0 CHEMBL1971029,2 1,3 1,8 1,9 1,13 1,47 1,52 7.9}
{0 CHEMBL1971141,2 1,3 1,7 1,9 1,13 1,18 1,46 1,52 5.4}
{0 CHEMBL1971149,10 1,11 1,12 1,13 1,43 1,46 1,52 5.4}
{0 CHEMBL1971186,10 1,11 1,12 1,13 1,46 1,48 1,52 5.4}
{0 CHEMBL1971245,2 1,9 1,12 1,13 1,14 1,52 5.4}
{0 CHEMBL1971430,13 1,36 1,52 5.4}
{0 CHEMBL1971649,2 1,3 1,4 1,5 1,7 1,9 1,13 1,19 1,46 1,52 5.4}
{0 CHEMBL1971694,2 1,7 1,9 1,13 1,46 1,52 5.4}
{0 CHEMBL1971801,2 1,8 1,9 1,13 1,46 1,52 6.4}
{0 CHEMBL1971943,4 1,8 1,9 1,13 1,31 1,52 5.4}
{0 CHEMBL1971947,1 1,2 1,3 1,4 1,5 1,7 1,8 1,9 1,13 1,46 1,52 6.9}
{0 CHEMBL1972125,2 1,4 1,9 1,13 1,18 1,52 5.4}
{0 CHEMBL1972142,13 1,18 1,52 5.4}
{0 CHEMBL1972152,13 1,52 5.9}
{0 CHEMBL1972158,4 1,13 1,16 1,52 6.6}
{0 CHEMBL1972183,13 1,14 1,52 5.4}
{0 CHEMBL1972221,2 1,7 1,8 1,9 1,13 1,16 1,46 1,52 5.7}
{0 CHEMBL1972250,6 1,13 1,14 1,16 1,36 1,52 5.4}
{0 CHEMBL1972258,13 1,37 1,52 5.4}
{0 CHEMBL1972276,8 1,9 1,13 1,14 1,42 1,46 1,52 5.4}
{0 CHEMBL1972365,4 1,8 1,12 1,49 1,52 4.6}
{0 CHEMBL1972489,2 1,7 1,9 1,13 1,16 1,46 1,52 5.4}
{0 CHEMBL1972568,13 1,37 1,52 5.4}
{0 CHEMBL1972576,1 1,2 1,3 1,4 1,7 1,8 1,9 1,13 1,33 1,46 1,52 7.8}
{0 CHEMBL1972584,1 1,2 1,4 1,7 1,8 1,9 1,13 1,14 1,18 1,46 1,52 6.7}
{0 CHEMBL1972659,10 1,13 1,52 5.4}
{0 CHEMBL1972820,13 1,27 1,52 5.4}
{0 CHEMBL1972840,9 1,13 1,52 5.7}
{0 CHEMBL1972849,10 1,11 1,12 1,13 1,48 1,52 5.4}
{0 CHEMBL1972937,13 1,52 5.4}
{0 CHEMBL1973098,13 1,52 5.7}
{0 CHEMBL1973142,9 1,13 1,46 1,52 5.5}
{0 CHEMBL1973145,1 1,2 1,3 1,4 1,7 1,8 1,9 1,13 1,33 1,38 1,46 1,52 5.4}
{0 CHEMBL1973211,1 1,2 1,3 1,4 1,5 1,7 1,8 1,9 1,13 1,14 1,46 1,52 7}
{0 CHEMBL1973348,2 1,4 1,9 1,13 1,18 1,52 5.4}
{0 CHEMBL1973395,13 1,52 6.6}
{0 CHEMBL1973483,3 1,5 1,8 1,9 1,13 1,46 1,52 5.4}
{0 CHEMBL1973540,1 1,8 1,9 1,13 1,46 1,52 7.9}
{0 CHEMBL1973711,13 1,14 1,52 5.4}
{0 CHEMBL1973808,2 1,7 1,9 1,13 1,16 1,40 1,46 1,52 5.4}
{0 CHEMBL1973860,8 1,13 1,28 1,46 1,52 5.4}
{0 CHEMBL1973893,2 1,7 1,8 1,9 1,13 1,16 1,46 1,52 5.6}
{0 CHEMBL1973937,2 1,3 1,4 1,7 1,9 1,13 1,16 1,22 1,46 1,52 5.9}
{0 CHEMBL1973961,13 1,14 1,16 1,46 1,52 6.6}
{0 CHEMBL1974157,13 1,14 1,52 6.2}
{0 CHEMBL1974254,1 1,2 1,3 1,4 1,5 1,7 1,8 1,9 1,13 1,46 1,52 6.9}
{0 CHEMBL1974288,9 1,13 1,28 1,52 5.4}
{0 CHEMBL1974310,13 1,52 5.8}
{0 CHEMBL1974328,2 1,8 1,9 1,13 1,46 1,52 6.9}
{0 CHEMBL1974416,9 1,13 1,46 1,52 5.4}
{0 CHEMBL1974457,13 1,52 6}
{0 CHEMBL1974664,8 1,9 1,13 1,36 1,50 1,52 5.4}
{0 CHEMBL1974702,13 1,21 1,45 1,52 5.4}
{0 CHEMBL1974803,9 1,13 1,46 1,52 5.7}
{0 CHEMBL1974870,13 1,16 1,52 5.9}
{0 CHEMBL1974935,9 1,13 1,37 1,52 5.4}
{0 CHEMBL1975128,4 1,13 1,16 1,52 7.4}
{0 CHEMBL1975138,2 1,3 1,7 1,9 1,13 1,46 1,52 5.7}
{0 CHEMBL1975208,13 1,27 1,33 1,52 5.4}
{0 CHEMBL1975233,3 1,6 1,8 1,9 1,13 1,14 1,46 1,52 5.4}
{0 CHEMBL1975256,4 1,8 1,13 1,52 5.4}
{0 CHEMBL1975490,2 1,9 1,13 1,52 5.4}
{0 CHEMBL1975500,2 1,9 1,13 1,25 1,46 1,52 5.7}
{0 CHEMBL1975534,1 1,4 1,8 1,13 1,52 5.4}
{0 CHEMBL1975647,3 1,5 1,8 1,9 1,13 1,21 1,46 1,52 5.4}
{0 CHEMBL1975787,13 1,52 5.9}
{0 CHEMBL1975900,7 1,9 1,13 1,46 1,52 5.4}
{0 CHEMBL1976090,1 1,4 1,8 1,33 1,52 6.4}
{0 CHEMBL1976093,10 1,11 1,12 1,13 1,14 1,29 1,43 1,46 1,52 5.4}
{0 CHEMBL1976134,2 1,16 1,52 6.3}
{0 CHEMBL1976220,1 1,2 1,3 1,4 1,5 1,7 1,8 1,9 1,13 1,46 1,52 6.3}
{0 CHEMBL1976240,9 1,13 1,28 1,52 5.4}
{0 CHEMBL1976328,2 1,3 1,4 1,7 1,8 1,9 1,13 1,36 1,46 1,52 5.4}
{0 CHEMBL1976420,5 1,9 1,13 1,52 7.3}
{0 CHEMBL1976455,3 1,5 1,8 1,9 1,13 1,46 1,52 5.4}
{0 CHEMBL1976732,10 1,11 1,12 1,13 1,48 1,52 5.4}
{0 CHEMBL1976872,8 1,13 1,46 1,52 4.4}
{0 CHEMBL1977041,2 1,3 1,4 1,7 1,8 1,9 1,13 1,45 1,46 1,52 6.9}
{0 CHEMBL1977135,13 1,28 1,52 5.4}
{0 CHEMBL1977148,1 1,2 1,3 1,4 1,5 1,7 1,8 1,9 1,13 1,35 1,46 1,52 5.4}
{0 CHEMBL1977223,13 1,16 1,46 1,51 1,52 5.4}
{0 CHEMBL1977346,2 1,8 1,9 1,13 1,46 1,47 1,52 6.8}
{0 CHEMBL1977374,11 1,13 1,52 5.4}
{0 CHEMBL1977619,13 1,52 4.4}
{0 CHEMBL1977681,13 1,16 1,47 1,51 1,52 5.8}
{0 CHEMBL1977814,4 1,13 1,49 1,52 5.4}
{0 CHEMBL1978014,4 1,8 1,13 1,14 1,52 5.4}
{0 CHEMBL1978099,2 1,3 1,8 1,9 1,13 1,47 1,52 7.2}
{0 CHEMBL1978200,10 1,11 1,12 1,13 1,46 1,52 5.4}
{0 CHEMBL1978448,2 1,9 1,13 1,14 1,46 1,52 6.6}
{0 CHEMBL1979057,2 1,9 1,13 1,42 1,52 7.4}
{0 CHEMBL1979093,2 1,3 1,4 1,7 1,8 1,9 1,13 1,46 1,52 5.4}
{0 CHEMBL1979176,3 1,5 1,7 1,8 1,9 1,13 1,46 1,52 5.4}
{0 CHEMBL1979252,7 1,9 1,13 1,36 1,46 1,52 5.4}
{0 CHEMBL1979318,13 1,14 1,16 1,28 1,52 5.4}
{0 CHEMBL1979357,1 1,13 1,36 1,37 1,52 5.4}
{0 CHEMBL1979516,1 1,2 1,3 1,4 1,5 1,7 1,8 1,9 1,13 1,46 1,52 5.5}
{0 CHEMBL1979577,1 1,2 1,3 1,4 1,5 1,7 1,8 1,9 1,13 1,46 1,52 7}
{0 CHEMBL1979718,13 1,16 1,46 1,52 5.4}
{0 CHEMBL1979855,2 1,3 1,8 1,9 1,13 1,14 1,46 1,52 5.4}
{0 CHEMBL1979883,1 1,2 1,3 1,4 1,5 1,7 1,8 1,9 1,13 1,14 1,46 1,52 7.3}
{0 CHEMBL1979970,13 1,16 1,46 1,51 1,52 5.4}
{0 CHEMBL1980142,3 1,5 1,8 1,9 1,13 1,46 1,52 5.4}
{0 CHEMBL1980144,1 1,2 1,3 1,4 1,7 1,8 1,9 1,13 1,33 1,46 1,52 8}
{0 CHEMBL1980161,4 1,16 1,21 1,52 4.4}
{0 CHEMBL1980163,2 1,8 1,9 1,13 1,52 5.4}
{0 CHEMBL1980297,1 1,2 1,3 1,4 1,5 1,7 1,8 1,9 1,13 1,35 1,46 1,52 8}
{0 CHEMBL1980391,9 1,13 1,16 1,20 1,52 7.9}
{0 CHEMBL1980489,7 1,9 1,13 1,46 1,52 5.4}
{0 CHEMBL1980540,3 1,5 1,8 1,9 1,13 1,21 1,46 1,52 5.4}
{0 CHEMBL1980704,12 1,13 1,52 5.4}
{0 CHEMBL1980715,2 1,7 1,9 1,13 1,46 1,52 5.4}
{0 CHEMBL1980802,3 1,6 1,8 1,9 1,13 1,14 1,46 1,52 5.4}
{0 CHEMBL1980896,1 1,2 1,4 1,7 1,8 1,9 1,13 1,33 1,38 1,46 1,52 5.9}
{0 CHEMBL1980995,13 1,47 1,52 8.1}
{0 CHEMBL1981045,2 1,9 1,13 1,46 1,52 5.4}
{0 CHEMBL1981047,8 1,13 1,14 1,15 1,16 1,40 1,46 1,52 8.2}
{0 CHEMBL1981079,4 1,13 1,52 6.1}
{0 CHEMBL1981410,2 1,3 1,6 1,7 1,8 1,9 1,13 1,46 1,47 1,52 5.9}
{0 CHEMBL1981720,3 1,5 1,8 1,9 1,13 1,46 1,52 5.5}
{0 CHEMBL1981725,2 1,9 1,11 1,12 1,13 1,14 1,18 1,46 1,52 7.2}
{0 CHEMBL1981782,2 1,3 1,7 1,9 1,13 1,16 1,40 1,46 1,52 5.4}
{0 CHEMBL1982122,13 1,28 1,46 1,52 5.4}
{0 CHEMBL1982135,1 1,2 1,3 1,4 1,7 1,8 1,9 1,13 1,33 1,38 1,46 1,52 5.9}
{0 CHEMBL1982167,9 1,13 1,46 1,52 5.4}
{0 CHEMBL1982361,7 1,9 1,13 1,46 1,52 5.5}
{0 CHEMBL1982383,10 1,11 1,12 1,13 1,43 1,46 1,52 5.4}
{0 CHEMBL1982465,1 1,2 1,3 1,4 1,5 1,7 1,8 1,9 1,13 1,14 1,46 1,52 7.2}
{0 CHEMBL1982466,1 1,2 1,3 1,4 1,5 1,7 1,8 1,9 1,13 1,46 1,52 7.6}
{0 CHEMBL1982476,1 1,2 1,3 1,4 1,5 1,7 1,8 1,9 1,13 1,46 1,47 1,52 7.4}
{0 CHEMBL1982506,13 1,52 6.1}
{0 CHEMBL1982563,10 1,11 1,12 1,13 1,43 1,46 1,52 5.4}
{0 CHEMBL1982610,13 1,49 1,52 5.4}
{0 CHEMBL1982660,3 1,5 1,8 1,9 1,13 1,46 1,52 6}
{0 CHEMBL1982711,13 1,45 1,46 1,52 7}
{0 CHEMBL1982866,13 1,29 1,52 5.4}
{0 CHEMBL1982874,4 1,10 1,11 1,12 1,13 1,48 1,50 1,52 5.4}
{0 CHEMBL1982924,9 1,13 1,46 1,52 5.4}
{0 CHEMBL1982957,13 1,18 1,52 6.6}
{0 CHEMBL1982992,2 1,8 1,9 1,33 1,52 5.4}
{0 CHEMBL1983006,3 1,6 1,8 1,9 1,13 1,14 1,27 1,46 1,52 5.4}
{0 CHEMBL1983025,1 1,2 1,3 1,4 1,5 1,7 1,8 1,9 1,13 1,46 1,52 6.6}
{0 CHEMBL1983111,2 1,5 1,8 1,9 1,13 1,46 1,52 8.2}
{0 CHEMBL1983195,2 1,7 1,9 1,13 1,46 1,52 5.7}
{0 CHEMBL1983268,9 1,13 1,14 1,16 1,46 1,52 7.4}
{0 CHEMBL1983449,13 1,24 1,36 1,52 5.4}
{0 CHEMBL1983534,13 1,28 1,32 1,46 1,52 5.4}
{0 CHEMBL1983923,8 1,13 1,14 1,16 1,28 1,52 7.6}
{0 CHEMBL1983932,3 1,5 1,8 1,9 1,13 1,46 1,52 5.4}
{0 CHEMBL1983945,9 1,13 1,37 1,46 1,52 5.4}
{0 CHEMBL1983963,1 1,2 1,3 1,4 1,7 1,8 1,9 1,13 1,33 1,38 1,46 1,52 6.9}
{0 CHEMBL1984038,2 1,9 1,13 1,32 1,46 1,52 5.4}
{0 CHEMBL1984162,1 1,2 1,4 1,8 1,9 1,13 1,36 1,52 8.699}
{0 CHEMBL1984191,16 1,52 5.4}
{0 CHEMBL1984206,4 1,6 1,9 1,13 1,14 1,52 5.4}
{0 CHEMBL1984363,2 1,4 1,7 1,8 1,9 1,13 1,16 1,46 1,52 6.3}
{0 CHEMBL1984367,13 1,16 1,51 1,52 5.4}
{0 CHEMBL1984432,9 1,13 1,16 1,36 1,40 1,52 5.4}
{0 CHEMBL1984541,13 1,24 1,52 5.4}
{0 CHEMBL1984586,1 1,2 1,3 1,4 1,7 1,8 1,9 1,13 1,33 1,38 1,46 1,52 6.3}
{0 CHEMBL1984633,13 1,28 1,52 5.4}
{0 CHEMBL1984700,10 1,11 1,12 1,13 1,46 1,52 5.4}
{0 CHEMBL1984711,8 1,9 1,13 1,32 1,52 6.4}
{0 CHEMBL1984788,9 1,13 1,42 1,52 5.4}
{0 CHEMBL1985074,13 1,52 5.4}
{0 CHEMBL1985092,2 1,8 1,9 1,16 1,52 5.5}
{0 CHEMBL1985095,4 1,9 1,13 1,16 1,40 1,52 6.7}
{0 CHEMBL1985311,2 1,3 1,4 1,7 1,9 1,13 1,16 1,46 1,52 6.3}
{0 CHEMBL1985406,13 1,16 1,46 1,51 1,52 5.4}
{0 CHEMBL1985566,2 1,9 1,13 1,14 1,46 1,52 5.4}
{0 CHEMBL1985580,9 1,13 1,37 1,46 1,52 5.4}
{0 CHEMBL1986139,2 1,8 1,9 1,33 1,52 5.4}
{0 CHEMBL1986186,13 1,24 1,52 5.7}
{0 CHEMBL1986263,2 1,9 1,13 1,52 6.8}
{0 CHEMBL1986328,2 1,7 1,9 1,13 1,46 1,52 5.7}
{0 CHEMBL1986499,4 1,13 1,16 1,52 6.5}
{0 CHEMBL1986530,13 1,36 1,50 1,52 5.4}
{0 CHEMBL1986588,13 1,52 4.4}
{0 CHEMBL1986597,2 1,7 1,9 1,13 1,14 1,30 1,36 1,42 1,46 1,52 5.4}
{0 CHEMBL1986603,7 1,8 1,13 1,46 1,52 5.4}
{0 CHEMBL1986781,10 1,11 1,12 1,13 1,46 1,48 1,52 5.4}
{0 CHEMBL1986869,4 1,9 1,13 1,28 1,33 1,46 1,52 5.4}
{0 CHEMBL1986943,13 1,46 1,52 5.4}
{0 CHEMBL1986970,9 1,13 1,16 1,40 1,52 6}
{0 CHEMBL1987007,13 1,14 1,16 1,51 1,52 5.4}
{0 CHEMBL1987009,13 1,16 1,51 1,52 6.8}
{0 CHEMBL1987034,2 1,3 1,8 1,9 1,13 1,14 1,52 7.7}
{0 CHEMBL1987054,1 1,2 1,4 1,8 1,9 1,13 1,21 1,52 7.3}
{0 CHEMBL1987143,4 1,12 1,52 4.4}
{0 CHEMBL1987359,2 1,9 1,13 1,25 1,41 1,46 1,52 5.4}
{0 CHEMBL1987533,2 1,7 1,9 1,13 1,16 1,46 1,52 5.4}
{0 CHEMBL1987679,2 1,9 1,13 1,46 1,52 5.4}
{0 CHEMBL1987756,13 1,25 1,47 1,52 5.4}
{0 CHEMBL1987793,13 1,52 5.4}
{0 CHEMBL1987910,1 1,2 1,3 1,4 1,5 1,7 1,8 1,9 1,13 1,46 1,52 5.7}
{0 CHEMBL1988075,1 1,2 1,3 1,4 1,5 1,7 1,8 1,9 1,13 1,46 1,52 6.8}
{0 CHEMBL1988153,13 1,52 5.4}
{0 CHEMBL1988173,2 1,3 1,9 1,13 1,46 1,52 7.1}
{0 CHEMBL1988300,1 1,2 1,4 1,5 1,8 1,9 1,13 1,42 1,52 5.7}
{0 CHEMBL1988370,1 1,4 1,8 1,13 1,14 1,38 1,52 6}
{0 CHEMBL1988387,1 1,2 1,3 1,4 1,5 1,7 1,8 1,9 1,13 1,46 1,52 7.5}
{0 CHEMBL1988437,13 1,16 1,38 1,47 1,52 7.7}
{0 CHEMBL1988537,13 1,52 6.8}
{0 CHEMBL1988594,1 1,2 1,3 1,4 1,7 1,8 1,9 1,13 1,33 1,46 1,52 8}
{0 CHEMBL1988608,2 1,7 1,9 1,13 1,16 1,24 1,40 1,46 1,52 6.1}
{0 CHEMBL1988717,2 1,3 1,4 1,7 1,8 1,9 1,13 1,46 1,52 5.5}
{0 CHEMBL1988838,2 1,8 1,9 1,13 1,52 6.9}
{0 CHEMBL1988995,10 1,11 1,12 1,13 1,48 1,52 5.4}
{0 CHEMBL1989029,1 1,13 1,16 1,28 1,44 1,52 5.8}
{0 CHEMBL1989265,13 1,52 5.4}
{0 CHEMBL1989423,13 1,16 1,25 1,52 4.8}
{0 CHEMBL1989474,13 1,29 1,52 5.4}
{0 CHEMBL1989518,13 1,37 1,52 5.4}
{0 CHEMBL1989646,4 1,8 1,9 1,13 1,16 1,52 6.3}
{0 CHEMBL1989708,1 1,2 1,3 1,4 1,5 1,7 1,8 1,9 1,13 1,46 1,52 5.5}
{0 CHEMBL1989805,13 1,14 1,38 1,52 5.4}
{0 CHEMBL1989834,1 1,16 1,44 1,52 4.9}
{0 CHEMBL1989856,6 1,12 1,13 1,14 1,52 6.1}
{0 CHEMBL1990254,9 1,13 1,28 1,52 5.4}
{0 CHEMBL1990288,10 1,11 1,12 1,13 1,46 1,48 1,52 5.4}
{0 CHEMBL1990346,4 1,16 1,52 5.7}
{0 CHEMBL1990415,13 1,16 1,46 1,51 1,52 5.4}
{0 CHEMBL1990482,9 1,13 1,28 1,42 1,52 5.6}
{0 CHEMBL1990496,13 1,52 5.4}
{0 CHEMBL1990583,2 1,3 1,4 1,7 1,8 1,9 1,13 1,46 1,52 8.523}
{0 CHEMBL1990821,9 1,13 1,36 1,52 5.4}
{0 CHEMBL1990884,2 1,4 1,9 1,13 1,36 1,52 5.4}
{0 CHEMBL1990885,2 1,9 1,13 1,14 1,46 1,52 6.5}
{0 CHEMBL1990904,7 1,10 1,11 1,12 1,13 1,29 1,46 1,52 5.4}
{0 CHEMBL1990912,8 1,13 1,46 1,52 5.4}
{0 CHEMBL1991063,13 1,16 1,52 5.9}
{0 CHEMBL1991078,13 1,16 1,46 1,52 7.1}
{0 CHEMBL1991138,4 1,7 1,8 1,10 1,12 1,13 1,14 1,52 5.4}
{0 CHEMBL1991143,13 1,52 5.8}
{0 CHEMBL1991180,4 1,8 1,13 1,49 1,52 6}
{0 CHEMBL1991188,13 1,28 1,52 5.4}
{0 CHEMBL1991285,3 1,6 1,8 1,9 1,13 1,14 1,46 1,52 5.8}
{0 CHEMBL1991356,2 1,9 1,13 1,46 1,52 5.4}
{0 CHEMBL1991395,10 1,11 1,12 1,13 1,29 1,43 1,46 1,52 5.4}
{0 CHEMBL1991434,4 1,13 1,19 1,52 5.4}
{0 CHEMBL1991577,13 1,24 1,52 5.4}
{0 CHEMBL1991640,9 1,13 1,20 1,46 1,52 5.4}
{0 CHEMBL1991674,8 1,13 1,26 1,46 1,51 1,52 5.6}
{0 CHEMBL1991678,10 1,11 1,12 1,13 1,43 1,46 1,52 5.4}
{0 CHEMBL1991725,9 1,13 1,14 1,52 5.4}
{0 CHEMBL1991728,3 1,7 1,9 1,13 1,19 1,36 1,46 1,52 5.4}
{0 CHEMBL1991846,13 1,37 1,52 5.4}
{0 CHEMBL1992242,2 1,3 1,7 1,9 1,13 1,36 1,46 1,52 5.4}
{0 CHEMBL1992306,2 1,3 1,7 1,9 1,13 1,46 1,47 1,52 6.3}
{0 CHEMBL1992323,13 1,52 5.4}
{0 CHEMBL1992342,2 1,4 1,7 1,8 1,9 1,13 1,16 1,46 1,52 5.8}
{0 CHEMBL1992536,9 1,13 1,16 1,24 1,40 1,52 5.4}
{0 CHEMBL1992555,9 1,13 1,42 1,52 5.4}
{0 CHEMBL1992634,52 5.8}
{0 CHEMBL1992645,2 1,9 1,13 1,46 1,52 5.4}
{0 CHEMBL1992732,4 1,8 1,13 1,50 1,51 1,52 5.4}
{0 CHEMBL1992740,6 1,13 1,14 1,16 1,46 1,51 1,52 5.4}
{0 CHEMBL1992796,2 1,9 1,13 1,46 1,52 5.4}
{0 CHEMBL1992922,8 1,13 1,46 1,52 5.4}
{0 CHEMBL1992937,8 1,9 1,13 1,42 1,52 5.4}
{0 CHEMBL1993166,3 1,7 1,9 1,13 1,14 1,19 1,36 1,46 1,52 5.4}
{0 CHEMBL1993243,1 1,4 1,5 1,8 1,13 1,47 1,52 6.1}
{0 CHEMBL1993548,13 1,52 5.4}
{0 CHEMBL1993584,9 1,13 1,37 1,52 5.4}
{0 CHEMBL1993661,2 1,3 1,8 1,9 1,13 1,32 1,47 1,52 8.5}
{0 CHEMBL1993722,2 1,3 1,4 1,7 1,9 1,13 1,16 1,27 1,46 1,52 6.5}
{0 CHEMBL1993781,13 1,37 1,52 5.4}
{0 CHEMBL1993941,1 1,2 1,3 1,4 1,5 1,7 1,8 1,9 1,13 1,46 1,52 7.2}
{0 CHEMBL1994040,10 1,11 1,12 1,13 1,46 1,52 5.4}
{0 CHEMBL1994074,9 1,16 1,52 5.4}
{0 CHEMBL1994241,9 1,13 1,14 1,42 1,52 6.3}
{0 CHEMBL1994321,1 1,2 1,3 1,4 1,5 1,7 1,8 1,9 1,13 1,45 1,46 1,52 8.1}
{0 CHEMBL1994526,7 1,9 1,13 1,45 1,46 1,52 5.4}
{0 CHEMBL1994538,3 1,5 1,8 1,9 1,13 1,46 1,52 5.4}
{0 CHEMBL1994693,1 1,2 1,3 1,4 1,7 1,8 1,9 1,13 1,33 1,38 1,46 1,52 6.2}
{0 CHEMBL1994830,4 1,52 5.4}
{0 CHEMBL1994864,13 1,24 1,52 5.4}
{0 CHEMBL1994938,1 1,4 1,5 1,8 1,13 1,47 1,52 6.9}
{0 CHEMBL1995592,4 1,8 1,13 1,52 5.9}
{0 CHEMBL1995736,6 1,9 1,13 1,42 1,52 5.4}
{0 CHEMBL1995740,2 1,9 1,13 1,46 1,52 5.4}
{0 CHEMBL1995813,13 1,46 1,52 5.5}
{0 CHEMBL1995832,10 1,11 1,12 1,13 1,43 1,46 1,52 5.4}
{0 CHEMBL1996048,2 1,9 1,13 1,30 1,46 1,52 6.1}
{0 CHEMBL1996066,4 1,6 1,13 1,14 1,49 1,52 5.4}
{0 CHEMBL1996111,9 1,13 1,16 1,40 1,52 6}
{0 CHEMBL1996155,13 1,14 1,52 5.4}
{0 CHEMBL1996208,8 1,13 1,18 1,28 1,52 5.4}
{0 CHEMBL1996234,4 1,7 1,8 1,10 1,12 1,13 1,52 5.4}
{0 CHEMBL1996390,13 1,52 6.4}
{0 CHEMBL1996500,10 1,11 1,12 1,13 1,46 1,52 5.4}
{0 CHEMBL1996543,9 1,13 1,52 5.4}
{0 CHEMBL1996587,11 1,13 1,52 5.4}
{0 CHEMBL1996780,13 1,28 1,45 1,52 5.4}
{0 CHEMBL1996791,1 1,4 1,8 1,13 1,52 6.2}
{0 CHEMBL1996817,13 1,52 6.6}
{0 CHEMBL1996831,13 1,27 1,50 1,52 5.6}
{0 CHEMBL1996837,4 1,9 1,13 1,52 4.4}
{0 CHEMBL1996923,23 1,52 5.4}
{0 CHEMBL1996931,13 1,28 1,46 1,52 5.4}
{0 CHEMBL1996979,9 1,13 1,46 1,52 5.4}
{0 CHEMBL1997023,9 1,13 1,46 1,52 6.7}
{0 CHEMBL1997025,9 1,13 1,42 1,52 5.4}
{0 CHEMBL1997129,13 1,28 1,38 1,52 7.5}
{0 CHEMBL1997340,9 1,13 1,16 1,40 1,52 5.4}
{0 CHEMBL1997349,13 1,14 1,50 1,52 5.4}
{0 CHEMBL1997503,2 1,7 1,9 1,13 1,46 1,52 5.4}
{0 CHEMBL1997534,9 1,13 1,16 1,52 5.4}
{0 CHEMBL1997597,2 1,4 1,7 1,8 1,9 1,13 1,16 1,46 1,52 5.7}
{0 CHEMBL1997617,1 1,4 1,6 1,8 1,13 1,14 1,38 1,52 5.5}
{0 CHEMBL1997623,2 1,3 1,4 1,7 1,9 1,13 1,16 1,46 1,52 6.8}
{0 CHEMBL1997759,2 1,7 1,9 1,13 1,46 1,52 5.4}
{0 CHEMBL1997764,9 1,13 1,46 1,52 5.4}
{0 CHEMBL1997822,1 1,4 1,5 1,8 1,9 1,13 1,18 1,52 5.4}
{0 CHEMBL1997846,8 1,13 1,26 1,46 1,51 1,52 5.4}
{0 CHEMBL1997872,13 1,18 1,52 5.7}
{0 CHEMBL1998112,2 1,9 1,10 1,12 1,13 1,52 5.4}
{0 CHEMBL1998121,2 1,7 1,9 1,13 1,16 1,40 1,46 1,52 6.1}
{0 CHEMBL1998159,13 1,16 1,32 1,36 1,52 5.6}
{0 CHEMBL1998193,2 1,3 1,9 1,13 1,46 1,52 5.4}
{0 CHEMBL1998414,13 1,16 1,51 1,52 5.9}
{0 CHEMBL1998545,13 1,28 1,46 1,52 5.4}
{0 CHEMBL1998585,1 1,2 1,3 1,4 1,7 1,8 1,9 1,13 1,33 1,38 1,46 1,52 7.2}
{0 CHEMBL1998611,4 1,9 1,13 1,21 1,45 1,52 6}
{0 CHEMBL1998829,9 1,13 1,46 1,52 5.4}
{0 CHEMBL1999112,13 1,14 1,38 1,52 5.4}
{0 CHEMBL1999321,7 1,9 1,13 1,46 1,52 5.4}
{0 CHEMBL1999428,13 1,28 1,52 5.4}
{0 CHEMBL1999496,7 1,9 1,13 1,36 1,46 1,52 5.4}
{0 CHEMBL1999556,13 1,52 6.4}
{0 CHEMBL1999590,8 1,13 1,52 5.4}
{0 CHEMBL1999714,2 1,9 1,13 1,46 1,52 5.4}
{0 CHEMBL1999718,3 1,5 1,6 1,8 1,9 1,13 1,14 1,46 1,52 5.4}
{0 CHEMBL1999749,2 1,4 1,8 1,9 1,13 1,14 1,52 5.4}
{0 CHEMBL1999774,13 1,22 1,27 1,33 1,52 5.4}
{0 CHEMBL1999811,2 1,3 1,9 1,13 1,46 1,50 1,52 6.3}
{0 CHEMBL1999918,13 1,52 6}
{0 CHEMBL1999931,13 1,16 1,46 1,52 7.4}
{0 CHEMBL2000071,8 1,13 1,46 1,52 5.9}
{0 CHEMBL2000104,13 1,52 5.9}
{0 CHEMBL2000114,8 1,13 1,46 1,52 5.7}
{0 CHEMBL2000271,13 1,16 1,52 5.9}
{0 CHEMBL2000335,1 1,2 1,3 1,4 1,7 1,8 1,9 1,13 1,33 1,38 1,46 1,52 7.9}
{0 CHEMBL2000345,9 1,13 1,14 1,42 1,52 6.8}
{0 CHEMBL2000354,13 1,52 5.4}
{0 CHEMBL2000393,9 1,13 1,23 1,46 1,52 7.1}
{0 CHEMBL2000408,11 1,12 1,13 1,43 1,46 1,52 5.4}
{0 CHEMBL2000429,10 1,11 1,12 1,13 1,43 1,46 1,52 5.4}
{0 CHEMBL2000481,2 1,7 1,9 1,13 1,25 1,36 1,46 1,52 5.4}
{0 CHEMBL2000508,10 1,11 1,12 1,28 1,48 1,52 5.4}
{0 CHEMBL2000568,13 1,18 1,52 5.5}
{0 CHEMBL2000685,7 1,9 1,13 1,19 1,36 1,46 1,52 6.1}
{0 CHEMBL2000801,2 1,3 1,7 1,9 1,13 1,46 1,52 5.4}
{0 CHEMBL2000832,2 1,9 1,13 1,46 1,52 5.8}
{0 CHEMBL2000894,13 1,28 1,45 1,52 5.4}
{0 CHEMBL2001224,3 1,6 1,8 1,9 1,13 1,14 1,46 1,52 5.4}
{0 CHEMBL2001239,4 1,9 1,13 1,52 5.4}
{0 CHEMBL2001257,1 1,2 1,3 1,4 1,5 1,7 1,8 1,9 1,13 1,14 1,46 1,52 6.6}
{0 CHEMBL2001288,1 1,4 1,8 1,13 1,40 1,52 5.4}
{0 CHEMBL2001485,1 1,2 1,3 1,4 1,5 1,7 1,8 1,9 1,13 1,46 1,52 7.1}
{0 CHEMBL2001539,13 1,16 1,28 1,52 4.8}
{0 CHEMBL2001547,10 1,11 1,12 1,13 1,46 1,52 5.4}
{0 CHEMBL2001751,2 1,9 1,13 1,18 1,38 1,46 1,52 6.7}
{0 CHEMBL2001920,2 1,9 1,13 1,46 1,52 5.9}
{0 CHEMBL2001923,2 1,9 1,13 1,46 1,52 5.4}
{0 CHEMBL2001957,10 1,11 1,12 1,13 1,43 1,46 1,52 5.4}
{0 CHEMBL2001998,6 1,13 1,14 1,16 1,18 1,47 1,52 5.4}
{0 CHEMBL2002165,1 1,2 1,3 1,4 1,5 1,7 1,8 1,9 1,13 1,46 1,52 7.4}
{0 CHEMBL2002322,13 1,18 1,36 1,52 5.4}
{0 CHEMBL2002323,4 1,12 1,13 1,18 1,52 5.4}
{0 CHEMBL2002346,8 1,13 1,46 1,52 6.3}
{0 CHEMBL2002373,11 1,13 1,28 1,52 5.4}
{0 CHEMBL2002407,4 1,6 1,8 1,13 1,14 1,16 1,52 5.4}
{0 CHEMBL2002446,6 1,13 1,14 1,16 1,36 1,52 5.4}
{0 CHEMBL2002479,2 1,9 1,13 1,23 1,52 5.7}
{0 CHEMBL2002649,2 1,9 1,13 1,46 1,52 6}
{0 CHEMBL2002702,2 1,9 1,13 1,46 1,52 6.4}
{0 CHEMBL2002726,13 1,16 1,52 5.4}
{0 CHEMBL2002992,9 1,13 1,45 1,46 1,52 5.8}
{0 CHEMBL2003271,9 1,13 1,46 1,52 5.4}
{0 CHEMBL2003286,13 1,52 5.4}
{0 CHEMBL2003341,9 1,13 1,28 1,52 5.4}
{0 CHEMBL2003420,13 1,52 5.4}
{0 CHEMBL2003456,3 1,8 1,9 1,13 1,46 1,52 5.7}
{0 CHEMBL2003482,13 1,16 1,46 1,51 1,52 5.4}
{0 CHEMBL2003524,13 1,52 6.4}
{0 CHEMBL2003638,13 1,16 1,46 1,52 7}
{0 CHEMBL2003657,4 1,10 1,11 1,12 1,13 1,48 1,50 1,52 5.4}
{0 CHEMBL2003817,3 1,5 1,8 1,9 1,13 1,46 1,52 5.7}
{0 CHEMBL2004290,1 1,2 1,3 1,4 1,5 1,7 1,8 1,9 1,13 1,46 1,52 7.2}
{0 CHEMBL2004311,2 1,3 1,7 1,9 1,13 1,36 1,46 1,52 6.2}
{0 CHEMBL2004355,4 1,6 1,9 1,13 1,14 1,52 5.4}
{0 CHEMBL2004365,13 1,38 1,52 5.4}
{0 CHEMBL2004419,4 1,10 1,11 1,12 1,13 1,21 1,48 1,50 1,52 5.4}
{0 CHEMBL2004438,2 1,3 1,4 1,5 1,7 1,9 1,13 1,19 1,46 1,52 5.4}
{0 CHEMBL2004447,13 1,14 1,16 1,28 1,52 5.4}
{0 CHEMBL2004544,2 1,9 1,13 1,46 1,52 5.6}
{0 CHEMBL2004615,4 1,8 1,13 1,26 1,52 6}
{0 CHEMBL2004692,4 1,8 1,13 1,52 5.4}
{0 CHEMBL2004716,1 1,2 1,3 1,4 1,5 1,7 1,8 1,9 1,13 1,14 1,46 1,47 1,52 7.4}
{0 CHEMBL2004771,2 1,9 1,13 1,52 6.3}
{0 CHEMBL2004871,11 1,13 1,28 1,52 5.4}
{0 CHEMBL2004872,13 1,52 5.4}
{0 CHEMBL2004892,2 1,4 1,7 1,8 1,9 1,13 1,16 1,46 1,52 6}
{0 CHEMBL2004934,13 1,28 1,52 5.4}
{0 CHEMBL2005112,13 1,14 1,50 1,52 5.5}
{0 CHEMBL2005186,2 1,8 1,9 1,13 1,16 1,40 1,49 1,52 5.4}
{0 CHEMBL2005375,2 1,9 1,13 1,29 1,52 5.4}
{0 CHEMBL2005475,7 1,13 1,16 1,51 1,52 6.7}
{0 CHEMBL2005528,9 1,13 1,52 5.5}
{0 CHEMBL2005631,1 1,2 1,3 1,4 1,5 1,7 1,8 1,9 1,13 1,46 1,47 1,52 7.1}
{0 CHEMBL2005828,1 1,2 1,3 1,4 1,7 1,8 1,9 1,13 1,33 1,38 1,46 1,52 6.4}
{0 CHEMBL2005886,5 1,9 1,13 1,14 1,39 1,42 1,52 7.9}
{0 CHEMBL2005899,13 1,52 5.7}
{0 CHEMBL2005936,13 1,16 1,46 1,51 1,52 5.4}
{0 CHEMBL2006010,3 1,5 1,8 1,9 1,13 1,46 1,52 5.4}
{0 CHEMBL2006156,2 1,7 1,9 1,13 1,46 1,52 5.9}
{0 CHEMBL2006188,9 1,13 1,28 1,46 1,52 5.4}
{0 CHEMBL2006237,6 1,8 1,9 1,13 1,14 1,42 1,46 1,52 5.4}
{0 CHEMBL2006263,2 1,4 1,7 1,9 1,13 1,46 1,52 6}
{0 CHEMBL2006276,2 1,9 1,13 1,46 1,52 5.4}
{0 CHEMBL2006439,13 1,46 1,52 5.4}
{0 CHEMBL2006493,13 1,52 5.4}
{0 CHEMBL2006567,4 1,6 1,8 1,9 1,13 1,14 1,28 1,46 1,52 5.4}
{0 CHEMBL2006580,2 1,8 1,9 1,33 1,52 5.4}
{0 CHEMBL2006581,4 1,9 1,13 1,52 5.4}
{0 CHEMBL2006778,1 1,4 1,5 1,8 1,9 1,13 1,47 1,52 6}
{0 CHEMBL2006785,6 1,9 1,13 1,14 1,46 1,52 5.4}
{0 CHEMBL2006836,13 1,14 1,27 1,50 1,52 5.6}
{0 CHEMBL2006933,4 1,5 1,10 1,13 1,52 5.4}
{0 CHEMBL2007002,2 1,7 1,9 1,13 1,16 1,46 1,52 5.4}
{0 CHEMBL2007044,6 1,13 1,14 1,16 1,18 1,52 5.4}
{0 CHEMBL2007064,2 1,9 1,13 1,46 1,52 7.2}
{0 CHEMBL2007151,1 1,4 1,8 1,13 1,14 1,38 1,52 5.4}
{0 CHEMBL2007296,13 1,28 1,52 5.4}
{0 CHEMBL2007372,6 1,8 1,10 1,11 1,12 1,13 1,43 1,46 1,47 1,52 5.4}
{0 CHEMBL2007592,8 1,13 1,46 1,52 5.4}
{0 CHEMBL201511,9 1,13 1,32 1,52 6.004}
{0 CHEMBL207400,13 1,52 5.4}
{0 CHEMBL207995,3 1,6 1,8 1,9 1,13 1,14 1,46 1,52 5.4}
{0 CHEMBL208637,4 1,6 1,8 1,9 1,13 1,14 1,46 1,52 5.4}
{0 CHEMBL209534,4 1,6 1,9 1,13 1,14 1,52 5.4}
{0 CHEMBL210618,4 1,6 1,8 1,9 1,13 1,14 1,46 1,52 5.4}
{0 CHEMBL210887,13 1,46 1,50 1,52 5.4}
{0 CHEMBL210928,4 1,8 1,9 1,13 1,46 1,52 5.4}
{0 CHEMBL210963,4 1,6 1,8 1,9 1,13 1,14 1,46 1,52 5.4}
{0 CHEMBL211378,1 1,2 1,3 1,4 1,7 1,8 1,9 1,13 1,46 1,52 5.4}
{0 CHEMBL213505,1 1,2 1,3 1,4 1,7 1,8 1,9 1,13 1,46 1,52 5.4}
{0 CHEMBL215152,2 1,7 1,8 1,9 1,13 1,14 1,16 1,46 1,52 5.328}
{0 CHEMBL219722,2 1,3 1,4 1,7 1,9 1,13 1,16 1,46 1,52 6.5}
{0 CHEMBL220057,2 1,3 1,4 1,7 1,8 1,9 1,13 1,16 1,46 1,52 6.3}
{0 CHEMBL220241,2 1,3 1,4 1,7 1,8 1,9 1,13 1,14 1,46 1,49 1,50 1,52 6.5}
{0 CHEMBL2205426,2 1,9 1,13 1,28 1,52 8.155}
{0 CHEMBL2205766,4 1,13 1,18 1,28 1,52 5}
{0 CHEMBL221959,13 1,14 1,22 1,52 5}
{0 CHEMBL223257,3 1,6 1,8 1,9 1,13 1,14 1,46 1,52 5.4}
{0 CHEMBL223360,2 1,3 1,4 1,7 1,8 1,9 1,13 1,16 1,46 1,52 5.319}
{0 CHEMBL223367,3 1,6 1,8 1,9 1,13 1,14 1,46 1,52 5.2}
{0 CHEMBL223460,3 1,6 1,8 1,9 1,13 1,14 1,46 1,52 5.2}
{0 CHEMBL225519,13 1,28 1,52 6.1}
{0 CHEMBL226403,5 1,13 1,28 1,52 7.2}
{0 CHEMBL226471,13 1,28 1,52 6.1}
{0 CHEMBL230011,4 1,8 1,11 1,52 5}
{0 CHEMBL2309006,13 1,19 1,52 8.824}
{0 CHEMBL2309609,13 1,20 1,52 7.18}
{0 CHEMBL231209,1 1,2 1,3 1,4 1,5 1,7 1,8 1,9 1,13 1,46 1,52 5.4}
{0 CHEMBL2333163,13 1,18 1,52 6.155}
{0 CHEMBL234085,13 1,14 1,22 1,52 5.4}
{0 CHEMBL243088,2 1,8 1,9 1,13 1,27 1,52 7.7}
{0 CHEMBL244378,2 1,8 1,9 1,13 1,16 1,27 1,52 8.1}
{0 CHEMBL246970,7 1,8 1,13 1,32 1,46 1,52 5.4}
{0 CHEMBL24828,2 1,8 1,9 1,13 1,14 1,52 5.824}
{0 CHEMBL248757,3 1,6 1,8 1,9 1,13 1,14 1,15 1,46 1,52 7.2}
{0 CHEMBL249282,6 1,13 1,14 1,16 1,52 5.4}
{0 CHEMBL249697,8 1,12 1,13 1,46 1,52 5}
{0 CHEMBL253969,8 1,13 1,14 1,46 1,52 6.6}
{0 CHEMBL255863,7 1,9 1,13 1,46 1,52 5}
{0 CHEMBL256835,6 1,11 1,13 1,52 5.4}
{0 CHEMBL259084,2 1,9 1,13 1,27 1,52 6.387}
{0 CHEMBL259850,13 1,46 1,52 5.4}
{0 CHEMBL259922,8 1,9 1,13 1,46 1,52 5.4}
{0 CHEMBL260092,2 1,3 1,4 1,7 1,8 1,9 1,13 1,46 1,52 7.4}
{0 CHEMBL260135,4 1,16 1,51 1,52 5.4}
{0 CHEMBL260933,13 1,36 1,37 1,52 5.4}
{0 CHEMBL261849,4 1,8 1,13 1,52 5}
{0 CHEMBL262433,1 1,2 1,3 1,4 1,7 1,8 1,9 1,13 1,46 1,52 5.4}
{0 CHEMBL271381,2 1,3 1,4 1,7 1,8 1,9 1,13 1,46 1,52 6.3}
{0 CHEMBL272453,2 1,3 1,4 1,7 1,8 1,9 1,13 1,46 1,52 5.4}
{0 CHEMBL274064,4 1,11 1,13 1,52 5.4}
{0 CHEMBL278041,28 1,36 1,52 5}
{0 CHEMBL288441,5 1,6 1,9 1,13 1,14 1,52 5}
{0 CHEMBL289959,2 1,8 1,9 1,52 4.4}
{0 CHEMBL296468,13 1,46 1,52 5}
{0 CHEMBL296586,2 1,9 1,13 1,46 1,52 6.4}
{0 CHEMBL300138,1 1,13 1,14 1,52 5}
{0 CHEMBL302449,13 1,14 1,52 7.7}
{0 CHEMBL306380,1 1,4 1,8 1,13 1,52 6}
{0 CHEMBL316264,28 1,36 1,52 5.4}
{0 CHEMBL31965,2 1,8 1,9 1,13 1,14 1,46 1,52 5}
{0 CHEMBL326282,4 1,13 1,23 1,52 5.4}
{0 CHEMBL336961,2 1,9 1,13 1,46 1,52 5.4}
{0 CHEMBL340384,13 1,28 1,45 1,52 5.6}
{0 CHEMBL340921,13 1,28 1,45 1,52 5.4}
{0 CHEMBL354676,2 1,3 1,7 1,9 1,13 1,46 1,52 4.4}
{0 CHEMBL360190,13 1,52 5.721}
{0 CHEMBL363648,8 1,11 1,13 1,18 1,28 1,46 1,52 5.4}
{0 CHEMBL371206,1 1,2 1,3 1,4 1,7 1,8 1,9 1,13 1,33 1,36 1,38 1,46 1,52 6.5}
{0 CHEMBL373598,3 1,6 1,8 1,9 1,13 1,14 1,46 1,52 5.2}
{0 CHEMBL375284,2 1,3 1,7 1,9 1,13 1,16 1,46 1,52 5.4}
{0 CHEMBL377300,9 1,13 1,52 5}
{0 CHEMBL377383,4 1,9 1,13 1,52 5.384}
{0 CHEMBL377408,4 1,6 1,9 1,13 1,14 1,52 5.4}
{0 CHEMBL378627,4 1,6 1,8 1,9 1,13 1,14 1,46 1,52 5.4}
{0 CHEMBL379218,13 1,16 1,52 5}
{0 CHEMBL379835,13 1,52 5.9}
{0 CHEMBL38380,13 1,14 1,30 1,52 5.4}
{0 CHEMBL384304,4 1,8 1,13 1,14 1,46 1,52 5}
{0 CHEMBL385478,13 1,46 1,52 6.3}
{0 CHEMBL386051,2 1,9 1,13 1,52 5}
{0 CHEMBL387971,6 1,13 1,14 1,16 1,36 1,52 5.4}
{0 CHEMBL394619,1 1,2 1,3 1,4 1,5 1,7 1,8 1,9 1,13 1,46 1,52 6}
{0 CHEMBL394790,1 1,2 1,3 1,4 1,5 1,7 1,8 1,9 1,13 1,46 1,52 5.9}
{0 CHEMBL396523,2 1,8 1,9 1,13 1,16 1,27 1,40 1,52 7.9}
{0 CHEMBL398951,6 1,13 1,14 1,16 1,52 5.4}
{0 CHEMBL402846,2 1,3 1,4 1,7 1,8 1,9 1,13 1,46 1,52 5.5}
{0 CHEMBL404367,2 1,3 1,4 1,7 1,8 1,9 1,13 1,46 1,52 5.7}
{0 CHEMBL411903,2 1,3 1,4 1,7 1,8 1,9 1,13 1,46 1,52 6.9}
{0 CHEMBL412142,6 1,8 1,13 1,14 1,46 1,52 5.4}
{0 CHEMBL413779,3 1,6 1,8 1,9 1,13 1,14 1,46 1,52 5.4}
{0 CHEMBL41783,13 1,14 1,16 1,46 1,51 1,52 5.4}
{0 CHEMBL422897,13 1,14 1,52 5.5}
{0 CHEMBL424872,4 1,6 1,9 1,13 1,14 1,52 5.4}
{0 CHEMBL428690,13 1,14 1,52 5.076}
{0 CHEMBL437747,11 1,13 1,46 1,52 5.8}
{0 CHEMBL440084,13 1,52 5}
{0 CHEMBL443962,13 1,52 6.3}
{0 CHEMBL445813,9 1,13 1,16 1,46 1,52 5}
{0 CHEMBL450786,2 1,9 1,13 1,14 1,36 1,46 1,52 6.387}
{0 CHEMBL451401,2 1,13 1,16 1,22 1,52 4.5}
{0 CHEMBL452812,9 1,13 1,52 4.921}
{0 CHEMBL453593,8 1,13 1,32 1,52 4.796}
{0 CHEMBL458997,2 1,3 1,8 1,9 1,13 1,47 1,52 8.4}
{0 CHEMBL461876,2 1,8 1,9 1,13 1,14 1,52 5.7}
{0 CHEMBL462120,2 1,9 1,13 1,46 1,52 5.4}
{0 CHEMBL464552,2 1,8 1,9 1,13 1,14 1,47 1,52 5}
{0 CHEMBL468280,13 1,52 5.4}
{0 CHEMBL474432,13 1,52 7.1}
{0 CHEMBL475251,3 1,8 1,9 1,13 1,32 1,46 1,52 8.189}
{0 CHEMBL477772,2 1,9 1,13 1,52 6.538}
{0 CHEMBL481491,13 1,52 5.4}
{0 CHEMBL482767,2 1,3 1,5 1,7 1,8 1,9 1,13 1,46 1,52 7.3}
{0 CHEMBL482967,2 1,4 1,9 1,13 1,52 7.6}
{0 CHEMBL483158,2 1,9 1,13 1,27 1,52 7.4}
{0 CHEMBL483321,2 1,8 1,9 1,13 1,47 1,52 5}
{0 CHEMBL484390,6 1,13 1,14 1,46 1,50 1,52 5.4}
{0 CHEMBL485556,6 1,13 1,14 1,20 1,46 1,50 1,52 5.4}
{0 CHEMBL488645,13 1,32 1,52 4.357}
{0 CHEMBL488646,13 1,32 1,52 4.553}
{0 CHEMBL488811,13 1,32 1,52 5.046}
{0 CHEMBL491473,9 1,13 1,14 1,52 5.689}
{0 CHEMBL491758,2 1,3 1,8 1,9 1,52 7.6}
{0 CHEMBL494089,4 1,8 1,13 1,49 1,52 5}
{0 CHEMBL497151,52 6}
{0 CHEMBL504950,4 1,8 1,13 1,33 1,52 5.5}
{0 CHEMBL505637,13 1,18 1,52 5.387}
{0 CHEMBL507056,1 1,13 1,52 4.337}
{0 CHEMBL507936,2 1,3 1,4 1,5 1,7 1,9 1,13 1,19 1,46 1,52 5.4}
{0 CHEMBL508928,2 1,3 1,4 1,7 1,8 1,9 1,13 1,46 1,52 6.8}
{0 CHEMBL50894,2 1,9 1,13 1,46 1,52 6.8}
{0 CHEMBL509032,2 1,3 1,6 1,8 1,9 1,13 1,14 1,52 8.5}
{0 CHEMBL509435,1 1,13 1,32 1,52 5.036}
{0 CHEMBL509635,13 1,32 1,52 4.638}
{0 CHEMBL513846,2 1,9 1,12 1,13 1,52 5.4}
{0 CHEMBL513909,2 1,9 1,13 1,14 1,29 1,52 5}
{0 CHEMBL514499,13 1,52 6.7}
{0 CHEMBL519697,6 1,13 1,14 1,46 1,50 1,52 5.4}
{0 CHEMBL521201,9 1,13 1,32 1,52 5.114}
{0 CHEMBL521851,6 1,9 1,13 1,14 1,16 1,49 1,52 5.585}
{0 CHEMBL522892,2 1,9 1,13 1,14 1,42 1,46 1,52 5.45}
{0 CHEMBL52387,3 1,8 1,13 1,46 1,52 5.4}
{0 CHEMBL525191,13 1,18 1,28 1,35 1,52 5}
{0 CHEMBL526133,9 1,13 1,16 1,40 1,52 5.4}
{0 CHEMBL529217,13 1,32 1,52 4.456}
{0 CHEMBL529663,9 1,13 1,32 1,52 5}
{0 CHEMBL535,2 1,9 1,13 1,14 1,46 1,52 6.571}
{0 CHEMBL535331,9 1,13 1,39 1,42 1,50 1,52 5.4}
{0 CHEMBL539474,9 1,13 1,35 1,46 1,52 6}
{0 CHEMBL553,2 1,8 1,9 1,13 1,20 1,52 5.6}
{0 CHEMBL554,2 1,8 1,9 1,13 1,42 1,52 5.2}
{0 CHEMBL558752,2 1,9 1,13 1,46 1,50 1,52 5}
{0 CHEMBL560813,2 1,3 1,6 1,7 1,8 1,9 1,13 1,14 1,27 1,46 1,52 5.4}
{0 CHEMBL562488,13 1,52 4.4}
{0 CHEMBL565612,9 1,13 1,14 1,52 5.4}
{0 CHEMBL572878,2 1,7 1,8 1,9 1,13 1,14 1,16 1,28 1,46 1,52 7.6}
{0 CHEMBL572881,2 1,7 1,8 1,9 1,13 1,46 1,52 5}
{0 CHEMBL573339,13 1,33 1,49 1,52 5}
{0 CHEMBL574738,2 1,3 1,6 1,7 1,8 1,9 1,13 1,14 1,28 1,46 1,47 1,52 5}
{0 CHEMBL576982,2 1,3 1,7 1,8 1,9 1,12 1,13 1,14 1,46 1,49 1,52 5}
{0 CHEMBL583144,13 1,21 1,45 1,52 5.4}
{0 CHEMBL590109,4 1,9 1,13 1,16 1,40 1,52 6.61}
{0 CHEMBL592030,4 1,9 1,13 1,16 1,40 1,52 7.2}
{0 CHEMBL601719,4 1,8 1,13 1,52 7.222}
{0 CHEMBL607707,2 1,5 1,6 1,9 1,12 1,13 1,14 1,46 1,52 5}
{0 CHEMBL608154,9 1,13 1,46 1,52 5}
{0 CHEMBL6246,13 1,52 5.527}
{0 CHEMBL7064,13 1,16 1,51 1,52 6.407}
{0 CHEMBL91829,13 1,14 1,42 1,52 5.328}
{0 CHEMBL939,2 1,8 1,9 1,13 1,14 1,52 5.4}
{0 CHEMBL941,2 1,6 1,7 1,9 1,13 1,14 1,46 1,52 5.108}
{0 CHEMBL95692,6 1,11 1,13 1,52 5.4}
