{
  "data_features": {
    "feature": [
      {
        "data_type": "nominal",
        "index": "0",
        "is_ignore": "false",
        "is_row_identifier": "true",
        "is_target": "false",
        "name": "molecule_id",
        "nominal_value": [
          "CHEMBL1163775",
          "CHEMBL1164104",
          "CHEMBL1164105",
          "CHEMBL1164112",
          "CHEMBL1164113",
          "CHEMBL1164270",
          "CHEMBL1164322",
          "CHEMBL1164415",
          "CHEMBL1164531",
          "CHEMBL1164532",
          "CHEMBL1164533",
          "CHEMBL1164560",
          "CHEMBL1164561",
          "CHEMBL1164869",
          "CHEMBL1164870",
          "CHEMBL1164871",
          "CHEMBL1165175",
          "CHEMBL1165260",
          "CHEMBL1165261",
          "CHEMBL1165496",
          "CHEMBL1165505",
          "CHEMBL1165554",
          "CHEMBL1165729",
          "CHEMBL1165759",
          "CHEMBL157946",
          "CHEMBL189568",
          "CHEMBL191"
        ],
        "number_of_missing_values": "0"
      },
      {
        "data_type": "numeric",
        "index": "1",
        "is_ignore": "false",
        "is_row_identifier": "false",
        "is_target": "false",
        "name": "AMW",
        "number_of_missing_values": "0"
      },
      {
        "data_type": "numeric",
        "index": "2",
        "is_ignore": "false",
        "is_row_identifier": "false",
        "is_target": "false",
        "name": "C.",
        "number_of_missing_values": "0"
      },
      {
        "data_type": "numeric",
        "index": "3",
        "is_ignore": "false",
        "is_row_identifier": "false",
        "is_target": "true",
        "name": "pXC50",
        "number_of_missing_values": "0"
      }
    ]
  }
}