"molecule_id","AMW","C.","pXC50"
{1 7.578,2 35.8,3 7.783}
{0 CHEMBL1164104,1 7.636,2 36.1,3 8.444}
{0 CHEMBL1164105,1 7.995,2 38.1,3 6.967}
{0 CHEMBL1164112,1 7.762,2 35.9,3 6.553}
{0 CHEMBL1164113,1 8.212,2 38.3,3 8.495}
{0 CHEMBL1164270,1 7.652,2 37.5,3 7.754}
{0 CHEMBL1164322,1 8.061,2 39.3,3 6.757}
{0 CHEMBL1164415,1 8.096,2 35.6,3 7.31}
{0 CHEMBL1164531,1 7.944,2 38.3,3 8.409}
{0 CHEMBL1164532,1 8.801,2 37.1,3 6.484}
{0 CHEMBL1164533,1 8.588,2 39,3 7.73}
{0 CHEMBL1164560,1 7.798,2 37.7,3 8.638}
{0 CHEMBL1164561,1 8.495,2 37.5,3 8.022}
{0 CHEMBL1164869,1 8.096,2 35.6,3 7.796}
{0 CHEMBL1164870,1 7.58,2 36.9,3 8.456}
{0 CHEMBL1164871,1 7.917,2 37.5,3 5}
{0 CHEMBL1165175,1 7.995,2 38.1,3 8.538}
{0 CHEMBL1165260,1 8.316,2 39,3 7.86}
{0 CHEMBL1165261,1 7.995,2 38.1,3 8.469}
{0 CHEMBL1165496,1 7.905,2 36.4,3 7.164}
{0 CHEMBL1165505,1 8.495,2 37.5,3 8.137}
{0 CHEMBL1165554,1 7.384,2 35.8,3 6.553}
{0 CHEMBL1165729,1 7.452,2 36.8,3 7.793}
{0 CHEMBL1165759,1 8.429,2 40,3 7.726}
{0 CHEMBL157946,1 7.267,2 44.3,3 7.469}
{0 CHEMBL189568,1 7.798,2 37.7,3 9.398}
{0 CHEMBL191,1 7.98,2 41.5,3 5}
