{
  "data_features": {
    "feature": [
      {
        "data_type": "nominal",
        "index": "0",
        "is_ignore": "false",
        "is_row_identifier": "true",
        "is_target": "false",
        "name": "molecule_id",
        "nominal_value": [
          "CHEMBL1078442",
          "CHEMBL1091356",
          "CHEMBL1110",
          "CHEMBL116438",
          "CHEMBL117",
          "CHEMBL1179",
          "CHEMBL1258517",
          "CHEMBL1289053",
          "CHEMBL1289283",
          "CHEMBL1289395",
          "CHEMBL1289396",
          "CHEMBL1289515",
          "CHEMBL1290155",
          "CHEMBL1290264",
          "CHEMBL149808",
          "CHEMBL163",
          "CHEMBL1643880",
          "CHEMBL1643881",
          "CHEMBL1643883",
          "CHEMBL1650645",
          "CHEMBL1650652",
          "CHEMBL1650654",
          "CHEMBL1743344",
          "CHEMBL1743351",
          "CHEMBL1771",
          "CHEMBL1774933",
          "CHEMBL178090",
          "CHEMBL178516",
          "CHEMBL178711",
          "CHEMBL178780",
          "CHEMBL179005",
          "CHEMBL179398",
          "CHEMBL179529",
          "CHEMBL179618",
          "CHEMBL179621",
          "CHEMBL179669",
          "CHEMBL179704",
          "CHEMBL1921976",
          "CHEMBL1933349",
          "CHEMBL195217",
          "CHEMBL2018903",
          "CHEMBL2018904",
          "CHEMBL2018905",
          "CHEMBL2018906",
          "CHEMBL2018907",
          "CHEMBL2018908",
          "CHEMBL2018909",
          "CHEMBL2018910",
          "CHEMBL2018911",
          "CHEMBL2018912",
          "CHEMBL2018913",
          "CHEMBL2018914",
          "CHEMBL2018915",
          "CHEMBL2018916",
          "CHEMBL2018917",
          "CHEMBL2018918",
          "CHEMBL2018919",
          "CHEMBL2018920",
          "CHEMBL2018921",
          "CHEMBL2018922",
          "CHEMBL2018923",
          "CHEMBL2018924",
          "CHEMBL2018925",
          "CHEMBL2018926",
          "CHEMBL2019022",
          "CHEMBL2019023",
          "CHEMBL2019024",
          "CHEMBL2019025",
          "CHEMBL2019026",
          "CHEMBL202376",
          "CHEMBL2036208",
          "CHEMBL2036209",
          "CHEMBL2036210",
          "CHEMBL2036211",
          "CHEMBL2036212",
          "CHEMBL2036213",
          "CHEMBL2036214",
          "CHEMBL2036215",
          "CHEMBL207831",
          "CHEMBL208528",
          "CHEMBL214784",
          "CHEMBL214859",
          "CHEMBL214990",
          "CHEMBL215134",
          "CHEMBL215174",
          "CHEMBL215183",
          "CHEMBL2170062",
          "CHEMBL2170747",
          "CHEMBL2170750",
          "CHEMBL2170754",
          "CHEMBL217125",
          "CHEMBL2178422",
          "CHEMBL218397",
          "CHEMBL2204469",
          "CHEMBL2347754",
          "CHEMBL2347755",
          "CHEMBL2347756",
          "CHEMBL2347757",
          "CHEMBL2347758",
          "CHEMBL2347759",
          "CHEMBL2347911",
          "CHEMBL2347912",
          "CHEMBL2347913",
          "CHEMBL2347914",
          "CHEMBL2347915",
          "CHEMBL2347916",
          "CHEMBL2347917",
          "CHEMBL2347918",
          "CHEMBL242983",
          "CHEMBL244239",
          "CHEMBL257990",
          "CHEMBL26260",
          "CHEMBL264241",
          "CHEMBL266212",
          "CHEMBL275528",
          "CHEMBL283196",
          "CHEMBL296580",
          "CHEMBL348475",
          "CHEMBL359657",
          "CHEMBL360541",
          "CHEMBL360999",
          "CHEMBL361153",
          "CHEMBL361364",
          "CHEMBL385008",
          "CHEMBL386124",
          "CHEMBL386250",
          "CHEMBL407034",
          "CHEMBL410355",
          "CHEMBL425519",
          "CHEMBL446083",
          "CHEMBL447591",
          "CHEMBL448743",
          "CHEMBL453169",
          "CHEMBL456379",
          "CHEMBL456390",
          "CHEMBL460178",
          "CHEMBL462093",
          "CHEMBL462513",
          "CHEMBL469227",
          "CHEMBL488400",
          "CHEMBL493001",
          "CHEMBL498371",
          "CHEMBL498373",
          "CHEMBL499007",
          "CHEMBL500394",
          "CHEMBL502335",
          "CHEMBL502824",
          "CHEMBL502908",
          "CHEMBL551991",
          "CHEMBL62811",
          "CHEMBL638",
          "CHEMBL671",
          "CHEMBL691",
          "CHEMBL83",
          "CHEMBL833"
        ],
        "number_of_missing_values": "0"
      },
      {
        "data_type": "numeric",
        "index": "1",
        "is_ignore": "false",
        "is_row_identifier": "false",
        "is_target": "false",
        "name": "AMW",
        "number_of_missing_values": "0"
      },
      {
        "data_type": "numeric",
        "index": "2",
        "is_ignore": "false",
        "is_row_identifier": "false",
        "is_target": "false",
        "name": "C.",
        "number_of_missing_values": "0"
      },
      {
        "data_type": "numeric",
        "index": "3",
        "is_ignore": "false",
        "is_row_identifier": "false",
        "is_target": "false",
        "name": "H.",
        "number_of_missing_values": "0"
      },
      {
        "data_type": "numeric",
        "index": "4",
        "is_ignore": "false",
        "is_row_identifier": "false",
        "is_target": "false",
        "name": "Me",
        "number_of_missing_values": "0"
      },
      {
        "data_type": "numeric",
        "index": "5",
        "is_ignore": "false",
        "is_row_identifier": "false",
        "is_target": "false",
        "name": "Mi",
        "number_of_missing_values": "0"
      },
      {
        "data_type": "numeric",
        "index": "6",
        "is_ignore": "false",
        "is_row_identifier": "false",
        "is_target": "false",
        "name": "Mp",
        "number_of_missing_values": "0"
      },
      {
        "data_type": "numeric",
        "index": "7",
        "is_ignore": "false",
        "is_row_identifier": "false",
        "is_target": "false",
        "name": "Mv",
        "number_of_missing_values": "0"
      },
      {
        "data_type": "numeric",
        "index": "8",
        "is_ignore": "false",
        "is_row_identifier": "false",
        "is_target": "false",
        "name": "MW",
        "number_of_missing_values": "0"
      },
      {
        "data_type": "numeric",
        "index": "9",
        "is_ignore": "false",
        "is_row_identifier": "false",
        "is_target": "false",
        "name": "N.",
        "number_of_missing_values": "0"
      },
      {
        "data_type": "numeric",
        "index": "10",
        "is_ignore": "false",
        "is_row_identifier": "false",
        "is_target": "false",
        "name": "nAB",
        "number_of_missing_values": "0"
      },
      {
        "data_type": "numeric",
        "index": "11",
        "is_ignore": "false",
        "is_row_identifier": "false",
        "is_target": "false",
        "name": "nAT",
        "number_of_missing_values": "0"
      },
      {
        "data_type": "numeric",
        "index": "12",
        "is_ignore": "false",
        "is_row_identifier": "false",
        "is_target": "false",
        "name": "nB",
        "number_of_missing_values": "0"
      },
      {
        "data_type": "numeric",
        "index": "13",
        "is_ignore": "false",
        "is_row_identifier": "false",
        "is_target": "false",
        "name": "nBM",
        "number_of_missing_values": "0"
      },
      {
        "data_type": "numeric",
        "index": "14",
        "is_ignore": "false",
        "is_row_identifier": "false",
        "is_target": "false",
        "name": "nBO",
        "number_of_missing_values": "0"
      },
      {
        "data_type": "numeric",
        "index": "15",
        "is_ignore": "false",
        "is_row_identifier": "false",
        "is_target": "false",
        "name": "nBR",
        "number_of_missing_values": "0"
      },
      {
        "data_type": "numeric",
        "index": "16",
        "is_ignore": "false",
        "is_row_identifier": "false",
        "is_target": "false",
        "name": "nBT",
        "number_of_missing_values": "0"
      },
      {
        "data_type": "numeric",
        "index": "17",
        "is_ignore": "false",
        "is_row_identifier": "false",
        "is_target": "false",
        "name": "nC",
        "number_of_missing_values": "0"
      },
      {
        "data_type": "numeric",
        "index": "18",
        "is_ignore": "false",
        "is_row_identifier": "false",
        "is_target": "false",
        "name": "nCL",
        "number_of_missing_values": "0"
      },
      {
        "data_type": "numeric",
        "index": "19",
        "is_ignore": "false",
        "is_row_identifier": "false",
        "is_target": "false",
        "name": "nCsp",
        "number_of_missing_values": "0"
      },
      {
        "data_type": "numeric",
        "index": "20",
        "is_ignore": "false",
        "is_row_identifier": "false",
        "is_target": "false",
        "name": "nCsp2",
        "number_of_missing_values": "0"
      },
      {
        "data_type": "numeric",
        "index": "21",
        "is_ignore": "false",
        "is_row_identifier": "false",
        "is_target": "false",
        "name": "nCsp3",
        "number_of_missing_values": "0"
      },
      {
        "data_type": "numeric",
        "index": "22",
        "is_ignore": "false",
        "is_row_identifier": "false",
        "is_target": "false",
        "name": "nDB",
        "number_of_missing_values": "0"
      },
      {
        "data_type": "numeric",
        "index": "23",
        "is_ignore": "false",
        "is_row_identifier": "false",
        "is_target": "false",
        "name": "nF",
        "number_of_missing_values": "0"
      },
      {
        "data_type": "numeric",
        "index": "24",
        "is_ignore": "false",
        "is_row_identifier": "false",
        "is_target": "false",
        "name": "nH",
        "number_of_missing_values": "0"
      },
      {
        "data_type": "numeric",
        "index": "25",
        "is_ignore": "false",
        "is_row_identifier": "false",
        "is_target": "false",
        "name": "nHet",
        "number_of_missing_values": "0"
      },
      {
        "data_type": "numeric",
        "index": "26",
        "is_ignore": "false",
        "is_row_identifier": "false",
        "is_target": "false",
        "name": "nHM",
        "number_of_missing_values": "0"
      },
      {
        "data_type": "numeric",
        "index": "27",
        "is_ignore": "false",
        "is_row_identifier": "false",
        "is_target": "false",
        "name": "nI",
        "number_of_missing_values": "0"
      },
      {
        "data_type": "numeric",
        "index": "28",
        "is_ignore": "false",
        "is_row_identifier": "false",
        "is_target": "false",
        "name": "nN",
        "number_of_missing_values": "0"
      },
      {
        "data_type": "numeric",
        "index": "29",
        "is_ignore": "false",
        "is_row_identifier": "false",
        "is_target": "false",
        "name": "nO",
        "number_of_missing_values": "0"
      },
      {
        "data_type": "numeric",
        "index": "30",
        "is_ignore": "false",
        "is_row_identifier": "false",
        "is_target": "false",
        "name": "nP",
        "number_of_missing_values": "0"
      },
      {
        "data_type": "numeric",
        "index": "31",
        "is_ignore": "false",
        "is_row_identifier": "false",
        "is_target": "false",
        "name": "nS",
        "number_of_missing_values": "0"
      },
      {
        "data_type": "numeric",
        "index": "32",
        "is_ignore": "false",
        "is_row_identifier": "false",
        "is_target": "false",
        "name": "nSK",
        "number_of_missing_values": "0"
      },
      {
        "data_type": "numeric",
        "index": "33",
        "is_ignore": "false",
        "is_row_identifier": "false",
        "is_target": "false",
        "name": "nTB",
        "number_of_missing_values": "0"
      },
      {
        "data_type": "numeric",
        "index": "34",
        "is_ignore": "false",
        "is_row_identifier": "false",
        "is_target": "false",
        "name": "nX",
        "number_of_missing_values": "0"
      },
      {
        "data_type": "numeric",
        "index": "35",
        "is_ignore": "false",
        "is_row_identifier": "false",
        "is_target": "false",
        "name": "O.",
        "number_of_missing_values": "0"
      },
      {
        "data_type": "numeric",
        "index": "36",
        "is_ignore": "false",
        "is_row_identifier": "false",
        "is_target": "false",
        "name": "RBF",
        "number_of_missing_values": "0"
      },
      {
        "data_type": "numeric",
        "index": "37",
        "is_ignore": "false",
        "is_row_identifier": "false",
        "is_target": "false",
        "name": "RBN",
        "number_of_missing_values": "0"
      },
      {
        "data_type": "numeric",
        "index": "38",
        "is_ignore": "false",
        "is_row_identifier": "false",
        "is_target": "false",
        "name": "SCBO",
        "number_of_missing_values": "0"
      },
      {
        "data_type": "numeric",
        "index": "39",
        "is_ignore": "false",
        "is_row_identifier": "false",
        "is_target": "false",
        "name": "Se",
        "number_of_missing_values": "0"
      },
      {
        "data_type": "numeric",
        "index": "40",
        "is_ignore": "false",
        "is_row_identifier": "false",
        "is_target": "false",
        "name": "Si",
        "number_of_missing_values": "0"
      },
      {
        "data_type": "numeric",
        "index": "41",
        "is_ignore": "false",
        "is_row_identifier": "false",
        "is_target": "false",
        "name": "Sp",
        "number_of_missing_values": "0"
      },
      {
        "data_type": "numeric",
        "index": "42",
        "is_ignore": "false",
        "is_row_identifier": "false",
        "is_target": "false",
        "name": "Sv",
        "number_of_missing_values": "0"
      },
      {
        "data_type": "numeric",
        "index": "43",
        "is_ignore": "false",
        "is_row_identifier": "false",
        "is_target": "false",
        "name": "X.",
        "number_of_missing_values": "0"
      },
      {
        "data_type": "numeric",
        "index": "44",
        "is_ignore": "false",
        "is_row_identifier": "false",
        "is_target": "true",
        "name": "pXC50",
        "number_of_missing_values": "0"
      }
    ]
  }
}