{
  "data_set_description": {
    "collection_date": "November 2013",
    "creator": "Dr Jeremy Besnard, Dr Ivan Olier, Dr Noureddin Sadawi, Dr Larisa Soldatova, Dr Crina Grosan, Prof Ross King, Dr Richard Bickerton, Prof Andrew Hopkins and Dr Willem van Hoorn",
    "default_target_attribute": "pXC50",
    "description": "This dataset contains QSAR data (from ChEMBL version 17) showing activity values (unit is pseudo-pCI50) of several compounds on drug target ChEMBL_ID: CHEMBL1798 (TID: 179), and it has 127 rows and 1250 features (not including molecule IDs and class feature: molecule_id and pXC50). The features represent Molecular Descriptors which were generated from SMILES strings. Missing value imputation was applied to this dataset (By choosing the Median).",
    "description_version": "1",
    "file_id": "3583935",
    "format": "ARFF",
    "id": "36273",
    "licence": "Public",
    "md5_checksum": "1a174201b1178bf1f19c834609b46bfb",
    "minio_url": "https://data.openml.org/datasets/0003/36273/dataset_36273.pq",
    "name": "QSAR-DATASET-FOR-DRUG-TARGET-CHEMBL1798",
    "original_data_url": "https://www.ebi.ac.uk/chembl/target/inspect/CHEMBL1798",
    "parquet_url": "https://data.openml.org/datasets/0003/36273/dataset_36273.pq",
    "processing_date": "2018-10-04 04:45:36",
    "row_id_attribute": "molecule_id",
    "status": "deactivated",
    "tag": [
      "MetaQSAR",
      "study_13"
    ],
    "upload_date": "2016-07-15T20:39:16",
    "url": "https://api.openml.org/data/v1/download/3583935/QSAR-DATASET-FOR-DRUG-TARGET-CHEMBL1798.arff",
    "version": "10",
    "visibility": "public"
  }
}