{
  "data_features": {
    "feature": [
      {
        "data_type": "nominal",
        "index": "0",
        "is_ignore": "false",
        "is_row_identifier": "true",
        "is_target": "false",
        "name": "molecule_id",
        "nominal_value": [
          "CHEMBL1170023",
          "CHEMBL1170424",
          "CHEMBL1170425",
          "CHEMBL1172388",
          "CHEMBL1172743",
          "CHEMBL1173336",
          "CHEMBL1173337",
          "CHEMBL1173338",
          "CHEMBL1173339",
          "CHEMBL1173797",
          "CHEMBL1173798",
          "CHEMBL1173799",
          "CHEMBL1173800",
          "CHEMBL148",
          "CHEMBL480517"
        ],
        "number_of_missing_values": "0"
      },
      {
        "data_type": "numeric",
        "index": "1",
        "is_ignore": "false",
        "is_row_identifier": "false",
        "is_target": "false",
        "name": "AMW",
        "number_of_missing_values": "0"
      },
      {
        "data_type": "numeric",
        "index": "2",
        "is_ignore": "false",
        "is_row_identifier": "false",
        "is_target": "false",
        "name": "C.",
        "number_of_missing_values": "0"
      },
      {
        "data_type": "numeric",
        "index": "3",
        "is_ignore": "false",
        "is_row_identifier": "false",
        "is_target": "true",
        "name": "pXC50",
        "number_of_missing_values": "0"
      }
    ]
  }
}