{
  "data_features": {
    "feature": [
      {
        "data_type": "nominal",
        "index": "0",
        "is_ignore": "false",
        "is_row_identifier": "true",
        "is_target": "false",
        "name": "molecule_id",
        "nominal_value": [
          "CHEMBL1236140",
          "CHEMBL1544",
          "CHEMBL1624",
          "CHEMBL1877304",
          "CHEMBL2348282",
          "CHEMBL2348283",
          "CHEMBL2348284",
          "CHEMBL2348285",
          "CHEMBL2348286",
          "CHEMBL2348287",
          "CHEMBL2348288",
          "CHEMBL2348289",
          "CHEMBL2348290",
          "CHEMBL2348291",
          "CHEMBL2348292",
          "CHEMBL2348293",
          "CHEMBL2348294",
          "CHEMBL2348295",
          "CHEMBL2348296",
          "CHEMBL2348297",
          "CHEMBL2348298",
          "CHEMBL2348299",
          "CHEMBL2348300",
          "CHEMBL2348301",
          "CHEMBL2348302",
          "CHEMBL2348303",
          "CHEMBL2348304",
          "CHEMBL2348305",
          "CHEMBL2348306",
          "CHEMBL291053",
          "CHEMBL41632"
        ],
        "number_of_missing_values": "0"
      },
      {
        "data_type": "numeric",
        "index": "1",
        "is_ignore": "false",
        "is_row_identifier": "false",
        "is_target": "false",
        "name": "Mi",
        "number_of_missing_values": "0"
      },
      {
        "data_type": "numeric",
        "index": "2",
        "is_ignore": "false",
        "is_row_identifier": "false",
        "is_target": "false",
        "name": "N.",
        "number_of_missing_values": "0"
      },
      {
        "data_type": "numeric",
        "index": "3",
        "is_ignore": "false",
        "is_row_identifier": "false",
        "is_target": "false",
        "name": "nN",
        "number_of_missing_values": "0"
      },
      {
        "data_type": "numeric",
        "index": "4",
        "is_ignore": "false",
        "is_row_identifier": "false",
        "is_target": "false",
        "name": "AMW",
        "number_of_missing_values": "0"
      },
      {
        "data_type": "numeric",
        "index": "5",
        "is_ignore": "false",
        "is_row_identifier": "false",
        "is_target": "true",
        "name": "pXC50",
        "number_of_missing_values": "0"
      }
    ]
  }
}