{
  "data_set_description": {
    "collection_date": "November 2013",
    "creator": "Dr Jeremy Besnard, Dr Ivan Olier, Dr Noureddin Sadawi, Dr Larisa Soldatova, Dr Crina Grosan, Prof Ross King, Dr Richard Bickerton, Prof Andrew Hopkins and Dr Willem van Hoorn",
    "default_target_attribute": "pXC50",
    "description": "This dataset contains QSAR data (from ChEMBL version 17) showing activity values (unit is pseudo-pCI50) of several compounds on drug target ChEMBL_ID: CHEMBL1908383 (TID: 104314), and it has 72 rows and 1296 features (not including molecule IDs and class feature: molecule_id and pXC50). The features represent Molecular Descriptors which were generated from SMILES strings. Missing value imputation was applied to this dataset (By choosing the Median).",
    "description_version": "1",
    "file_id": "3582532",
    "format": "ARFF",
    "id": "36216",
    "licence": "Public",
    "md5_checksum": "fe1f63475aa7c9a3abf61fa21eafd2da",
    "minio_url": "https://data.openml.org/datasets/0003/36216/dataset_36216.pq",
    "name": "QSAR-DATASET-FOR-DRUG-TARGET-CHEMBL1908383",
    "original_data_url": "https://www.ebi.ac.uk/chembl/target/inspect/CHEMBL1908383",
    "parquet_url": "https://data.openml.org/datasets/0003/36216/dataset_36216.pq",
    "processing_date": "2018-10-04 04:50:08",
    "row_id_attribute": "molecule_id",
    "status": "deactivated",
    "tag": [
      "MetaQSAR",
      "study_13"
    ],
    "upload_date": "2016-07-15T20:27:37",
    "url": "https://api.openml.org/data/v1/download/3582532/QSAR-DATASET-FOR-DRUG-TARGET-CHEMBL1908383.arff",
    "version": "11",
    "visibility": "public"
  }
}