{
  "data_features": {
    "feature": [
      {
        "data_type": "nominal",
        "index": "0",
        "is_ignore": "false",
        "is_row_identifier": "true",
        "is_target": "false",
        "name": "molecule_id",
        "nominal_value": [
          "CHEMBL10316",
          "CHEMBL1079",
          "CHEMBL1162356",
          "CHEMBL1242923",
          "CHEMBL1242950",
          "CHEMBL128168",
          "CHEMBL13343",
          "CHEMBL134",
          "CHEMBL13569",
          "CHEMBL13579",
          "CHEMBL13591",
          "CHEMBL13619",
          "CHEMBL13620",
          "CHEMBL13631",
          "CHEMBL13633",
          "CHEMBL13639",
          "CHEMBL13670",
          "CHEMBL13689",
          "CHEMBL13698",
          "CHEMBL13715",
          "CHEMBL13721",
          "CHEMBL13729",
          "CHEMBL13742",
          "CHEMBL13743",
          "CHEMBL13789",
          "CHEMBL13793",
          "CHEMBL13809",
          "CHEMBL13810",
          "CHEMBL13824",
          "CHEMBL13844",
          "CHEMBL13845",
          "CHEMBL13852",
          "CHEMBL13854",
          "CHEMBL13858",
          "CHEMBL13862",
          "CHEMBL13879",
          "CHEMBL13881",
          "CHEMBL13886",
          "CHEMBL13887",
          "CHEMBL13892",
          "CHEMBL13893",
          "CHEMBL13896",
          "CHEMBL13917",
          "CHEMBL13918",
          "CHEMBL13925",
          "CHEMBL13938",
          "CHEMBL13940",
          "CHEMBL13955",
          "CHEMBL13958",
          "CHEMBL13987",
          "CHEMBL14012",
          "CHEMBL14015",
          "CHEMBL14016",
          "CHEMBL14028",
          "CHEMBL14049",
          "CHEMBL14056",
          "CHEMBL14074",
          "CHEMBL14097",
          "CHEMBL14107",
          "CHEMBL14110",
          "CHEMBL14135",
          "CHEMBL14140",
          "CHEMBL14154",
          "CHEMBL14162",
          "CHEMBL14168",
          "CHEMBL14174",
          "CHEMBL14189",
          "CHEMBL14203",
          "CHEMBL14208",
          "CHEMBL14210",
          "CHEMBL14226",
          "CHEMBL14235",
          "CHEMBL14242",
          "CHEMBL14267",
          "CHEMBL14358",
          "CHEMBL1437",
          "CHEMBL14410",
          "CHEMBL14422",
          "CHEMBL14448",
          "CHEMBL14528",
          "CHEMBL14640",
          "CHEMBL14641",
          "CHEMBL146997",
          "CHEMBL157351",
          "CHEMBL1907831",
          "CHEMBL1907832",
          "CHEMBL19236",
          "CHEMBL196071",
          "CHEMBL2092860",
          "CHEMBL2092861",
          "CHEMBL2179395",
          "CHEMBL266155",
          "CHEMBL266386",
          "CHEMBL266613",
          "CHEMBL266835",
          "CHEMBL266861",
          "CHEMBL266863",
          "CHEMBL267074",
          "CHEMBL267801",
          "CHEMBL268035",
          "CHEMBL268734",
          "CHEMBL268945",
          "CHEMBL269197",
          "CHEMBL269198",
          "CHEMBL269236",
          "CHEMBL269538",
          "CHEMBL269631",
          "CHEMBL273408",
          "CHEMBL273485",
          "CHEMBL274315",
          "CHEMBL274548",
          "CHEMBL274784",
          "CHEMBL274889",
          "CHEMBL275118",
          "CHEMBL275403",
          "CHEMBL275502",
          "CHEMBL275564",
          "CHEMBL275613",
          "CHEMBL275774",
          "CHEMBL275777",
          "CHEMBL275970",
          "CHEMBL276035",
          "CHEMBL276276",
          "CHEMBL276487",
          "CHEMBL276868",
          "CHEMBL277570",
          "CHEMBL278221",
          "CHEMBL279200",
          "CHEMBL279394",
          "CHEMBL280022",
          "CHEMBL280467",
          "CHEMBL288139",
          "CHEMBL288951",
          "CHEMBL289480",
          "CHEMBL295234",
          "CHEMBL300388",
          "CHEMBL332242",
          "CHEMBL360803",
          "CHEMBL40287",
          "CHEMBL40337",
          "CHEMBL40393",
          "CHEMBL40399",
          "CHEMBL404505",
          "CHEMBL416893",
          "CHEMBL418162",
          "CHEMBL418536",
          "CHEMBL418716",
          "CHEMBL420",
          "CHEMBL430112",
          "CHEMBL441589",
          "CHEMBL442156",
          "CHEMBL46",
          "CHEMBL468161",
          "CHEMBL57895",
          "CHEMBL58186",
          "CHEMBL58187",
          "CHEMBL597",
          "CHEMBL60031",
          "CHEMBL60186",
          "CHEMBL61689",
          "CHEMBL62095",
          "CHEMBL62107",
          "CHEMBL6310",
          "CHEMBL67706",
          "CHEMBL6857",
          "CHEMBL68608",
          "CHEMBL71429",
          "CHEMBL761",
          "CHEMBL762",
          "CHEMBL862",
          "CHEMBL91745",
          "CHEMBL93192",
          "CHEMBL93845",
          "CHEMBL94022"
        ],
        "number_of_missing_values": "0"
      },
      {
        "data_type": "numeric",
        "index": "1",
        "is_ignore": "false",
        "is_row_identifier": "false",
        "is_target": "false",
        "name": "AMW",
        "number_of_missing_values": "0"
      },
      {
        "data_type": "numeric",
        "index": "2",
        "is_ignore": "false",
        "is_row_identifier": "false",
        "is_target": "false",
        "name": "C.",
        "number_of_missing_values": "0"
      },
      {
        "data_type": "numeric",
        "index": "3",
        "is_ignore": "false",
        "is_row_identifier": "false",
        "is_target": "true",
        "name": "pXC50",
        "number_of_missing_values": "0"
      }
    ]
  }
}