{
  "data_features": {
    "feature": [
      {
        "data_type": "nominal",
        "index": "0",
        "is_ignore": "false",
        "is_row_identifier": "true",
        "is_target": "false",
        "name": "molecule_id",
        "nominal_value": [
          "CHEMBL10",
          "CHEMBL101253",
          "CHEMBL103667",
          "CHEMBL105442",
          "CHEMBL1077023",
          "CHEMBL1078983",
          "CHEMBL1081312",
          "CHEMBL1082621",
          "CHEMBL1083192",
          "CHEMBL1083809",
          "CHEMBL1083810",
          "CHEMBL1084926",
          "CHEMBL1085160",
          "CHEMBL1085177",
          "CHEMBL1085178",
          "CHEMBL1086923",
          "CHEMBL1086924",
          "CHEMBL1091978",
          "CHEMBL1173655",
          "CHEMBL119385",
          "CHEMBL1213082",
          "CHEMBL1213083",
          "CHEMBL1213084",
          "CHEMBL1213085",
          "CHEMBL1213116",
          "CHEMBL1213117",
          "CHEMBL1213118",
          "CHEMBL1213119",
          "CHEMBL1213120",
          "CHEMBL1213168",
          "CHEMBL1213169",
          "CHEMBL1230020",
          "CHEMBL1230790",
          "CHEMBL1231371",
          "CHEMBL1233881",
          "CHEMBL1233882",
          "CHEMBL1234815",
          "CHEMBL1236107",
          "CHEMBL1240544",
          "CHEMBL1240545",
          "CHEMBL1240553",
          "CHEMBL1240554",
          "CHEMBL1240565",
          "CHEMBL1240566",
          "CHEMBL1240567",
          "CHEMBL1240594",
          "CHEMBL1240703",
          "CHEMBL1241104",
          "CHEMBL1241142",
          "CHEMBL1241143",
          "CHEMBL1241144",
          "CHEMBL1241145",
          "CHEMBL1241240",
          "CHEMBL1241241",
          "CHEMBL1241242",
          "CHEMBL1241269",
          "CHEMBL1241270",
          "CHEMBL1241271",
          "CHEMBL1241299",
          "CHEMBL1241300",
          "CHEMBL1241301",
          "CHEMBL1241355",
          "CHEMBL1241356",
          "CHEMBL1241357",
          "CHEMBL1241358",
          "CHEMBL1241389",
          "CHEMBL1241390",
          "CHEMBL1241391",
          "CHEMBL1241439",
          "CHEMBL1241440",
          "CHEMBL1241441",
          "CHEMBL1241481",
          "CHEMBL1241482",
          "CHEMBL1241483",
          "CHEMBL1241484",
          "CHEMBL1241485",
          "CHEMBL1241486",
          "CHEMBL1241487",
          "CHEMBL1241488",
          "CHEMBL1241489",
          "CHEMBL1241490",
          "CHEMBL1241491",
          "CHEMBL1241492",
          "CHEMBL1241578",
          "CHEMBL1241579",
          "CHEMBL1241580",
          "CHEMBL1241581",
          "CHEMBL1241582",
          "CHEMBL1241583",
          "CHEMBL1241584",
          "CHEMBL1241585",
          "CHEMBL1241586",
          "CHEMBL1241587",
          "CHEMBL1241588",
          "CHEMBL1241674",
          "CHEMBL1241675",
          "CHEMBL1241676",
          "CHEMBL1241677",
          "CHEMBL1241678",
          "CHEMBL1241679",
          "CHEMBL1241680",
          "CHEMBL1241681",
          "CHEMBL1241682",
          "CHEMBL1241683",
          "CHEMBL1241684",
          "CHEMBL1241767",
          "CHEMBL1241768",
          "CHEMBL1241769",
          "CHEMBL1241770",
          "CHEMBL1241771",
          "CHEMBL1241772",
          "CHEMBL1241773",
          "CHEMBL1241774",
          "CHEMBL1241775",
          "CHEMBL1241776",
          "CHEMBL1241857",
          "CHEMBL1241858",
          "CHEMBL1241859",
          "CHEMBL1241860",
          "CHEMBL1241861",
          "CHEMBL1241862",
          "CHEMBL1241863",
          "CHEMBL1241864",
          "CHEMBL1241942",
          "CHEMBL1241943",
          "CHEMBL1241944",
          "CHEMBL1241945",
          "CHEMBL1241946",
          "CHEMBL1241947",
          "CHEMBL1241948",
          "CHEMBL1241949",
          "CHEMBL1241950",
          "CHEMBL1242024",
          "CHEMBL1242025",
          "CHEMBL1242026",
          "CHEMBL1242028",
          "CHEMBL1242029",
          "CHEMBL1242030",
          "CHEMBL1242031",
          "CHEMBL1242032",
          "CHEMBL1242033",
          "CHEMBL1242034",
          "CHEMBL1242109",
          "CHEMBL1242110",
          "CHEMBL1242111",
          "CHEMBL1242112",
          "CHEMBL1242113",
          "CHEMBL1242114",
          "CHEMBL1242115",
          "CHEMBL1242116",
          "CHEMBL1242117",
          "CHEMBL1242118",
          "CHEMBL1242119",
          "CHEMBL1242198",
          "CHEMBL1242199",
          "CHEMBL1242200",
          "CHEMBL1242201",
          "CHEMBL1242202",
          "CHEMBL1242203",
          "CHEMBL1242204",
          "CHEMBL1242205",
          "CHEMBL1242206",
          "CHEMBL1242207",
          "CHEMBL1242208",
          "CHEMBL1242209",
          "CHEMBL1242285",
          "CHEMBL1242286",
          "CHEMBL1242287",
          "CHEMBL1242288",
          "CHEMBL1242289",
          "CHEMBL1242290",
          "CHEMBL1242291",
          "CHEMBL1242292",
          "CHEMBL1242293",
          "CHEMBL1242294",
          "CHEMBL1242295",
          "CHEMBL1242376",
          "CHEMBL1242377",
          "CHEMBL1242378",
          "CHEMBL1242379",
          "CHEMBL1242380",
          "CHEMBL1242381",
          "CHEMBL1242382",
          "CHEMBL1242383",
          "CHEMBL1242384",
          "CHEMBL1242385",
          "CHEMBL1242386",
          "CHEMBL1242468",
          "CHEMBL1242469",
          "CHEMBL1242470",
          "CHEMBL1242471",
          "CHEMBL1242472",
          "CHEMBL1242473",
          "CHEMBL1242474",
          "CHEMBL1242475",
          "CHEMBL1242476",
          "CHEMBL1242477",
          "CHEMBL1242566",
          "CHEMBL1242567",
          "CHEMBL1242568",
          "CHEMBL1242569",
          "CHEMBL1242570",
          "CHEMBL1242571",
          "CHEMBL1242572",
          "CHEMBL1242573",
          "CHEMBL1242574",
          "CHEMBL1242656",
          "CHEMBL1242657",
          "CHEMBL1242658",
          "CHEMBL1242659",
          "CHEMBL1242660",
          "CHEMBL1242661",
          "CHEMBL1242662",
          "CHEMBL1242663",
          "CHEMBL1242664",
          "CHEMBL1242665",
          "CHEMBL1242666",
          "CHEMBL1242748",
          "CHEMBL1242749",
          "CHEMBL1242750",
          "CHEMBL1242751",
          "CHEMBL1242752",
          "CHEMBL1242753",
          "CHEMBL1242754",
          "CHEMBL1242755",
          "CHEMBL1242756",
          "CHEMBL1242757",
          "CHEMBL1242758",
          "CHEMBL1242844",
          "CHEMBL1242845",
          "CHEMBL1242846",
          "CHEMBL1242847",
          "CHEMBL1242848",
          "CHEMBL1242849",
          "CHEMBL1242850",
          "CHEMBL1242851",
          "CHEMBL1242852",
          "CHEMBL1242853",
          "CHEMBL124660",
          "CHEMBL1257653",
          "CHEMBL1258517",
          "CHEMBL1276684",
          "CHEMBL1287853",
          "CHEMBL1289926",
          "CHEMBL1289975",
          "CHEMBL1290744",
          "CHEMBL1336",
          "CHEMBL1421",
          "CHEMBL1614701",
          "CHEMBL1615182",
          "CHEMBL1615183",
          "CHEMBL1615189",
          "CHEMBL1615278",
          "CHEMBL162",
          "CHEMBL1631888",
          "CHEMBL1631892",
          "CHEMBL1631895",
          "CHEMBL1645094",
          "CHEMBL1645095",
          "CHEMBL1645096",
          "CHEMBL1645098",
          "CHEMBL1645099",
          "CHEMBL1645100",
          "CHEMBL1645101",
          "CHEMBL1645102",
          "CHEMBL1645103",
          "CHEMBL1645106",
          "CHEMBL1645107",
          "CHEMBL1645108",
          "CHEMBL1645110",
          "CHEMBL1672328",
          "CHEMBL1684984",
          "CHEMBL1721885",
          "CHEMBL1738719",
          "CHEMBL1760153",
          "CHEMBL1760154",
          "CHEMBL1760155",
          "CHEMBL1760156",
          "CHEMBL1760157",
          "CHEMBL1760158",
          "CHEMBL1760159",
          "CHEMBL1760160",
          "CHEMBL1760161",
          "CHEMBL1760162",
          "CHEMBL1760163",
          "CHEMBL1760164",
          "CHEMBL1760165",
          "CHEMBL1760167",
          "CHEMBL1760168",
          "CHEMBL1760169",
          "CHEMBL1760170",
          "CHEMBL1760171",
          "CHEMBL1760172",
          "CHEMBL1762782",
          "CHEMBL1762788",
          "CHEMBL1762789",
          "CHEMBL1762790",
          "CHEMBL1789941",
          "CHEMBL1794070",
          "CHEMBL1796761",
          "CHEMBL180022",
          "CHEMBL1822054",
          "CHEMBL1834657",
          "CHEMBL1879463",
          "CHEMBL1908391",
          "CHEMBL1908392",
          "CHEMBL1908393",
          "CHEMBL1908394",
          "CHEMBL1908395",
          "CHEMBL1908396",
          "CHEMBL1908397",
          "CHEMBL1910989",
          "CHEMBL1910998",
          "CHEMBL1911002",
          "CHEMBL1911114",
          "CHEMBL1911117",
          "CHEMBL1914724",
          "CHEMBL1914726",
          "CHEMBL1914727",
          "CHEMBL1914736",
          "CHEMBL1914742",
          "CHEMBL1914743",
          "CHEMBL1921986",
          "CHEMBL1922090",
          "CHEMBL1922091",
          "CHEMBL1922092",
          "CHEMBL1922093",
          "CHEMBL1922094",
          "CHEMBL1922095",
          "CHEMBL1926704",
          "CHEMBL1928522",
          "CHEMBL1928523",
          "CHEMBL1928524",
          "CHEMBL1928525",
          "CHEMBL1928526",
          "CHEMBL1928527",
          "CHEMBL1928528",
          "CHEMBL1928529",
          "CHEMBL1928530",
          "CHEMBL1928531",
          "CHEMBL1928532",
          "CHEMBL1928533",
          "CHEMBL1928534",
          "CHEMBL1928535",
          "CHEMBL1928536",
          "CHEMBL1928537",
          "CHEMBL1928538",
          "CHEMBL1928539",
          "CHEMBL1928540",
          "CHEMBL1928541",
          "CHEMBL1928542",
          "CHEMBL1928543",
          "CHEMBL1928544",
          "CHEMBL1928545",
          "CHEMBL1928546",
          "CHEMBL1928547",
          "CHEMBL1928548",
          "CHEMBL1928549",
          "CHEMBL1928550",
          "CHEMBL1928551",
          "CHEMBL1928552",
          "CHEMBL1928553",
          "CHEMBL1928554",
          "CHEMBL1928555",
          "CHEMBL1928556",
          "CHEMBL1928557",
          "CHEMBL1928558",
          "CHEMBL1928559",
          "CHEMBL1928560",
          "CHEMBL1928561",
          "CHEMBL1928562",
          "CHEMBL1928563",
          "CHEMBL1928564",
          "CHEMBL1928565",
          "CHEMBL1928566",
          "CHEMBL1928567",
          "CHEMBL1928568",
          "CHEMBL1928569",
          "CHEMBL1928570",
          "CHEMBL1928571",
          "CHEMBL1928572",
          "CHEMBL1928573",
          "CHEMBL1928717",
          "CHEMBL1928718",
          "CHEMBL1928719",
          "CHEMBL1928720",
          "CHEMBL1928721",
          "CHEMBL1928722",
          "CHEMBL1928723",
          "CHEMBL1928724",
          "CHEMBL1928725",
          "CHEMBL1928726",
          "CHEMBL1928727",
          "CHEMBL1928728",
          "CHEMBL1928729",
          "CHEMBL1928730",
          "CHEMBL1945559",
          "CHEMBL1955886",
          "CHEMBL1957840",
          "CHEMBL1957841",
          "CHEMBL1957844",
          "CHEMBL1957845",
          "CHEMBL1957846",
          "CHEMBL1957848",
          "CHEMBL1957849",
          "CHEMBL1957850",
          "CHEMBL1957851",
          "CHEMBL1957852",
          "CHEMBL1957853",
          "CHEMBL1957854",
          "CHEMBL1957855",
          "CHEMBL1957856",
          "CHEMBL1957857",
          "CHEMBL1957858",
          "CHEMBL1957859",
          "CHEMBL1957860",
          "CHEMBL1957861",
          "CHEMBL1957862",
          "CHEMBL1957863",
          "CHEMBL1957864",
          "CHEMBL1957865",
          "CHEMBL1957866",
          "CHEMBL1957867",
          "CHEMBL1957868",
          "CHEMBL1957869",
          "CHEMBL1957870",
          "CHEMBL1957871",
          "CHEMBL1957872",
          "CHEMBL1957873",
          "CHEMBL1957874",
          "CHEMBL1972466",
          "CHEMBL1986603",
          "CHEMBL2017974",
          "CHEMBL2018214",
          "CHEMBL2018215",
          "CHEMBL2018216",
          "CHEMBL2018217",
          "CHEMBL2018218",
          "CHEMBL2018219",
          "CHEMBL2018220",
          "CHEMBL2018221",
          "CHEMBL2018222",
          "CHEMBL2018263",
          "CHEMBL2018265",
          "CHEMBL2018266",
          "CHEMBL2018271",
          "CHEMBL2018360",
          "CHEMBL2018409",
          "CHEMBL2018413",
          "CHEMBL2057359",
          "CHEMBL2057360",
          "CHEMBL2057361",
          "CHEMBL2057362",
          "CHEMBL2057363",
          "CHEMBL2057364",
          "CHEMBL2057365",
          "CHEMBL2057366",
          "CHEMBL2057367",
          "CHEMBL2057368",
          "CHEMBL2057369",
          "CHEMBL2057370",
          "CHEMBL2057371",
          "CHEMBL2057372",
          "CHEMBL2057373",
          "CHEMBL2058172",
          "CHEMBL2059907",
          "CHEMBL2059908",
          "CHEMBL2059909",
          "CHEMBL2059910",
          "CHEMBL2059911",
          "CHEMBL2059912",
          "CHEMBL2059913",
          "CHEMBL2062546",
          "CHEMBL2064327",
          "CHEMBL2064328",
          "CHEMBL2064329",
          "CHEMBL2064330",
          "CHEMBL2064331",
          "CHEMBL2064332",
          "CHEMBL2064333",
          "CHEMBL2064334",
          "CHEMBL2064335",
          "CHEMBL2064336",
          "CHEMBL2064337",
          "CHEMBL2064338",
          "CHEMBL2064339",
          "CHEMBL2064340",
          "CHEMBL2064341",
          "CHEMBL2064342",
          "CHEMBL2064343",
          "CHEMBL2064344",
          "CHEMBL2064345",
          "CHEMBL2064346",
          "CHEMBL2064347",
          "CHEMBL2064348",
          "CHEMBL2064349",
          "CHEMBL2064350",
          "CHEMBL2064351",
          "CHEMBL2064352",
          "CHEMBL2064353",
          "CHEMBL2064354",
          "CHEMBL2064406",
          "CHEMBL2064408",
          "CHEMBL2064409",
          "CHEMBL2064410",
          "CHEMBL2064411",
          "CHEMBL2064412",
          "CHEMBL2064413",
          "CHEMBL2064414",
          "CHEMBL2064415",
          "CHEMBL2064416",
          "CHEMBL2064417",
          "CHEMBL2064418",
          "CHEMBL2064419",
          "CHEMBL2064478",
          "CHEMBL2064479",
          "CHEMBL2064480",
          "CHEMBL2064481",
          "CHEMBL2064482",
          "CHEMBL2064483",
          "CHEMBL2064484",
          "CHEMBL2064485",
          "CHEMBL2064486",
          "CHEMBL2064487",
          "CHEMBL2064488",
          "CHEMBL2064489",
          "CHEMBL2064490",
          "CHEMBL2064491",
          "CHEMBL2064492",
          "CHEMBL2064493",
          "CHEMBL2064494",
          "CHEMBL2064495",
          "CHEMBL2064496",
          "CHEMBL2064497",
          "CHEMBL2064498",
          "CHEMBL2064499",
          "CHEMBL2064500",
          "CHEMBL2064501",
          "CHEMBL2064502",
          "CHEMBL2064503",
          "CHEMBL2064504",
          "CHEMBL2064505",
          "CHEMBL2064506",
          "CHEMBL2064507",
          "CHEMBL2064508",
          "CHEMBL2064509",
          "CHEMBL2064510",
          "CHEMBL2064511",
          "CHEMBL2064512",
          "CHEMBL2064513",
          "CHEMBL2064514",
          "CHEMBL2064566",
          "CHEMBL2064567",
          "CHEMBL2064568",
          "CHEMBL2064569",
          "CHEMBL2064570",
          "CHEMBL2064571",
          "CHEMBL2064572",
          "CHEMBL2069328",
          "CHEMBL2071326",
          "CHEMBL2071327",
          "CHEMBL2071328",
          "CHEMBL2071329",
          "CHEMBL2071330",
          "CHEMBL2071331",
          "CHEMBL2071332",
          "CHEMBL2071333",
          "CHEMBL2071334",
          "CHEMBL2071335",
          "CHEMBL2071336",
          "CHEMBL2071337",
          "CHEMBL2071338",
          "CHEMBL2071339",
          "CHEMBL2071340",
          "CHEMBL2071341",
          "CHEMBL2071342",
          "CHEMBL208652",
          "CHEMBL2089096",
          "CHEMBL2089097",
          "CHEMBL2089098",
          "CHEMBL2089099",
          "CHEMBL2089100",
          "CHEMBL2089101",
          "CHEMBL2089102",
          "CHEMBL2089103",
          "CHEMBL2089104",
          "CHEMBL2089105",
          "CHEMBL2089106",
          "CHEMBL2089107",
          "CHEMBL2089108",
          "CHEMBL2089109",
          "CHEMBL2089110",
          "CHEMBL2089111",
          "CHEMBL2089112",
          "CHEMBL2089113",
          "CHEMBL2089114",
          "CHEMBL2089115",
          "CHEMBL2089116",
          "CHEMBL2089117",
          "CHEMBL2089118",
          "CHEMBL2089119",
          "CHEMBL2089120",
          "CHEMBL2151048",
          "CHEMBL2151050",
          "CHEMBL215152",
          "CHEMBL2151819",
          "CHEMBL2151820",
          "CHEMBL2151821",
          "CHEMBL2151822",
          "CHEMBL2151919",
          "CHEMBL2151920",
          "CHEMBL2151921",
          "CHEMBL2151922",
          "CHEMBL2151923",
          "CHEMBL2151924",
          "CHEMBL2151925",
          "CHEMBL2151926",
          "CHEMBL2151927",
          "CHEMBL2151928",
          "CHEMBL2151929",
          "CHEMBL2151930",
          "CHEMBL2151931",
          "CHEMBL2151932",
          "CHEMBL2151933",
          "CHEMBL2151934",
          "CHEMBL2151935",
          "CHEMBL2152124",
          "CHEMBL2152125",
          "CHEMBL2152126",
          "CHEMBL2152127",
          "CHEMBL2152128",
          "CHEMBL2152129",
          "CHEMBL2152130",
          "CHEMBL2152131",
          "CHEMBL2152132",
          "CHEMBL2152133",
          "CHEMBL2152134",
          "CHEMBL2152135",
          "CHEMBL2152136",
          "CHEMBL2152137",
          "CHEMBL2152138",
          "CHEMBL2152139",
          "CHEMBL2152140",
          "CHEMBL2152141",
          "CHEMBL2152142",
          "CHEMBL2152143",
          "CHEMBL2152144",
          "CHEMBL2152145",
          "CHEMBL2152146",
          "CHEMBL2152147",
          "CHEMBL2152148",
          "CHEMBL2152149",
          "CHEMBL2152150",
          "CHEMBL2152250",
          "CHEMBL2152251",
          "CHEMBL2152252",
          "CHEMBL2152253",
          "CHEMBL2152254",
          "CHEMBL2152255",
          "CHEMBL2152256",
          "CHEMBL2152257",
          "CHEMBL2152768",
          "CHEMBL2152769",
          "CHEMBL2152770",
          "CHEMBL2152771",
          "CHEMBL2152772",
          "CHEMBL2152773",
          "CHEMBL2152774",
          "CHEMBL2152775",
          "CHEMBL2152776",
          "CHEMBL2158436",
          "CHEMBL2165003",
          "CHEMBL2165004",
          "CHEMBL2165005",
          "CHEMBL2165006",
          "CHEMBL2165007",
          "CHEMBL2165008",
          "CHEMBL2165009",
          "CHEMBL2165010",
          "CHEMBL2165011",
          "CHEMBL2165012",
          "CHEMBL2165013",
          "CHEMBL2165014",
          "CHEMBL2165015",
          "CHEMBL2165016",
          "CHEMBL2165017",
          "CHEMBL2165018",
          "CHEMBL2165019",
          "CHEMBL2165020",
          "CHEMBL2165021",
          "CHEMBL2165022",
          "CHEMBL2165023",
          "CHEMBL2165024",
          "CHEMBL2165025",
          "CHEMBL2165026",
          "CHEMBL2165027",
          "CHEMBL2165028",
          "CHEMBL2165029",
          "CHEMBL2165030",
          "CHEMBL2165031",
          "CHEMBL2165032",
          "CHEMBL2165033",
          "CHEMBL2165034",
          "CHEMBL2165035",
          "CHEMBL2165036",
          "CHEMBL2165037",
          "CHEMBL2165038",
          "CHEMBL2165039",
          "CHEMBL2165040",
          "CHEMBL2165041",
          "CHEMBL2165042",
          "CHEMBL2165043",
          "CHEMBL2165044",
          "CHEMBL2165045",
          "CHEMBL2165046",
          "CHEMBL2165047",
          "CHEMBL2165048",
          "CHEMBL2165049",
          "CHEMBL2165050",
          "CHEMBL2165051",
          "CHEMBL2165052",
          "CHEMBL2165053",
          "CHEMBL2165189",
          "CHEMBL2165268",
          "CHEMBL2165269",
          "CHEMBL2165270",
          "CHEMBL2165271",
          "CHEMBL2165492",
          "CHEMBL2165493",
          "CHEMBL2165494",
          "CHEMBL2165495",
          "CHEMBL2165496",
          "CHEMBL2165497",
          "CHEMBL2165498",
          "CHEMBL2165499",
          "CHEMBL2165500",
          "CHEMBL2165501",
          "CHEMBL2165502",
          "CHEMBL2165503",
          "CHEMBL2165504",
          "CHEMBL2165505",
          "CHEMBL2165506",
          "CHEMBL2165507",
          "CHEMBL2165508",
          "CHEMBL2165509",
          "CHEMBL2165510",
          "CHEMBL2165511",
          "CHEMBL2165512",
          "CHEMBL2165513",
          "CHEMBL2165666",
          "CHEMBL2165667",
          "CHEMBL2165668",
          "CHEMBL2165669",
          "CHEMBL2165670",
          "CHEMBL2165671",
          "CHEMBL2165672",
          "CHEMBL2171918",
          "CHEMBL2171919",
          "CHEMBL2171920",
          "CHEMBL2171921",
          "CHEMBL2171922",
          "CHEMBL2171923",
          "CHEMBL2171924",
          "CHEMBL2171925",
          "CHEMBL2171926",
          "CHEMBL2171927",
          "CHEMBL2171928",
          "CHEMBL2171929",
          "CHEMBL2171930",
          "CHEMBL2171931",
          "CHEMBL2171932",
          "CHEMBL2171933",
          "CHEMBL2171934",
          "CHEMBL2171935",
          "CHEMBL2171936",
          "CHEMBL2171937",
          "CHEMBL2171938",
          "CHEMBL2171939",
          "CHEMBL2171940",
          "CHEMBL2171941",
          "CHEMBL2171942",
          "CHEMBL2171943",
          "CHEMBL2171944",
          "CHEMBL2171945",
          "CHEMBL2171946",
          "CHEMBL2171947",
          "CHEMBL2171948",
          "CHEMBL2171949",
          "CHEMBL2171950",
          "CHEMBL2171951",
          "CHEMBL2171952",
          "CHEMBL2205766",
          "CHEMBL2206904",
          "CHEMBL2206906",
          "CHEMBL2206913",
          "CHEMBL2206921",
          "CHEMBL2216756",
          "CHEMBL2216832",
          "CHEMBL2216833",
          "CHEMBL2216834",
          "CHEMBL2216835",
          "CHEMBL2216836",
          "CHEMBL2216837",
          "CHEMBL2216838",
          "CHEMBL2216839",
          "CHEMBL2216840",
          "CHEMBL2216841",
          "CHEMBL2216842",
          "CHEMBL2216843",
          "CHEMBL2216844",
          "CHEMBL2216845",
          "CHEMBL2216846",
          "CHEMBL2216847",
          "CHEMBL2216848",
          "CHEMBL2216849",
          "CHEMBL2216850",
          "CHEMBL2216851",
          "CHEMBL2216852",
          "CHEMBL2216853",
          "CHEMBL2216854",
          "CHEMBL2216855",
          "CHEMBL2216856",
          "CHEMBL2216857",
          "CHEMBL2216858",
          "CHEMBL2216859",
          "CHEMBL2216860",
          "CHEMBL2216861",
          "CHEMBL2216862",
          "CHEMBL2216863",
          "CHEMBL2216864",
          "CHEMBL2216865",
          "CHEMBL2216866",
          "CHEMBL2216867",
          "CHEMBL2216868",
          "CHEMBL2216869",
          "CHEMBL2216870",
          "CHEMBL2216871",
          "CHEMBL2216872",
          "CHEMBL2216873",
          "CHEMBL2216874",
          "CHEMBL2216875",
          "CHEMBL2216876",
          "CHEMBL2216877",
          "CHEMBL2216878",
          "CHEMBL2216879",
          "CHEMBL2216880",
          "CHEMBL2216881",
          "CHEMBL2216882",
          "CHEMBL2216883",
          "CHEMBL2216884",
          "CHEMBL2216885",
          "CHEMBL2216886",
          "CHEMBL2216887",
          "CHEMBL2216888",
          "CHEMBL2216889",
          "CHEMBL2216890",
          "CHEMBL2216891",
          "CHEMBL2216892",
          "CHEMBL2216893",
          "CHEMBL2216894",
          "CHEMBL2216895",
          "CHEMBL2216896",
          "CHEMBL2216897",
          "CHEMBL2216898",
          "CHEMBL2216899",
          "CHEMBL2216900",
          "CHEMBL2216901",
          "CHEMBL2216902",
          "CHEMBL2216903",
          "CHEMBL221959",
          "CHEMBL223360",
          "CHEMBL230011",
          "CHEMBL2309006",
          "CHEMBL2309609",
          "CHEMBL2316958",
          "CHEMBL2321882",
          "CHEMBL2322225",
          "CHEMBL2322226",
          "CHEMBL2322227",
          "CHEMBL2322228",
          "CHEMBL2322229",
          "CHEMBL2322230",
          "CHEMBL2322231",
          "CHEMBL2322232",
          "CHEMBL2322233",
          "CHEMBL2322234",
          "CHEMBL2322235",
          "CHEMBL2322236",
          "CHEMBL2322239",
          "CHEMBL2322240",
          "CHEMBL2322241",
          "CHEMBL2322242",
          "CHEMBL2322243",
          "CHEMBL2322244",
          "CHEMBL2322245",
          "CHEMBL2322246",
          "CHEMBL2322247",
          "CHEMBL2322331",
          "CHEMBL2322332",
          "CHEMBL2322333",
          "CHEMBL2322334",
          "CHEMBL2322335",
          "CHEMBL2322336",
          "CHEMBL2322337",
          "CHEMBL2322338",
          "CHEMBL2322339",
          "CHEMBL2322340",
          "CHEMBL2322341",
          "CHEMBL2322342",
          "CHEMBL2322343",
          "CHEMBL2322344",
          "CHEMBL2322345",
          "CHEMBL2322346",
          "CHEMBL2322347",
          "CHEMBL2322348",
          "CHEMBL2322349",
          "CHEMBL2322350",
          "CHEMBL2322351",
          "CHEMBL2322352",
          "CHEMBL2322353",
          "CHEMBL2322354",
          "CHEMBL2322355",
          "CHEMBL2322356",
          "CHEMBL2322660",
          "CHEMBL2322661",
          "CHEMBL2322662",
          "CHEMBL2322663",
          "CHEMBL2322664",
          "CHEMBL2322665",
          "CHEMBL2322666",
          "CHEMBL2322667",
          "CHEMBL2322668",
          "CHEMBL2322669",
          "CHEMBL2322670",
          "CHEMBL2322671",
          "CHEMBL2322672",
          "CHEMBL2323113",
          "CHEMBL2323114",
          "CHEMBL2323115",
          "CHEMBL2323116",
          "CHEMBL2323117",
          "CHEMBL2323118",
          "CHEMBL2323119",
          "CHEMBL2326951",
          "CHEMBL2326952",
          "CHEMBL2326953",
          "CHEMBL2326954",
          "CHEMBL2326955",
          "CHEMBL2326965",
          "CHEMBL2326967",
          "CHEMBL2326968",
          "CHEMBL2326969",
          "CHEMBL2326970",
          "CHEMBL2326971",
          "CHEMBL2331664",
          "CHEMBL2333365",
          "CHEMBL239050",
          "CHEMBL239051",
          "CHEMBL239052",
          "CHEMBL239475",
          "CHEMBL240118",
          "CHEMBL240335",
          "CHEMBL240336",
          "CHEMBL243810",
          "CHEMBL244672",
          "CHEMBL24828",
          "CHEMBL249697",
          "CHEMBL255592",
          "CHEMBL255863",
          "CHEMBL259084",
          "CHEMBL261849",
          "CHEMBL270638",
          "CHEMBL272265",
          "CHEMBL288441",
          "CHEMBL296468",
          "CHEMBL300138",
          "CHEMBL31965",
          "CHEMBL377300",
          "CHEMBL379156",
          "CHEMBL379218",
          "CHEMBL384304",
          "CHEMBL386051",
          "CHEMBL392070",
          "CHEMBL392071",
          "CHEMBL393525",
          "CHEMBL393526",
          "CHEMBL393747",
          "CHEMBL397105",
          "CHEMBL397780",
          "CHEMBL397796",
          "CHEMBL410643",
          "CHEMBL413802",
          "CHEMBL413803",
          "CHEMBL428496",
          "CHEMBL428690",
          "CHEMBL437770",
          "CHEMBL445813",
          "CHEMBL449049",
          "CHEMBL449786",
          "CHEMBL450786",
          "CHEMBL451883",
          "CHEMBL453232",
          "CHEMBL453240",
          "CHEMBL463606",
          "CHEMBL464552",
          "CHEMBL466106",
          "CHEMBL466956",
          "CHEMBL466957",
          "CHEMBL466962",
          "CHEMBL467394",
          "CHEMBL467395",
          "CHEMBL467552",
          "CHEMBL467553",
          "CHEMBL467561",
          "CHEMBL467966",
          "CHEMBL468218",
          "CHEMBL469029",
          "CHEMBL469035",
          "CHEMBL469052",
          "CHEMBL469057",
          "CHEMBL469058",
          "CHEMBL469059",
          "CHEMBL469099",
          "CHEMBL469193",
          "CHEMBL469194",
          "CHEMBL469200",
          "CHEMBL469201",
          "CHEMBL469202",
          "CHEMBL469208",
          "CHEMBL469209",
          "CHEMBL469248",
          "CHEMBL469249",
          "CHEMBL469270",
          "CHEMBL469271",
          "CHEMBL475251",
          "CHEMBL476953",
          "CHEMBL477772",
          "CHEMBL477787",
          "CHEMBL477999",
          "CHEMBL478425",
          "CHEMBL478633",
          "CHEMBL489596",
          "CHEMBL489602",
          "CHEMBL490428",
          "CHEMBL491440",
          "CHEMBL491441",
          "CHEMBL491473",
          "CHEMBL491641",
          "CHEMBL494089",
          "CHEMBL496331",
          "CHEMBL496332",
          "CHEMBL496541",
          "CHEMBL496542",
          "CHEMBL496940",
          "CHEMBL496941",
          "CHEMBL498000",
          "CHEMBL498001",
          "CHEMBL498002",
          "CHEMBL498184",
          "CHEMBL498185",
          "CHEMBL498379",
          "CHEMBL498383",
          "CHEMBL498392",
          "CHEMBL498586",
          "CHEMBL498587",
          "CHEMBL504616",
          "CHEMBL509032",
          "CHEMBL511228",
          "CHEMBL511605",
          "CHEMBL512091",
          "CHEMBL512092",
          "CHEMBL512293",
          "CHEMBL512440",
          "CHEMBL512470",
          "CHEMBL512624",
          "CHEMBL512648",
          "CHEMBL512650",
          "CHEMBL512815",
          "CHEMBL512834",
          "CHEMBL513909",
          "CHEMBL513924",
          "CHEMBL514061",
          "CHEMBL514869",
          "CHEMBL521721",
          "CHEMBL521851",
          "CHEMBL522069",
          "CHEMBL522892",
          "CHEMBL522910",
          "CHEMBL524466",
          "CHEMBL525191",
          "CHEMBL525352",
          "CHEMBL526463",
          "CHEMBL535",
          "CHEMBL551440",
          "CHEMBL553",
          "CHEMBL554",
          "CHEMBL558752",
          "CHEMBL565612",
          "CHEMBL566046",
          "CHEMBL568574",
          "CHEMBL570833",
          "CHEMBL572878",
          "CHEMBL572881",
          "CHEMBL573339",
          "CHEMBL574738",
          "CHEMBL576982",
          "CHEMBL577499",
          "CHEMBL579219",
          "CHEMBL583874",
          "CHEMBL586702",
          "CHEMBL58782",
          "CHEMBL589258",
          "CHEMBL592445",
          "CHEMBL601719",
          "CHEMBL608154",
          "CHEMBL91829",
          "CHEMBL939",
          "CHEMBL941",
          "CHEMBL98350"
        ],
        "number_of_missing_values": "0"
      },
      {
        "data_type": "numeric",
        "index": "1",
        "is_ignore": "false",
        "is_row_identifier": "false",
        "is_target": "false",
        "name": "AMW",
        "number_of_missing_values": "0"
      },
      {
        "data_type": "numeric",
        "index": "2",
        "is_ignore": "false",
        "is_row_identifier": "false",
        "is_target": "false",
        "name": "C.",
        "number_of_missing_values": "0"
      },
      {
        "data_type": "numeric",
        "index": "3",
        "is_ignore": "false",
        "is_row_identifier": "false",
        "is_target": "false",
        "name": "H.",
        "number_of_missing_values": "0"
      },
      {
        "data_type": "numeric",
        "index": "4",
        "is_ignore": "false",
        "is_row_identifier": "false",
        "is_target": "false",
        "name": "Me",
        "number_of_missing_values": "0"
      },
      {
        "data_type": "numeric",
        "index": "5",
        "is_ignore": "false",
        "is_row_identifier": "false",
        "is_target": "false",
        "name": "Mi",
        "number_of_missing_values": "0"
      },
      {
        "data_type": "numeric",
        "index": "6",
        "is_ignore": "false",
        "is_row_identifier": "false",
        "is_target": "false",
        "name": "Mp",
        "number_of_missing_values": "0"
      },
      {
        "data_type": "numeric",
        "index": "7",
        "is_ignore": "false",
        "is_row_identifier": "false",
        "is_target": "false",
        "name": "Mv",
        "number_of_missing_values": "0"
      },
      {
        "data_type": "numeric",
        "index": "8",
        "is_ignore": "false",
        "is_row_identifier": "false",
        "is_target": "false",
        "name": "MW",
        "number_of_missing_values": "0"
      },
      {
        "data_type": "numeric",
        "index": "9",
        "is_ignore": "false",
        "is_row_identifier": "false",
        "is_target": "false",
        "name": "N.",
        "number_of_missing_values": "0"
      },
      {
        "data_type": "numeric",
        "index": "10",
        "is_ignore": "false",
        "is_row_identifier": "false",
        "is_target": "false",
        "name": "nAB",
        "number_of_missing_values": "0"
      },
      {
        "data_type": "numeric",
        "index": "11",
        "is_ignore": "false",
        "is_row_identifier": "false",
        "is_target": "false",
        "name": "nAT",
        "number_of_missing_values": "0"
      },
      {
        "data_type": "numeric",
        "index": "12",
        "is_ignore": "false",
        "is_row_identifier": "false",
        "is_target": "false",
        "name": "nB",
        "number_of_missing_values": "0"
      },
      {
        "data_type": "numeric",
        "index": "13",
        "is_ignore": "false",
        "is_row_identifier": "false",
        "is_target": "false",
        "name": "nBM",
        "number_of_missing_values": "0"
      },
      {
        "data_type": "numeric",
        "index": "14",
        "is_ignore": "false",
        "is_row_identifier": "false",
        "is_target": "false",
        "name": "nBO",
        "number_of_missing_values": "0"
      },
      {
        "data_type": "numeric",
        "index": "15",
        "is_ignore": "false",
        "is_row_identifier": "false",
        "is_target": "false",
        "name": "nBR",
        "number_of_missing_values": "0"
      },
      {
        "data_type": "numeric",
        "index": "16",
        "is_ignore": "false",
        "is_row_identifier": "false",
        "is_target": "false",
        "name": "nBT",
        "number_of_missing_values": "0"
      },
      {
        "data_type": "numeric",
        "index": "17",
        "is_ignore": "false",
        "is_row_identifier": "false",
        "is_target": "false",
        "name": "nC",
        "number_of_missing_values": "0"
      },
      {
        "data_type": "numeric",
        "index": "18",
        "is_ignore": "false",
        "is_row_identifier": "false",
        "is_target": "false",
        "name": "nCL",
        "number_of_missing_values": "0"
      },
      {
        "data_type": "numeric",
        "index": "19",
        "is_ignore": "false",
        "is_row_identifier": "false",
        "is_target": "false",
        "name": "nCsp",
        "number_of_missing_values": "0"
      },
      {
        "data_type": "numeric",
        "index": "20",
        "is_ignore": "false",
        "is_row_identifier": "false",
        "is_target": "false",
        "name": "nCsp2",
        "number_of_missing_values": "0"
      },
      {
        "data_type": "numeric",
        "index": "21",
        "is_ignore": "false",
        "is_row_identifier": "false",
        "is_target": "false",
        "name": "nCsp3",
        "number_of_missing_values": "0"
      },
      {
        "data_type": "numeric",
        "index": "22",
        "is_ignore": "false",
        "is_row_identifier": "false",
        "is_target": "false",
        "name": "nDB",
        "number_of_missing_values": "0"
      },
      {
        "data_type": "numeric",
        "index": "23",
        "is_ignore": "false",
        "is_row_identifier": "false",
        "is_target": "false",
        "name": "nF",
        "number_of_missing_values": "0"
      },
      {
        "data_type": "numeric",
        "index": "24",
        "is_ignore": "false",
        "is_row_identifier": "false",
        "is_target": "false",
        "name": "nH",
        "number_of_missing_values": "0"
      },
      {
        "data_type": "numeric",
        "index": "25",
        "is_ignore": "false",
        "is_row_identifier": "false",
        "is_target": "false",
        "name": "nHet",
        "number_of_missing_values": "0"
      },
      {
        "data_type": "numeric",
        "index": "26",
        "is_ignore": "false",
        "is_row_identifier": "false",
        "is_target": "false",
        "name": "nHM",
        "number_of_missing_values": "0"
      },
      {
        "data_type": "numeric",
        "index": "27",
        "is_ignore": "false",
        "is_row_identifier": "false",
        "is_target": "false",
        "name": "nI",
        "number_of_missing_values": "0"
      },
      {
        "data_type": "numeric",
        "index": "28",
        "is_ignore": "false",
        "is_row_identifier": "false",
        "is_target": "false",
        "name": "nN",
        "number_of_missing_values": "0"
      },
      {
        "data_type": "numeric",
        "index": "29",
        "is_ignore": "false",
        "is_row_identifier": "false",
        "is_target": "false",
        "name": "nO",
        "number_of_missing_values": "0"
      },
      {
        "data_type": "numeric",
        "index": "30",
        "is_ignore": "false",
        "is_row_identifier": "false",
        "is_target": "false",
        "name": "nP",
        "number_of_missing_values": "0"
      },
      {
        "data_type": "numeric",
        "index": "31",
        "is_ignore": "false",
        "is_row_identifier": "false",
        "is_target": "false",
        "name": "nS",
        "number_of_missing_values": "0"
      },
      {
        "data_type": "numeric",
        "index": "32",
        "is_ignore": "false",
        "is_row_identifier": "false",
        "is_target": "false",
        "name": "nSK",
        "number_of_missing_values": "0"
      },
      {
        "data_type": "numeric",
        "index": "33",
        "is_ignore": "false",
        "is_row_identifier": "false",
        "is_target": "false",
        "name": "nTB",
        "number_of_missing_values": "0"
      },
      {
        "data_type": "numeric",
        "index": "34",
        "is_ignore": "false",
        "is_row_identifier": "false",
        "is_target": "false",
        "name": "nX",
        "number_of_missing_values": "0"
      },
      {
        "data_type": "numeric",
        "index": "35",
        "is_ignore": "false",
        "is_row_identifier": "false",
        "is_target": "false",
        "name": "O.",
        "number_of_missing_values": "0"
      },
      {
        "data_type": "numeric",
        "index": "36",
        "is_ignore": "false",
        "is_row_identifier": "false",
        "is_target": "false",
        "name": "RBF",
        "number_of_missing_values": "0"
      },
      {
        "data_type": "numeric",
        "index": "37",
        "is_ignore": "false",
        "is_row_identifier": "false",
        "is_target": "false",
        "name": "RBN",
        "number_of_missing_values": "0"
      },
      {
        "data_type": "numeric",
        "index": "38",
        "is_ignore": "false",
        "is_row_identifier": "false",
        "is_target": "false",
        "name": "SCBO",
        "number_of_missing_values": "0"
      },
      {
        "data_type": "numeric",
        "index": "39",
        "is_ignore": "false",
        "is_row_identifier": "false",
        "is_target": "false",
        "name": "Se",
        "number_of_missing_values": "0"
      },
      {
        "data_type": "numeric",
        "index": "40",
        "is_ignore": "false",
        "is_row_identifier": "false",
        "is_target": "false",
        "name": "Si",
        "number_of_missing_values": "0"
      },
      {
        "data_type": "numeric",
        "index": "41",
        "is_ignore": "false",
        "is_row_identifier": "false",
        "is_target": "false",
        "name": "Sp",
        "number_of_missing_values": "0"
      },
      {
        "data_type": "numeric",
        "index": "42",
        "is_ignore": "false",
        "is_row_identifier": "false",
        "is_target": "false",
        "name": "Sv",
        "number_of_missing_values": "0"
      },
      {
        "data_type": "numeric",
        "index": "43",
        "is_ignore": "false",
        "is_row_identifier": "false",
        "is_target": "false",
        "name": "X.",
        "number_of_missing_values": "0"
      },
      {
        "data_type": "numeric",
        "index": "44",
        "is_ignore": "false",
        "is_row_identifier": "false",
        "is_target": "true",
        "name": "pXC50",
        "number_of_missing_values": "0"
      }
    ]
  }
}