"molecule_id","FCFP4_1024b1","FCFP4_1024b10","FCFP4_1024b100","FCFP4_1024b1000","FCFP4_1024b1001","FCFP4_1024b1002","FCFP4_1024b1003","FCFP4_1024b1004","FCFP4_1024b1005","FCFP4_1024b1006","FCFP4_1024b1007","FCFP4_1024b1008","FCFP4_1024b1009","FCFP4_1024b101","FCFP4_1024b1010","FCFP4_1024b1011","FCFP4_1024b1012","FCFP4_1024b1013","FCFP4_1024b1014","FCFP4_1024b1015","FCFP4_1024b1016","FCFP4_1024b1017","FCFP4_1024b1018","FCFP4_1024b1019","FCFP4_1024b102","FCFP4_1024b1020","FCFP4_1024b1021","FCFP4_1024b1022","FCFP4_1024b1023","FCFP4_1024b1024","FCFP4_1024b103","FCFP4_1024b104","FCFP4_1024b105","FCFP4_1024b106","FCFP4_1024b107","FCFP4_1024b108","FCFP4_1024b109","FCFP4_1024b11","FCFP4_1024b110","FCFP4_1024b111","FCFP4_1024b112","FCFP4_1024b113","FCFP4_1024b114","FCFP4_1024b115","FCFP4_1024b116","FCFP4_1024b117","FCFP4_1024b118","FCFP4_1024b119","FCFP4_1024b12","FCFP4_1024b120","FCFP4_1024b121","pXC50"
{1 1,35 1,36 1,38 1,52 4.983}
{0 CHEMBL1083461,1 1,25 1,35 1,36 1,38 1,52 5.161}
{0 CHEMBL1083476,1 1,35 1,36 1,38 1,50 1,52 5.432}
{0 CHEMBL1083762,1 1,2 1,25 1,35 1,36 1,38 1,52 5.456}
{0 CHEMBL1083778,1 1,5 1,36 1,38 1,47 1,50 1,52 4.323}
{0 CHEMBL1084083,1 1,2 1,5 1,36 1,38 1,47 1,50 1,52 4.31}
{0 CHEMBL1084084,1 1,2 1,5 1,36 1,38 1,47 1,50 1,52 4.292}
{0 CHEMBL1084087,1 1,25 1,35 1,36 1,38 1,52 5.337}
{0 CHEMBL1084626,1 1,35 1,36 1,38 1,52 4}
{0 CHEMBL1084861,1 1,2 1,35 1,36 1,38 1,52 5.137}
{0 CHEMBL1084862,1 1,25 1,35 1,36 1,38 1,52 5.125}
{0 CHEMBL1085359,1 1,35 1,36 1,38 1,50 1,52 5.523}
{0 CHEMBL1085360,1 1,2 1,35 1,36 1,38 1,50 1,52 4.886}
{0 CHEMBL1085377,1 1,25 1,35 1,36 1,38 1,49 1,52 5.174}
{0 CHEMBL1085622,1 1,25 1,35 1,36 1,38 1,50 1,52 4.506}
{0 CHEMBL1085623,1 1,25 1,35 1,36 1,38 1,52 4}
{0 CHEMBL251209,1 1,35 1,38 1,52 5.398}
{0 CHEMBL400462,1 1,35 1,38 1,52 5.721}
{0 CHEMBL572948,1 1,35 1,36 1,38 1,52 5.229}
{0 CHEMBL575329,1 1,35 1,36 1,38 1,52 5.456}
{0 CHEMBL575963,1 1,35 1,36 1,38 1,52 5.174}
