{
  "data_set_description": {
    "collection_date": "November 2013",
    "creator": "Dr Jeremy Besnard, Dr Ivan Olier, Dr Noureddin Sadawi, Dr Larisa Soldatova, Dr Crina Grosan, Prof Ross King, Dr Richard Bickerton, Prof Andrew Hopkins and Dr Willem van Hoorn",
    "default_target_attribute": "pXC50",
    "description": "This dataset contains QSAR data (from ChEMBL version 17) showing activity values (unit is pseudo-pCI50) of several compounds on drug target ChEMBL_ID: CHEMBL2125 (TID: 10948), and it has 26 rows and 43 features (not including molecule IDs and class feature: molecule_id and pXC50). The features represent Basic Molecular Descriptors which were generated from SMILES strings.  Missing value imputation was applied to this dataset (By choosing the Median).",
    "description_version": "1",
    "file_id": "3580727",
    "format": "ARFF",
    "id": "36167",
    "licence": "Public",
    "md5_checksum": "fcd0c5d7c8073bdcde4be26d914a97eb",
    "minio_url": "https://data.openml.org/datasets/0003/36167/dataset_36167.pq",
    "name": "QSAR-DATASET-FOR-DRUG-TARGET-CHEMBL2125",
    "original_data_url": "https://www.ebi.ac.uk/chembl/target/inspect/CHEMBL2125",
    "parquet_url": "https://data.openml.org/datasets/0003/36167/dataset_36167.pq",
    "processing_date": "2018-10-04 04:42:47",
    "row_id_attribute": "molecule_id",
    "status": "deactivated",
    "tag": [
      "MetaQSAR",
      "study_13"
    ],
    "upload_date": "2016-07-15T20:16:50",
    "url": "https://api.openml.org/data/v1/download/3580727/QSAR-DATASET-FOR-DRUG-TARGET-CHEMBL2125.arff",
    "version": "11",
    "visibility": "public"
  }
}