"molecule_id","AMW","C.","H.","Me","Mi","Mp","Mv","MW","N.","nAB","nAT","nB","nBM","nBO","nBR","nBT","nC","nCL","nCsp","nCsp2","nCsp3","nDB","nF","nH","nHet","nHM","nI","nN","nO","nP","nS","nSK","nTB","nX","O.","RBF","RBN","SCBO","Se","Si","Sp","Sv","X.","pXC50"
{1 8.269,2 48,3 38,4 1.014,5 1.113,6 0.699,7 0.683,8 413.46,9 6,10 22,11 50,13 26,14 34,16 53,17 24,20 22,21 2,22 4,24 19,25 7,28 3,29 4,32 31,35 8,36 0.094,37 5,38 49,39 50.683,40 55.654,41 34.926,42 34.138,44 4.167}
{0 CHEMBL469586,1 10.483,2 47.6,3 33.3,4 1.027,5 1.111,6 0.732,7 0.717,8 440.27,9 7.1,10 18,11 42,13 22,14 30,15 1,16 44,17 20,20 20,22 4,24 14,25 8,26 1,28 3,29 4,32 28,34 1,35 9.5,36 0.114,37 5,38 43,39 43.145,40 46.665,41 30.756,42 30.109,43 2.4,44 4.004}
{0 CHEMBL471230,1 8.433,2 43.3,3 40,4 1.016,5 1.124,6 0.689,7 0.668,8 506,9 8.3,10 23,11 60,13 24,14 40,16 64,17 26,18 1,20 20,21 6,22 1,24 24,25 10,26 1,28 5,29 4,32 36,34 1,35 6.7,36 0.109,37 7,38 52.5,39 60.978,40 67.425,41 41.318,42 40.062,43 1.7,44 4.013}
{0 CHEMBL475956,1 7.009,2 40,3 48.6,4 1,5 1.129,6 0.647,7 0.612,8 490.66,9 5.7,10 18,11 70,13 20,14 38,16 72,17 28,20 20,21 8,22 2,24 34,25 8,28 4,29 4,32 36,35 5.7,36 0.167,37 12,38 49,39 69.97,40 79.059,41 45.262,42 42.847,44 4.155}
{0 CHEMBL475957,1 10.696,2 42.2,3 31.1,4 1.046,5 1.119,6 0.738,7 0.726,8 481.34,9 8.9,10 18,11 45,13 23,14 33,16 47,17 19,18 2,20 19,22 5,24 14,25 12,26 3,28 4,29 5,31 1,32 31,34 2,35 11.1,36 0.128,37 6,38 47,39 47.069,40 50.339,41 33.227,42 32.663,43 4.4,44 5}
{0 CHEMBL475967,1 9.172,2 44.9,3 32.7,4 1.04,5 1.13,6 0.69,7 0.698,8 449.43,9 10.2,10 16,11 49,13 23,14 36,16 52,17 22,20 21,21 1,22 7,23 1,24 16,25 11,28 5,29 5,32 33,34 1,35 10.2,36 0.115,37 6,38 51,39 50.96,40 55.369,41 33.807,42 34.225,43 2,44 4.256}
{0 CHEMBL476164,1 10.691,2 41.5,3 31.7,4 1.04,5 1.122,6 0.745,7 0.725,8 438.32,9 12.2,10 18,11 41,13 21,14 30,16 43,17 17,18 2,20 17,22 3,24 13,25 11,26 3,28 5,29 3,31 1,32 28,34 2,35 7.3,36 0.116,37 5,38 42,39 42.633,40 46.004,41 30.563,42 29.728,43 4.9,44 4.111}
{0 CHEMBL476165,1 8.905,2 44.8,3 34.5,4 1.036,5 1.121,6 0.685,7 0.69,8 258.25,9 6.9,10 12,11 29,13 15,14 20,16 30,17 13,20 13,22 3,24 10,25 6,28 2,29 4,32 19,35 13.8,36 0.1,37 3,38 29,39 30.047,40 32.495,41 19.875,42 20.009,44 4.648}
{0 CHEMBL476166,1 8.977,2 51.6,3 32.3,4 1.023,5 1.106,6 0.723,7 0.719,8 278.28,9 6.5,10 12,11 31,13 17,14 22,16 32,17 16,19 1,20 15,22 4,24 10,25 5,28 2,29 3,32 21,33 1,35 9.7,36 0.125,37 4,38 34,39 31.72,40 34.286,41 22.421,42 22.294,44 4.292}
{0 CHEMBL476429,1 11.817,2 50,3 27.5,4 1.04,5 1.105,6 0.771,7 0.76,8 472.69,9 7.5,10 22,11 40,13 25,14 32,15 1,16 43,17 20,18 1,20 20,22 3,24 11,25 9,26 2,28 3,29 4,32 29,34 2,35 10,36 0.093,37 4,38 46,39 41.585,40 44.194,41 30.852,42 30.41,43 5,44 4.209}
{0 CHEMBL476430,1 8.382,2 49.2,3 37.3,4 1.017,5 1.109,6 0.701,7 0.688,8 494.53,9 3.4,10 24,11 59,13 26,14 42,16 64,17 29,20 26,21 3,22 2,24 22,25 8,28 2,29 6,32 37,35 10.2,36 0.094,37 6,38 56,39 60.003,40 65.405,41 41.352,42 40.6,44 4.182}
{0 CHEMBL476794,1 8.93,2 48,3 36,4 1.02,5 1.106,6 0.72,7 0.7,8 446.51,9 4,10 17,11 50,13 23,14 35,16 53,17 24,20 22,21 2,22 6,24 18,25 8,26 1,28 2,29 5,31 1,32 32,35 10,36 0.113,37 6,38 49.5,39 50.985,40 55.285,41 36.023,42 35.018,44 4.066}
{0 CHEMBL511135,1 8.027,2 46.6,3 39.7,4 1.008,5 1.118,6 0.694,7 0.672,8 465.55,9 8.6,10 24,11 58,13 27,14 38,16 61,17 27,20 27,22 3,24 23,25 8,28 5,29 3,32 35,35 5.2,36 0.098,37 6,38 53,39 58.443,40 64.857,41 40.245,42 38.993,44 4.102}
{0 CHEMBL513414,1 8.659,2 47.5,3 35,4 1.02,5 1.117,6 0.705,7 0.697,8 346.37,9 10,10 18,11 40,13 22,14 28,16 42,17 19,20 19,22 4,24 14,25 7,28 4,29 3,32 26,35 7.5,36 0.119,37 5,38 41,39 40.807,40 44.697,41 28.193,42 27.864,44 4.119}
{0 CHEMBL514827,1 9.508,2 46.9,3 32.7,4 1.036,5 1.114,6 0.713,7 0.712,8 465.87,9 6.1,10 22,11 49,13 27,14 36,16 52,17 23,18 1,20 20,21 3,22 5,24 16,25 10,26 1,28 3,29 6,32 33,34 1,35 12.2,36 0.115,37 6,38 52,39 50.778,40 54.602,41 34.932,42 34.868,43 2,44 4.076}
{0 CHEMBL515932,1 8.792,2 38.2,3 38.2,4 1.029,5 1.134,6 0.678,7 0.665,8 483.56,9 12.7,10 18,11 55,13 21,14 37,16 58,17 21,20 16,21 5,22 3,24 21,25 13,26 1,28 7,29 5,31 1,32 34,35 9.1,36 0.138,37 8,38 49,39 56.611,40 62.362,41 37.29,42 36.598,44 4.106}
