{
  "data_set_description": {
    "collection_date": "November 2013",
    "creator": "Dr Jeremy Besnard, Dr Ivan Olier, Dr Noureddin Sadawi, Dr Larisa Soldatova, Dr Crina Grosan, Prof Ross King, Dr Richard Bickerton, Prof Andrew Hopkins and Dr Willem van Hoorn",
    "default_target_attribute": "pXC50",
    "description": "This dataset contains QSAR data (from ChEMBL version 17) showing activity values (unit is pseudo-pCI50) of several compounds on drug target ChEMBL_ID: CHEMBL4334 (TID: 11717), and it has 29 rows and 43 features (not including molecule IDs and class feature: molecule_id and pXC50). The features represent Basic Molecular Descriptors which were generated from SMILES strings.  Missing value imputation was applied to this dataset (By choosing the Median).",
    "description_version": "1",
    "file_id": "3578961",
    "format": "ARFF",
    "id": "36123",
    "licence": "Public",
    "md5_checksum": "d3c5837206832102e258a1fe211fd456",
    "minio_url": "https://data.openml.org/datasets/0003/36123/dataset_36123.pq",
    "name": "QSAR-DATASET-FOR-DRUG-TARGET-CHEMBL4334",
    "original_data_url": "https://www.ebi.ac.uk/chembl/target/inspect/CHEMBL4334",
    "parquet_url": "https://data.openml.org/datasets/0003/36123/dataset_36123.pq",
    "processing_date": "2018-10-04 04:42:26",
    "row_id_attribute": "molecule_id",
    "status": "deactivated",
    "tag": [
      "MetaQSAR",
      "study_13"
    ],
    "upload_date": "2016-07-15T20:07:11",
    "url": "https://api.openml.org/data/v1/download/3578961/QSAR-DATASET-FOR-DRUG-TARGET-CHEMBL4334.arff",
    "version": "10",
    "visibility": "public"
  }
}