{
  "data_features": {
    "feature": [
      {
        "data_type": "nominal",
        "index": "0",
        "is_ignore": "false",
        "is_row_identifier": "true",
        "is_target": "false",
        "name": "molecule_id",
        "nominal_value": [
          "CHEMBL10047",
          "CHEMBL104116",
          "CHEMBL1090247",
          "CHEMBL1092275",
          "CHEMBL1092276",
          "CHEMBL1092277",
          "CHEMBL1093560",
          "CHEMBL1093561",
          "CHEMBL1093684",
          "CHEMBL1093868",
          "CHEMBL1093869",
          "CHEMBL1093901",
          "CHEMBL1093902",
          "CHEMBL1093987",
          "CHEMBL1161889",
          "CHEMBL1234887",
          "CHEMBL1234888",
          "CHEMBL1234889",
          "CHEMBL1253501",
          "CHEMBL1253502",
          "CHEMBL1257181",
          "CHEMBL1257182",
          "CHEMBL1257298",
          "CHEMBL1257414",
          "CHEMBL1257415",
          "CHEMBL1257527",
          "CHEMBL1257528",
          "CHEMBL1257645",
          "CHEMBL1257646",
          "CHEMBL1257768",
          "CHEMBL1258461",
          "CHEMBL1258570",
          "CHEMBL1258571",
          "CHEMBL1258681",
          "CHEMBL1258795",
          "CHEMBL1258796",
          "CHEMBL1258914",
          "CHEMBL1258915",
          "CHEMBL1269125",
          "CHEMBL1269126",
          "CHEMBL1269127",
          "CHEMBL1270621",
          "CHEMBL1270718",
          "CHEMBL1270719",
          "CHEMBL128772",
          "CHEMBL138082",
          "CHEMBL153572",
          "CHEMBL16117",
          "CHEMBL1645348",
          "CHEMBL1645349",
          "CHEMBL1645350",
          "CHEMBL1645351",
          "CHEMBL1645352",
          "CHEMBL164770",
          "CHEMBL165828",
          "CHEMBL1672288",
          "CHEMBL1672539",
          "CHEMBL174216",
          "CHEMBL174218",
          "CHEMBL174382",
          "CHEMBL174588",
          "CHEMBL175377",
          "CHEMBL175463",
          "CHEMBL175643",
          "CHEMBL175699",
          "CHEMBL176068",
          "CHEMBL176279",
          "CHEMBL177043",
          "CHEMBL1771388",
          "CHEMBL177519",
          "CHEMBL177585",
          "CHEMBL177586",
          "CHEMBL177736",
          "CHEMBL177962",
          "CHEMBL1783858",
          "CHEMBL1783859",
          "CHEMBL1783860",
          "CHEMBL1783861",
          "CHEMBL1783862",
          "CHEMBL1783863",
          "CHEMBL1783864",
          "CHEMBL1783865",
          "CHEMBL1783866",
          "CHEMBL1783867",
          "CHEMBL1783868",
          "CHEMBL1783869",
          "CHEMBL1783870",
          "CHEMBL1783871",
          "CHEMBL1783872",
          "CHEMBL1783873",
          "CHEMBL1783874",
          "CHEMBL1783875",
          "CHEMBL1783876",
          "CHEMBL1783985",
          "CHEMBL1784048",
          "CHEMBL1784049",
          "CHEMBL1784050",
          "CHEMBL1784051",
          "CHEMBL1784052",
          "CHEMBL1784053",
          "CHEMBL1784054",
          "CHEMBL1784055",
          "CHEMBL1784056",
          "CHEMBL1784057",
          "CHEMBL1784058",
          "CHEMBL1784059",
          "CHEMBL1784060",
          "CHEMBL1784061",
          "CHEMBL1784062",
          "CHEMBL1784063",
          "CHEMBL1784064",
          "CHEMBL1784065",
          "CHEMBL1784066",
          "CHEMBL1784067",
          "CHEMBL1784068",
          "CHEMBL1784069",
          "CHEMBL1784070",
          "CHEMBL1784071",
          "CHEMBL1784072",
          "CHEMBL1784073",
          "CHEMBL1784074",
          "CHEMBL1784075",
          "CHEMBL1784076",
          "CHEMBL1784077",
          "CHEMBL1784078",
          "CHEMBL1784079",
          "CHEMBL1784080",
          "CHEMBL1784081",
          "CHEMBL178592",
          "CHEMBL178690",
          "CHEMBL178741",
          "CHEMBL178742",
          "CHEMBL1830698",
          "CHEMBL1830707",
          "CHEMBL1830711",
          "CHEMBL1951658",
          "CHEMBL1951659",
          "CHEMBL1951660",
          "CHEMBL1951661",
          "CHEMBL1951662",
          "CHEMBL1951663",
          "CHEMBL1951664",
          "CHEMBL1951665",
          "CHEMBL1951666",
          "CHEMBL1951667",
          "CHEMBL1951668",
          "CHEMBL1951669",
          "CHEMBL1951670",
          "CHEMBL1951671",
          "CHEMBL1951672",
          "CHEMBL1951673",
          "CHEMBL1951674",
          "CHEMBL1951675",
          "CHEMBL1951676",
          "CHEMBL1951677",
          "CHEMBL1951678",
          "CHEMBL1951679",
          "CHEMBL1951680",
          "CHEMBL1951681",
          "CHEMBL1951682",
          "CHEMBL1951683",
          "CHEMBL1951684",
          "CHEMBL1951685",
          "CHEMBL1951686",
          "CHEMBL1951687",
          "CHEMBL1951688",
          "CHEMBL1951689",
          "CHEMBL1951690",
          "CHEMBL1951872",
          "CHEMBL1951873",
          "CHEMBL1951874",
          "CHEMBL1951875",
          "CHEMBL1951876",
          "CHEMBL1951877",
          "CHEMBL1951878",
          "CHEMBL1951879",
          "CHEMBL1951880",
          "CHEMBL1951881",
          "CHEMBL1951882",
          "CHEMBL1951883",
          "CHEMBL1951884",
          "CHEMBL1951885",
          "CHEMBL1951886",
          "CHEMBL1951887",
          "CHEMBL1951888",
          "CHEMBL1951889",
          "CHEMBL1951890",
          "CHEMBL2011870",
          "CHEMBL2011871",
          "CHEMBL2011872",
          "CHEMBL2011873",
          "CHEMBL2011874",
          "CHEMBL2011875",
          "CHEMBL2011876",
          "CHEMBL2011877",
          "CHEMBL2011878",
          "CHEMBL2011879",
          "CHEMBL2011880",
          "CHEMBL2021372",
          "CHEMBL2063423",
          "CHEMBL2111943",
          "CHEMBL2111944",
          "CHEMBL2111945",
          "CHEMBL2112048",
          "CHEMBL2112963",
          "CHEMBL2112964",
          "CHEMBL2112965",
          "CHEMBL2112966",
          "CHEMBL2112967",
          "CHEMBL2114116",
          "CHEMBL2115152",
          "CHEMBL212018",
          "CHEMBL213102",
          "CHEMBL2151817",
          "CHEMBL2203308",
          "CHEMBL2204334",
          "CHEMBL2205363",
          "CHEMBL2205364",
          "CHEMBL2205365",
          "CHEMBL2205366",
          "CHEMBL2205367",
          "CHEMBL2205368",
          "CHEMBL2205369",
          "CHEMBL2205370",
          "CHEMBL2205371",
          "CHEMBL2205372",
          "CHEMBL2205373",
          "CHEMBL2205374",
          "CHEMBL2205375",
          "CHEMBL2205376",
          "CHEMBL2205377",
          "CHEMBL2205378",
          "CHEMBL2205908",
          "CHEMBL2205909",
          "CHEMBL2205910",
          "CHEMBL2205911",
          "CHEMBL2205912",
          "CHEMBL2205913",
          "CHEMBL2205914",
          "CHEMBL2205915",
          "CHEMBL2205916",
          "CHEMBL2205917",
          "CHEMBL2205918",
          "CHEMBL2205919",
          "CHEMBL2205920",
          "CHEMBL2205921",
          "CHEMBL2205922",
          "CHEMBL2205923",
          "CHEMBL2205924",
          "CHEMBL2205925",
          "CHEMBL2205926",
          "CHEMBL2205927",
          "CHEMBL2205928",
          "CHEMBL2205929",
          "CHEMBL2205930",
          "CHEMBL223399",
          "CHEMBL223496",
          "CHEMBL223543",
          "CHEMBL223819",
          "CHEMBL223868",
          "CHEMBL223869",
          "CHEMBL224084",
          "CHEMBL224088",
          "CHEMBL224135",
          "CHEMBL224200",
          "CHEMBL224315",
          "CHEMBL224322",
          "CHEMBL224356",
          "CHEMBL224375",
          "CHEMBL224377",
          "CHEMBL224615",
          "CHEMBL224617",
          "CHEMBL224672",
          "CHEMBL224673",
          "CHEMBL224798",
          "CHEMBL224898",
          "CHEMBL225032",
          "CHEMBL225124",
          "CHEMBL225125",
          "CHEMBL225126",
          "CHEMBL225201",
          "CHEMBL225438",
          "CHEMBL225439",
          "CHEMBL225589",
          "CHEMBL225590",
          "CHEMBL229429",
          "CHEMBL230951",
          "CHEMBL231157",
          "CHEMBL2334972",
          "CHEMBL2334973",
          "CHEMBL2334974",
          "CHEMBL2334975",
          "CHEMBL2334976",
          "CHEMBL2334977",
          "CHEMBL2334978",
          "CHEMBL2334979",
          "CHEMBL2334980",
          "CHEMBL2334981",
          "CHEMBL2334982",
          "CHEMBL2334983",
          "CHEMBL2334984",
          "CHEMBL2334985",
          "CHEMBL2334986",
          "CHEMBL2334987",
          "CHEMBL2334988",
          "CHEMBL2334989",
          "CHEMBL235767",
          "CHEMBL235975",
          "CHEMBL235977",
          "CHEMBL236177",
          "CHEMBL236178",
          "CHEMBL236180",
          "CHEMBL236994",
          "CHEMBL238077",
          "CHEMBL238079",
          "CHEMBL238090",
          "CHEMBL238262",
          "CHEMBL238263",
          "CHEMBL239800",
          "CHEMBL241327",
          "CHEMBL241547",
          "CHEMBL245990",
          "CHEMBL245991",
          "CHEMBL246609",
          "CHEMBL246610",
          "CHEMBL246611",
          "CHEMBL246839",
          "CHEMBL246840",
          "CHEMBL247216",
          "CHEMBL247438",
          "CHEMBL248052",
          "CHEMBL248208",
          "CHEMBL248209",
          "CHEMBL248210",
          "CHEMBL248233",
          "CHEMBL254372",
          "CHEMBL254573",
          "CHEMBL254575",
          "CHEMBL254777",
          "CHEMBL257626",
          "CHEMBL268472",
          "CHEMBL268762",
          "CHEMBL273291",
          "CHEMBL275079",
          "CHEMBL279956",
          "CHEMBL280563",
          "CHEMBL284895",
          "CHEMBL285043",
          "CHEMBL288635",
          "CHEMBL292065",
          "CHEMBL296054",
          "CHEMBL299683",
          "CHEMBL30285",
          "CHEMBL305406",
          "CHEMBL313124",
          "CHEMBL313938",
          "CHEMBL315591",
          "CHEMBL315663",
          "CHEMBL319279",
          "CHEMBL319732",
          "CHEMBL327783",
          "CHEMBL328984",
          "CHEMBL329905",
          "CHEMBL329920",
          "CHEMBL330097",
          "CHEMBL334160",
          "CHEMBL34453",
          "CHEMBL353547",
          "CHEMBL360728",
          "CHEMBL366448",
          "CHEMBL367227",
          "CHEMBL369459",
          "CHEMBL374135",
          "CHEMBL374167",
          "CHEMBL374180",
          "CHEMBL374815",
          "CHEMBL375439",
          "CHEMBL376372",
          "CHEMBL38499",
          "CHEMBL385336",
          "CHEMBL385776",
          "CHEMBL386408",
          "CHEMBL386565",
          "CHEMBL386935",
          "CHEMBL387687",
          "CHEMBL387976",
          "CHEMBL388087",
          "CHEMBL388827",
          "CHEMBL389555",
          "CHEMBL389655",
          "CHEMBL389870",
          "CHEMBL389897",
          "CHEMBL389918",
          "CHEMBL390391",
          "CHEMBL39215",
          "CHEMBL392164",
          "CHEMBL39221",
          "CHEMBL393705",
          "CHEMBL39372",
          "CHEMBL393922",
          "CHEMBL393923",
          "CHEMBL394914",
          "CHEMBL398944",
          "CHEMBL399127",
          "CHEMBL399128",
          "CHEMBL399309",
          "CHEMBL399460",
          "CHEMBL400110",
          "CHEMBL400307",
          "CHEMBL40086",
          "CHEMBL401721",
          "CHEMBL41221",
          "CHEMBL420262",
          "CHEMBL426018",
          "CHEMBL426190",
          "CHEMBL428909",
          "CHEMBL429635",
          "CHEMBL432038",
          "CHEMBL434064",
          "CHEMBL43412",
          "CHEMBL439775",
          "CHEMBL441844",
          "CHEMBL442347",
          "CHEMBL443753",
          "CHEMBL444589",
          "CHEMBL452618",
          "CHEMBL453249",
          "CHEMBL456196",
          "CHEMBL456823",
          "CHEMBL457026",
          "CHEMBL457872",
          "CHEMBL457873",
          "CHEMBL460391",
          "CHEMBL460827",
          "CHEMBL461033",
          "CHEMBL461034",
          "CHEMBL461035",
          "CHEMBL461673",
          "CHEMBL467234",
          "CHEMBL469382",
          "CHEMBL496882",
          "CHEMBL497917",
          "CHEMBL502882",
          "CHEMBL505105",
          "CHEMBL511352",
          "CHEMBL511355",
          "CHEMBL556070",
          "CHEMBL565934",
          "CHEMBL565943",
          "CHEMBL565948",
          "CHEMBL565972",
          "CHEMBL566374",
          "CHEMBL566581",
          "CHEMBL567584",
          "CHEMBL567667",
          "CHEMBL567668",
          "CHEMBL567673",
          "CHEMBL568241",
          "CHEMBL568317",
          "CHEMBL568321",
          "CHEMBL568443",
          "CHEMBL568449",
          "CHEMBL568450",
          "CHEMBL568451",
          "CHEMBL568648",
          "CHEMBL568991",
          "CHEMBL569270",
          "CHEMBL571687",
          "CHEMBL572135",
          "CHEMBL572144",
          "CHEMBL572145",
          "CHEMBL572198",
          "CHEMBL575060",
          "CHEMBL576043",
          "CHEMBL576121",
          "CHEMBL576231",
          "CHEMBL576434",
          "CHEMBL576637",
          "CHEMBL577035",
          "CHEMBL577505",
          "CHEMBL577729",
          "CHEMBL577833",
          "CHEMBL577943",
          "CHEMBL578565",
          "CHEMBL578580",
          "CHEMBL578995",
          "CHEMBL579011",
          "CHEMBL579062",
          "CHEMBL579213",
          "CHEMBL579225",
          "CHEMBL58247",
          "CHEMBL583590",
          "CHEMBL584066",
          "CHEMBL584478",
          "CHEMBL584610",
          "CHEMBL593590",
          "CHEMBL607689",
          "CHEMBL66654",
          "CHEMBL76232",
          "CHEMBL8759",
          "CHEMBL88184",
          "CHEMBL8839",
          "CHEMBL88553",
          "CHEMBL88612",
          "CHEMBL88999",
          "CHEMBL89000",
          "CHEMBL89293",
          "CHEMBL90501",
          "CHEMBL92118",
          "CHEMBL92162",
          "CHEMBL94631",
          "CHEMBL94990",
          "CHEMBL9515",
          "CHEMBL95868",
          "CHEMBL9698",
          "CHEMBL97200",
          "CHEMBL9752",
          "CHEMBL97574",
          "CHEMBL9758",
          "CHEMBL9777",
          "CHEMBL9822",
          "CHEMBL99462"
        ],
        "number_of_missing_values": "0"
      },
      {
        "data_type": "numeric",
        "index": "1",
        "is_ignore": "false",
        "is_row_identifier": "false",
        "is_target": "false",
        "name": "FCFP4_1024b360",
        "number_of_missing_values": "0"
      },
      {
        "data_type": "numeric",
        "index": "2",
        "is_ignore": "false",
        "is_row_identifier": "false",
        "is_target": "false",
        "name": "FCFP4_1024b668",
        "number_of_missing_values": "0"
      },
      {
        "data_type": "numeric",
        "index": "3",
        "is_ignore": "false",
        "is_row_identifier": "false",
        "is_target": "false",
        "name": "FCFP4_1024b8",
        "number_of_missing_values": "0"
      },
      {
        "data_type": "numeric",
        "index": "4",
        "is_ignore": "false",
        "is_row_identifier": "false",
        "is_target": "false",
        "name": "FCFP4_1024b983",
        "number_of_missing_values": "0"
      },
      {
        "data_type": "numeric",
        "index": "5",
        "is_ignore": "false",
        "is_row_identifier": "false",
        "is_target": "false",
        "name": "FCFP4_1024b492",
        "number_of_missing_values": "0"
      },
      {
        "data_type": "numeric",
        "index": "6",
        "is_ignore": "false",
        "is_row_identifier": "false",
        "is_target": "false",
        "name": "FCFP4_1024b1016",
        "number_of_missing_values": "0"
      },
      {
        "data_type": "numeric",
        "index": "7",
        "is_ignore": "false",
        "is_row_identifier": "false",
        "is_target": "false",
        "name": "FCFP4_1024b521",
        "number_of_missing_values": "0"
      },
      {
        "data_type": "numeric",
        "index": "8",
        "is_ignore": "false",
        "is_row_identifier": "false",
        "is_target": "false",
        "name": "FCFP4_1024b18",
        "number_of_missing_values": "0"
      },
      {
        "data_type": "numeric",
        "index": "9",
        "is_ignore": "false",
        "is_row_identifier": "false",
        "is_target": "false",
        "name": "FCFP4_1024b192",
        "number_of_missing_values": "0"
      },
      {
        "data_type": "numeric",
        "index": "10",
        "is_ignore": "false",
        "is_row_identifier": "false",
        "is_target": "false",
        "name": "FCFP4_1024b490",
        "number_of_missing_values": "0"
      },
      {
        "data_type": "numeric",
        "index": "11",
        "is_ignore": "false",
        "is_row_identifier": "false",
        "is_target": "false",
        "name": "FCFP4_1024b760",
        "number_of_missing_values": "0"
      },
      {
        "data_type": "numeric",
        "index": "12",
        "is_ignore": "false",
        "is_row_identifier": "false",
        "is_target": "false",
        "name": "FCFP4_1024b409",
        "number_of_missing_values": "0"
      },
      {
        "data_type": "numeric",
        "index": "13",
        "is_ignore": "false",
        "is_row_identifier": "false",
        "is_target": "false",
        "name": "FCFP4_1024b826",
        "number_of_missing_values": "0"
      },
      {
        "data_type": "numeric",
        "index": "14",
        "is_ignore": "false",
        "is_row_identifier": "false",
        "is_target": "false",
        "name": "FCFP4_1024b412",
        "number_of_missing_values": "0"
      },
      {
        "data_type": "numeric",
        "index": "15",
        "is_ignore": "false",
        "is_row_identifier": "false",
        "is_target": "false",
        "name": "FCFP4_1024b281",
        "number_of_missing_values": "0"
      },
      {
        "data_type": "numeric",
        "index": "16",
        "is_ignore": "false",
        "is_row_identifier": "false",
        "is_target": "false",
        "name": "FCFP4_1024b87",
        "number_of_missing_values": "0"
      },
      {
        "data_type": "numeric",
        "index": "17",
        "is_ignore": "false",
        "is_row_identifier": "false",
        "is_target": "false",
        "name": "FCFP4_1024b816",
        "number_of_missing_values": "0"
      },
      {
        "data_type": "numeric",
        "index": "18",
        "is_ignore": "false",
        "is_row_identifier": "false",
        "is_target": "false",
        "name": "FCFP4_1024b617",
        "number_of_missing_values": "0"
      },
      {
        "data_type": "numeric",
        "index": "19",
        "is_ignore": "false",
        "is_row_identifier": "false",
        "is_target": "false",
        "name": "FCFP4_1024b1008",
        "number_of_missing_values": "0"
      },
      {
        "data_type": "numeric",
        "index": "20",
        "is_ignore": "false",
        "is_row_identifier": "false",
        "is_target": "false",
        "name": "FCFP4_1024b875",
        "number_of_missing_values": "0"
      },
      {
        "data_type": "numeric",
        "index": "21",
        "is_ignore": "false",
        "is_row_identifier": "false",
        "is_target": "false",
        "name": "FCFP4_1024b170",
        "number_of_missing_values": "0"
      },
      {
        "data_type": "numeric",
        "index": "22",
        "is_ignore": "false",
        "is_row_identifier": "false",
        "is_target": "false",
        "name": "FCFP4_1024b539",
        "number_of_missing_values": "0"
      },
      {
        "data_type": "numeric",
        "index": "23",
        "is_ignore": "false",
        "is_row_identifier": "false",
        "is_target": "false",
        "name": "FCFP4_1024b149",
        "number_of_missing_values": "0"
      },
      {
        "data_type": "numeric",
        "index": "24",
        "is_ignore": "false",
        "is_row_identifier": "false",
        "is_target": "false",
        "name": "FCFP4_1024b730",
        "number_of_missing_values": "0"
      },
      {
        "data_type": "numeric",
        "index": "25",
        "is_ignore": "false",
        "is_row_identifier": "false",
        "is_target": "false",
        "name": "FCFP4_1024b152",
        "number_of_missing_values": "0"
      },
      {
        "data_type": "numeric",
        "index": "26",
        "is_ignore": "false",
        "is_row_identifier": "false",
        "is_target": "false",
        "name": "FCFP4_1024b745",
        "number_of_missing_values": "0"
      },
      {
        "data_type": "numeric",
        "index": "27",
        "is_ignore": "false",
        "is_row_identifier": "false",
        "is_target": "false",
        "name": "FCFP4_1024b788",
        "number_of_missing_values": "0"
      },
      {
        "data_type": "numeric",
        "index": "28",
        "is_ignore": "false",
        "is_row_identifier": "false",
        "is_target": "false",
        "name": "FCFP4_1024b288",
        "number_of_missing_values": "0"
      },
      {
        "data_type": "numeric",
        "index": "29",
        "is_ignore": "false",
        "is_row_identifier": "false",
        "is_target": "false",
        "name": "FCFP4_1024b452",
        "number_of_missing_values": "0"
      },
      {
        "data_type": "numeric",
        "index": "30",
        "is_ignore": "false",
        "is_row_identifier": "false",
        "is_target": "false",
        "name": "FCFP4_1024b834",
        "number_of_missing_values": "0"
      },
      {
        "data_type": "numeric",
        "index": "31",
        "is_ignore": "false",
        "is_row_identifier": "false",
        "is_target": "false",
        "name": "FCFP4_1024b416",
        "number_of_missing_values": "0"
      },
      {
        "data_type": "numeric",
        "index": "32",
        "is_ignore": "false",
        "is_row_identifier": "false",
        "is_target": "false",
        "name": "FCFP4_1024b480",
        "number_of_missing_values": "0"
      },
      {
        "data_type": "numeric",
        "index": "33",
        "is_ignore": "false",
        "is_row_identifier": "false",
        "is_target": "false",
        "name": "FCFP4_1024b434",
        "number_of_missing_values": "0"
      },
      {
        "data_type": "numeric",
        "index": "34",
        "is_ignore": "false",
        "is_row_identifier": "false",
        "is_target": "false",
        "name": "FCFP4_1024b942",
        "number_of_missing_values": "0"
      },
      {
        "data_type": "numeric",
        "index": "35",
        "is_ignore": "false",
        "is_row_identifier": "false",
        "is_target": "false",
        "name": "FCFP4_1024b376",
        "number_of_missing_values": "0"
      },
      {
        "data_type": "numeric",
        "index": "36",
        "is_ignore": "false",
        "is_row_identifier": "false",
        "is_target": "false",
        "name": "FCFP4_1024b17",
        "number_of_missing_values": "0"
      },
      {
        "data_type": "numeric",
        "index": "37",
        "is_ignore": "false",
        "is_row_identifier": "false",
        "is_target": "false",
        "name": "FCFP4_1024b301",
        "number_of_missing_values": "0"
      },
      {
        "data_type": "numeric",
        "index": "38",
        "is_ignore": "false",
        "is_row_identifier": "false",
        "is_target": "false",
        "name": "FCFP4_1024b680",
        "number_of_missing_values": "0"
      },
      {
        "data_type": "numeric",
        "index": "39",
        "is_ignore": "false",
        "is_row_identifier": "false",
        "is_target": "false",
        "name": "FCFP4_1024b933",
        "number_of_missing_values": "0"
      },
      {
        "data_type": "numeric",
        "index": "40",
        "is_ignore": "false",
        "is_row_identifier": "false",
        "is_target": "false",
        "name": "FCFP4_1024b245",
        "number_of_missing_values": "0"
      },
      {
        "data_type": "numeric",
        "index": "41",
        "is_ignore": "false",
        "is_row_identifier": "false",
        "is_target": "false",
        "name": "FCFP4_1024b461",
        "number_of_missing_values": "0"
      },
      {
        "data_type": "numeric",
        "index": "42",
        "is_ignore": "false",
        "is_row_identifier": "false",
        "is_target": "false",
        "name": "FCFP4_1024b65",
        "number_of_missing_values": "0"
      },
      {
        "data_type": "numeric",
        "index": "43",
        "is_ignore": "false",
        "is_row_identifier": "false",
        "is_target": "false",
        "name": "FCFP4_1024b319",
        "number_of_missing_values": "0"
      },
      {
        "data_type": "numeric",
        "index": "44",
        "is_ignore": "false",
        "is_row_identifier": "false",
        "is_target": "false",
        "name": "FCFP4_1024b697",
        "number_of_missing_values": "0"
      },
      {
        "data_type": "numeric",
        "index": "45",
        "is_ignore": "false",
        "is_row_identifier": "false",
        "is_target": "false",
        "name": "FCFP4_1024b907",
        "number_of_missing_values": "0"
      },
      {
        "data_type": "numeric",
        "index": "46",
        "is_ignore": "false",
        "is_row_identifier": "false",
        "is_target": "false",
        "name": "FCFP4_1024b420",
        "number_of_missing_values": "0"
      },
      {
        "data_type": "numeric",
        "index": "47",
        "is_ignore": "false",
        "is_row_identifier": "false",
        "is_target": "false",
        "name": "FCFP4_1024b106",
        "number_of_missing_values": "0"
      },
      {
        "data_type": "numeric",
        "index": "48",
        "is_ignore": "false",
        "is_row_identifier": "false",
        "is_target": "false",
        "name": "FCFP4_1024b337",
        "number_of_missing_values": "0"
      },
      {
        "data_type": "numeric",
        "index": "49",
        "is_ignore": "false",
        "is_row_identifier": "false",
        "is_target": "false",
        "name": "FCFP4_1024b699",
        "number_of_missing_values": "0"
      },
      {
        "data_type": "numeric",
        "index": "50",
        "is_ignore": "false",
        "is_row_identifier": "false",
        "is_target": "false",
        "name": "FCFP4_1024b656",
        "number_of_missing_values": "0"
      },
      {
        "data_type": "numeric",
        "index": "51",
        "is_ignore": "false",
        "is_row_identifier": "false",
        "is_target": "false",
        "name": "FCFP4_1024b937",
        "number_of_missing_values": "0"
      },
      {
        "data_type": "numeric",
        "index": "52",
        "is_ignore": "false",
        "is_row_identifier": "false",
        "is_target": "true",
        "name": "pXC50",
        "number_of_missing_values": "0"
      }
    ]
  }
}