"molecule_id","nC","RBF","AMW","C.","pXC50"
{1 16,2 0.029,3 8.629,4 48.5,5 7.444}
{0 CHEMBL130416,1 21,2 0.056,3 7.717,4 41.2,5 7.081}
{0 CHEMBL13280,1 16,2 0.054,3 8.952,4 45.7,5 1.99}
{0 CHEMBL145910,1 22,2 0.059,3 8.35,4 46.8,5 7.444}
{0 CHEMBL145970,1 19,2 0.063,3 7.691,4 43.2,5 6.87}
{0 CHEMBL145983,1 22,2 0.059,3 7.967,4 46.8,5 6.921}
{0 CHEMBL146075,1 23,2 0.074,3 8.369,4 46,5 7}
{0 CHEMBL146086,1 21,2 0.06,3 8.162,4 45.7,5 7.252}
{0 CHEMBL146230,1 22,2 0.053,3 7.179,4 41.5,5 6.896}
{0 CHEMBL146302,1 22,2 0.04,3 8.835,4 47.8,5 7.032}
{0 CHEMBL146317,1 23,2 0.056,3 8.369,4 46,5 5.658}
{0 CHEMBL146356,1 23,2 0.073,3 7.578,4 45.1,5 7.092}
{0 CHEMBL147312,1 23,2 0.056,3 7.41,4 46,5 6.575}
{0 CHEMBL147364,1 20,2 0.063,3 8.647,4 45.5,5 6.971}
{0 CHEMBL147379,1 19,2 0.082,3 7.401,4 41.3,5 6.588}
{0 CHEMBL147590,1 22,2 0.04,3 9.226,4 47.8,5 6.876}
{0 CHEMBL147842,1 22,2 0.04,3 8.835,4 47.8,5 7.387}
{0 CHEMBL148043,1 26,2 0.068,3 8.122,4 48.1,5 6.682}
{0 CHEMBL148044,1 22,2 0.059,3 7.967,4 46.8,5 6.866}
{0 CHEMBL148740,1 22,2 0.059,3 7.584,4 46.8,5 7.77}
{0 CHEMBL1522,1 17,2 0.064,3 8.837,4 38.6,5 7.3}
{0 CHEMBL1681885,1 20,2 0.089,3 8.533,4 48.8,5 7.131}
{0 CHEMBL1681886,1 23,2 0.083,3 9.552,4 52.3,5 7.194}
{0 CHEMBL1681887,1 23,2 0.083,3 9.179,4 52.3,5 9}
{0 CHEMBL1681888,1 24,2 0.077,3 9.146,4 51.1,5 7.301}
{0 CHEMBL1681889,1 23,2 0.077,3 8.841,4 47.9,5 7.337}
{0 CHEMBL1681890,1 24,2 0.073,3 8.596,4 47.1,5 6.616}
{0 CHEMBL1681892,1 25,2 0.069,3 8.378,4 46.3,5 7.174}
{0 CHEMBL1681894,1 23,2 0.077,3 8.841,4 47.9,5 6.804}
{0 CHEMBL1681895,1 23,2 0.077,3 8.498,4 47.9,5 7.194}
{0 CHEMBL1681897,1 23,2 0.077,3 8.498,4 47.9,5 7.301}
{0 CHEMBL1681898,1 22,2 0.061,3 9.118,4 48.9,5 5.523}
{0 CHEMBL1681899,1 23,2 0.094,3 8.665,4 47.9,5 6.873}
{0 CHEMBL1681900,1 20,2 0.082,3 7.864,4 44.4,5 7.027}
{0 CHEMBL174535,1 18,2 0.027,3 7.838,4 51.4,5 7.119}
{0 CHEMBL19732,1 16,2 0.029,3 8.429,4 51.6,5 8.081}
{0 CHEMBL20042,1 16,2 0.029,3 9.54,4 51.6,5 9.262}
{0 CHEMBL204738,1 17,2 0.051,3 7.928,4 45.9,5 5}
{0 CHEMBL2163548,1 16,2 0.098,3 9.393,4 41,5 5.42}
{0 CHEMBL286594,1 17,2 0.075,3 8.141,4 44.7,5 7.547}
{0 CHEMBL296335,1 17,2 0.053,3 8.324,4 48.6,5 10}
{0 CHEMBL342270,1 21,2 0.06,3 8.162,4 45.7,5 7.276}
{0 CHEMBL343009,1 22,2 0.059,3 8.35,4 46.8,5 7.036}
{0 CHEMBL343471,1 23,2 0.038,3 8.213,4 46.9,5 6.519}
{0 CHEMBL344120,1 23,2 0.038,3 8.213,4 46.9,5 6.264}
{0 CHEMBL35571,1 33,2 0.105,3 8.488,4 46.5,5 6}
{0 CHEMBL356161,1 22,2 0.059,3 7.967,4 46.8,5 7.745}
{0 CHEMBL356271,1 23,2 0.073,3 7.578,4 45.1,5 7.553}
{0 CHEMBL356806,1 22,2 0.04,3 8.835,4 47.8,5 7.161}
{0 CHEMBL358301,1 18,2 0.068,3 7.912,4 43.9,5 6.77}
{0 CHEMBL358519,1 18,2 0.044,3 8.105,4 42.9,5 7.022}
{0 CHEMBL358874,1 19,2 0.063,3 8.282,4 43.2,5 6.928}
{0 CHEMBL363211,1 17,2 0.1,3 7.839,4 36.2,5 9.097}
{0 CHEMBL407,1 15,2 0.079,3 8.426,4 41.7,5 8.481}
{0 CHEMBL443736,1 33,2 0.119,3 7.731,4 41.8,5 5.732}
{0 CHEMBL449393,1 35,2 0.122,3 8.191,4 45.5,5 6.636}
{0 CHEMBL45198,1 22,2 0.04,3 8.402,4 47.8,5 8.886}
{0 CHEMBL453066,1 13,2 0.069,3 8.38,4 48.1,5 9}
{0 CHEMBL453251,1 14,2 0.086,3 9.265,4 42.4,5 8.167}
{0 CHEMBL453324,1 18,2 0.13,3 7.464,4 40.9,5 8.097}
{0 CHEMBL45346,1 14,2 0.056,3 8.581,4 41.2,5 6.036}
{0 CHEMBL454095,1 24,2 0.14,3 7.491,4 44.4,5 9}
{0 CHEMBL454606,1 14,2 0.094,3 8.009,4 46.7,5 9}
{0 CHEMBL454865,1 17,2 0.087,3 7.168,4 38.6,5 7.69}
{0 CHEMBL454866,1 14,2 0.081,3 8.323,4 40,5 8.699}
{0 CHEMBL458144,1 18,2 0.065,3 8.386,4 40.9,5 6.237}
{0 CHEMBL458147,1 16,2 0.073,3 8.559,4 41,5 7.762}
{0 CHEMBL458316,1 18,2 0.083,3 8.251,4 39.1,5 5}
{0 CHEMBL458317,1 15,2 0.132,3 11.054,4 41.7,5 6.328}
{0 CHEMBL458319,1 16,2 0.1,3 8.967,4 43.2,5 7.785}
{0 CHEMBL458320,1 13,2 0.032,3 9.507,4 44.8,5 4.757}
{0 CHEMBL458321,1 13,2 0.031,3 8.724,4 43.3,5 6.389}
{0 CHEMBL459031,1 14,2 0.083,3 8.581,4 41.2,5 6.301}
{0 CHEMBL461511,1 12,3 10.45,4 44.4,5 6.301}
{0 CHEMBL461716,1 19,2 0.061,3 7.82,4 40.4,5 6.917}
{0 CHEMBL461717,1 21,2 0.055,3 7.464,4 39.6,5 6.706}
{0 CHEMBL461924,1 15,2 0.105,3 10.925,4 41.7,5 5}
{0 CHEMBL461925,1 15,2 0.065,3 9.923,4 51.7,5 6}
{0 CHEMBL471115,1 16,2 0.098,3 7.79,4 41,5 5.688}
{0 CHEMBL471977,1 22,2 0.05,3 7.097,4 37.9,5 6.706}
{0 CHEMBL471978,1 16,2 0.081,3 8.438,4 45.7,5 7.547}
{0 CHEMBL483019,1 12,2 0.133,3 8.32,4 41.4,5 4.959}
{0 CHEMBL485829,1 16,2 0.1,3 9.011,4 42.1,5 6.33}
{0 CHEMBL498936,1 13,2 0.067,3 7.581,4 46.4,5 8.921}
{0 CHEMBL499814,1 14,2 0.091,3 7.3,4 45.2,5 8.301}
{0 CHEMBL499964,1 44,2 0.128,3 8.331,4 50.6,5 6.337}
{0 CHEMBL505497,1 32,2 0.108,3 8.763,4 46.4,5 5.421}
{0 CHEMBL505768,1 43,2 0.111,3 8.371,4 51.8,5 6.627}
{0 CHEMBL509197,1 16,2 0.079,3 7.454,4 44.4,5 9}
{0 CHEMBL510658,1 14,2 0.108,3 8.923,4 40,5 8.481}
{0 CHEMBL510963,1 12,2 0.033,3 9.418,4 42.9,5 6.523}
{0 CHEMBL511684,1 16,2 0.075,3 8.972,4 42.1,5 6.237}
{0 CHEMBL511685,1 16,2 0.1,3 8.363,4 42.1,5 5.801}
{0 CHEMBL518197,1 22,2 0.053,3 7.548,4 40.7,5 6.699}
{0 CHEMBL52030,1 18,2 0.085,3 7.759,4 40.9,5 7.31}
{0 CHEMBL522055,1 22,2 0.085,3 8.078,4 50,5 6.542}
{0 CHEMBL58757,1 19,2 0.065,3 7.668,4 43.2,5 4.128}
{0 CHEMBL646,1 17,2 0.026,3 9.807,4 48.6,5 9}
{0 CHEMBL6597,1 15,2 0.1,3 8.588,4 39.5,5 8.959}
{0 CHEMBL661,1 17,2 0.026,3 8.823,4 48.6,5 7.432}
{0 CHEMBL681,1 14,2 0.143,3 7.186,4 41.2,5 4.959}
{0 CHEMBL73096,1 16,2 0.029,3 7.585,4 48.5,5 5}
{0 CHEMBL911,1 19,2 0.065,3 6.987,4 43.2,5 6.719}
{0 CHEMBL96,1 4,2 0.2,3 6.446,4 25,5 1.5}
