{
  "data_set_description": {
    "collection_date": "November 2013",
    "creator": "Dr Jeremy Besnard, Dr Ivan Olier, Dr Noureddin Sadawi, Dr Larisa Soldatova, Dr Crina Grosan, Prof Ross King, Dr Richard Bickerton, Prof Andrew Hopkins and Dr Willem van Hoorn",
    "default_target_attribute": "pXC50",
    "description": "This dataset contains QSAR data (from ChEMBL version 17) showing activity values (unit is pseudo-pCI50) of several compounds on drug target ChEMBL_ID: CHEMBL1743121 (TID: 104062), and it has 27 rows and 1299 features (not including molecule IDs and class feature: molecule_id and pXC50). The features represent Molecular Descriptors which were generated from SMILES strings. Missing value imputation was applied to this dataset (By choosing the Median).",
    "description_version": "1",
    "file_id": "3575886",
    "format": "ARFF",
    "id": "36034",
    "licence": "Public",
    "md5_checksum": "9a3e24f24a798c0aed276e86b6d76898",
    "minio_url": "https://data.openml.org/datasets/0003/36034/dataset_36034.pq",
    "name": "QSAR-DATASET-FOR-DRUG-TARGET-CHEMBL1743121",
    "original_data_url": "https://www.ebi.ac.uk/chembl/target/inspect/CHEMBL1743121",
    "parquet_url": "https://data.openml.org/datasets/0003/36034/dataset_36034.pq",
    "processing_date": "2018-10-04 04:41:46",
    "row_id_attribute": "molecule_id",
    "status": "deactivated",
    "tag": [
      "MetaQSAR",
      "study_13"
    ],
    "upload_date": "2016-07-15T19:47:58",
    "url": "https://api.openml.org/data/v1/download/3575886/QSAR-DATASET-FOR-DRUG-TARGET-CHEMBL1743121.arff",
    "version": "11",
    "visibility": "public"
  }
}