"molecule_id","AMW","C.","H.","Me","Mi","Mp","Mv","MW","N.","nAB","nAT","nB","nBM","nBO","nBR","nBT","nC","nCL","nCsp","nCsp2","nCsp3","nDB","nF","nH","nHet","nHM","nI","nN","nO","nP","nS","nSK","nTB","nX","O.","RBF","RBN","SCBO","Se","Si","Sp","Sv","X.","pXC50"
{1 6.559,2 43.1,3 51,4 0.983,5 1.121,6 0.659,7 0.609,8 334.5,9 3.9,10 12,11 51,13 13,14 28,16 54,17 22,20 13,21 9,22 1,24 26,25 3,28 2,29 1,32 25,35 2,36 0.056,37 3,38 35,39 50.134,40 57.188,41 33.603,42 31.079,44 8.398}
{0 CHEMBL1077781,1 7.934,2 42.6,3 44.7,4 1.007,5 1.122,6 0.678,7 0.644,8 372.88,9 4.3,10 12,11 47,13 14,14 28,16 49,17 20,18 1,20 14,21 6,22 2,24 21,25 6,26 1,28 2,29 3,32 26,34 1,35 6.4,36 0.082,37 4,38 36,39 47.345,40 52.721,41 31.847,42 30.283,43 2.1,44 6.4}
{0 CHEMBL1077963,1 7.916,2 40.8,3 44.9,4 1.009,5 1.127,6 0.67,7 0.639,8 387.9,9 6.1,10 12,11 49,13 14,14 29,16 51,17 20,18 1,20 13,21 7,22 2,24 22,25 7,26 1,28 3,29 3,32 27,34 1,35 6.1,36 0.098,37 5,38 37,39 49.447,40 55.219,41 32.853,42 31.304,43 2,44 6.538}
{0 CHEMBL1078232,1 7.355,2 40.3,3 48.4,4 1,5 1.127,6 0.66,7 0.62,8 456.03,9 4.8,10 12,11 62,13 14,14 35,16 65,17 25,18 1,20 14,21 11,22 2,24 30,25 7,26 1,28 3,29 3,32 32,34 1,35 4.8,36 0.077,37 5,38 43,39 61.981,40 69.88,41 40.898,42 38.411,43 1.6,44 7}
{0 CHEMBL1078264,1 6.944,2 45.9,3 47.5,4 0.986,5 1.116,6 0.678,7 0.633,8 423.6,9 4.9,10 22,11 61,13 23,14 36,16 65,17 28,20 21,21 7,22 1,24 29,25 4,28 3,29 1,32 32,35 1.6,36 0.062,37 4,38 48,39 60.12,40 68.102,41 41.37,42 38.627,44 8.222}
{0 CHEMBL1078265,1 7.139,2 42,3 50,4 0.989,5 1.123,6 0.669,7 0.618,8 356.93,9 4,10 12,11 50,13 13,14 27,16 52,17 21,18 1,20 13,21 8,22 1,24 25,25 4,26 1,28 2,29 1,32 25,34 1,35 2,36 0.077,37 4,38 34,39 49.458,40 56.132,41 33.461,42 30.907,43 2,44 8.301}
{0 CHEMBL1078336,1 7.916,2 40.8,3 44.9,4 1.009,5 1.127,6 0.67,7 0.639,8 387.9,9 6.1,10 12,11 49,13 14,14 29,16 51,17 20,18 1,20 13,21 7,22 2,24 22,25 7,26 1,28 3,29 3,32 27,34 1,35 6.1,36 0.098,37 5,38 37,39 49.447,40 55.219,41 32.853,42 31.304,43 2,44 6.331}
{0 CHEMBL1078337,1 7.916,2 40.8,3 44.9,4 1.009,5 1.127,6 0.67,7 0.639,8 387.9,9 6.1,10 12,11 49,13 14,14 29,16 51,17 20,18 1,20 13,21 7,22 2,24 22,25 7,26 1,28 3,29 3,32 27,34 1,35 6.1,36 0.098,37 5,38 37,39 49.447,40 55.219,41 32.853,42 31.304,43 2,44 6.48}
{0 CHEMBL1078353,1 6.491,2 40.4,3 51.9,4 0.985,5 1.129,6 0.646,7 0.598,8 337.51,9 5.8,10 12,11 52,13 13,14 27,16 54,17 21,20 12,21 9,22 1,24 27,25 4,28 3,29 1,32 25,35 1.9,36 0.093,37 5,38 34,39 51.236,40 58.687,41 33.608,42 31.101,44 8.222}
{0 CHEMBL1078354,1 6.84,2 41.5,3 49.1,4 0.99,5 1.128,6 0.658,7 0.615,8 362.52,9 7.5,10 16,11 53,13 17,14 30,16 56,17 22,20 14,21 8,22 1,24 26,25 5,28 4,29 1,32 27,35 1.9,36 0.071,37 4,38 39,39 52.454,40 59.77,41 34.853,42 32.595,44 7.585}
{0 CHEMBL1078452,1 6.936,2 42.6,3 48.1,4 0.99,5 1.125,6 0.664,7 0.622,8 374.53,9 7.4,10 17,11 54,13 18,14 31,16 57,17 23,20 15,21 8,22 1,24 26,25 5,28 4,29 1,32 28,35 1.9,36 0.07,37 4,38 40.5,39 53.454,40 60.77,41 35.853,42 33.595,44 7.721}
{0 CHEMBL1078565,1 7.565,2 41.5,3 47.2,4 1.002,5 1.124,6 0.667,7 0.629,8 400.94,9 3.8,10 12,11 53,13 14,14 30,16 55,17 22,18 1,20 14,21 8,22 2,24 25,25 6,26 1,28 2,29 3,32 28,34 1,35 5.7,36 0.109,37 6,38 38,39 53.112,40 59.551,41 35.37,42 33.336,43 1.9,44 6.754}
{0 CHEMBL1078628,1 7.017,2 39.7,3 50.8,4 0.993,5 1.128,6 0.654,7 0.607,8 442.05,9 4.8,10 12,11 63,13 14,14 33,16 65,17 25,18 1,20 14,21 11,22 2,24 32,25 6,26 1,28 3,29 2,32 31,34 1,35 3.2,36 0.108,37 7,38 41,39 62.538,40 71.086,41 41.205,42 38.223,43 1.6,44 7.509}
{0 CHEMBL1078657,1 7.41,2 41.1,3 48.2,4 1,5 1.124,6 0.663,7 0.623,8 414.97,9 3.6,10 12,11 56,13 14,14 31,16 58,17 23,18 1,20 14,21 9,22 2,24 27,25 6,26 1,28 2,29 3,32 29,34 1,35 5.4,36 0.121,37 7,38 39,39 55.996,40 62.966,41 37.131,42 34.863,43 1.8,44 6.921}
{0 CHEMBL1078715,1 8.583,2 41.5,3 41.5,4 1.031,5 1.143,6 0.664,7 0.651,8 454.91,9 3.8,10 12,11 53,13 14,14 33,16 55,17 22,18 1,20 14,21 8,22 2,23 3,24 22,25 9,26 1,28 2,29 3,32 31,34 4,35 5.7,36 0.091,37 5,38 41,39 54.651,40 60.57,41 35.182,42 34.486,43 7.5,44 6.921}
{0 CHEMBL1078754,1 7.565,2 41.5,3 47.2,4 1.002,5 1.124,6 0.667,7 0.629,8 400.94,9 3.8,10 12,11 53,13 14,14 30,16 55,17 22,18 1,20 14,21 8,22 2,24 25,25 6,26 1,28 2,29 3,32 28,34 1,35 5.7,36 0.109,37 6,38 38,39 53.112,40 59.551,41 35.37,42 33.336,43 1.9,44 8.523}
{0 CHEMBL1078755,1 7.665,2 43.8,3 45.8,4 0.996,5 1.121,6 0.686,7 0.643,8 367.91,9 6.3,10 12,11 48,13 14,14 28,16 50,17 21,18 1,19 1,20 13,21 7,22 1,24 22,25 5,26 1,28 3,29 1,32 26,33 1,34 1,35 2.1,36 0.08,37 4,38 37,39 47.792,40 53.8,41 32.944,42 30.875,43 2.1,44 7.796}
{0 CHEMBL1079061,1 8.009,2 43.8,3 42.2,4 1.022,5 1.135,6 0.661,7 0.647,8 512.57,9 3.1,10 18,11 64,13 20,14 40,16 67,17 28,20 20,21 8,22 2,23 3,24 27,25 9,28 2,29 4,32 37,34 3,35 6.3,36 0.104,37 7,38 51,39 65.421,40 72.666,41 42.301,42 41.427,43 4.7,44 6.384}
{0 CHEMBL1079140,1 7.018,2 40,3 50.9,4 0.99,5 1.128,6 0.659,7 0.608,8 385.98,9 5.5,10 12,11 55,13 13,14 29,16 57,17 22,18 1,20 13,21 9,22 1,24 28,25 5,26 1,28 3,29 1,32 27,34 1,35 1.8,36 0.088,37 5,38 36,39 54.443,40 62.046,41 36.228,42 33.455,43 1.8,44 6.924}
{0 CHEMBL1079244,1 7.648,2 38.9,3 46.3,4 1.002,5 1.135,6 0.666,7 0.628,8 412.97,9 11.1,10 12,11 54,13 14,14 32,16 57,17 21,18 1,20 14,21 7,22 2,24 25,25 8,26 1,28 6,29 1,32 29,34 1,35 1.9,36 0.088,37 5,38 40,39 54.098,40 61.295,41 35.961,42 33.939,43 1.9,44 7.229}
{0 CHEMBL1079245,1 7.862,2 37.9,3 44.8,4 1.009,5 1.138,6 0.662,7 0.632,8 456,9 12.1,10 12,11 58,13 15,14 35,16 61,17 22,18 1,20 15,21 7,22 3,24 26,25 10,26 1,28 7,29 2,32 32,34 1,35 3.4,36 0.098,37 6,38 44,39 58.527,40 66.003,41 38.421,42 36.675,43 1.7,44 7.469}
{0 CHEMBL1079246,1 7.407,2 40.7,3 48.1,4 0.998,5 1.127,6 0.665,7 0.623,8 399.96,9 5.6,10 12,11 54,13 14,14 30,16 56,17 22,18 1,20 14,21 8,22 2,24 26,25 6,26 1,28 3,29 2,32 28,34 1,35 3.7,36 0.089,37 5,38 38,39 53.887,40 60.84,41 35.921,42 33.643,43 1.9,44 7.495}
{0 CHEMBL1079256,1 7.738,2 42,3 46,4 1.005,5 1.123,6 0.672,7 0.636,8 386.91,9 4,10 12,11 50,13 14,14 29,16 52,17 21,18 1,20 14,21 7,22 2,24 23,25 6,26 1,28 2,29 3,32 27,34 1,35 6,36 0.096,37 5,38 37,39 50.229,40 56.136,41 33.608,42 31.81,43 2,44 7.14}
{0 CHEMBL1079257,1 8.583,2 41.5,3 41.5,4 1.031,5 1.143,6 0.664,7 0.651,8 454.91,9 3.8,10 12,11 53,13 14,14 33,16 55,17 22,18 1,20 14,21 8,22 2,23 3,24 22,25 9,26 1,28 2,29 3,32 31,34 4,35 5.7,36 0.091,37 5,38 41,39 54.651,40 60.57,41 35.182,42 34.486,43 7.5,44 7.155}
{0 CHEMBL1079258,1 8.583,2 41.5,3 41.5,4 1.031,5 1.143,6 0.664,7 0.651,8 454.91,9 3.8,10 12,11 53,13 14,14 33,16 55,17 22,18 1,20 14,21 8,22 2,23 3,24 22,25 9,26 1,28 2,29 3,32 31,34 4,35 5.7,36 0.091,37 5,38 41,39 54.651,40 60.57,41 35.182,42 34.486,43 7.5,44 6.754}
{0 CHEMBL1079290,1 7.477,2 41.7,3 47.9,4 0.998,5 1.123,6 0.67,7 0.627,8 358.9,9 4.2,10 12,11 48,13 13,14 27,16 50,17 20,18 1,20 13,21 7,22 1,24 23,25 5,26 1,28 2,29 2,32 25,34 1,35 4.2,36 0.08,37 4,38 34,39 47.902,40 53.927,41 32.154,42 30.095,43 2.1,44 7.824}
{0 CHEMBL1079291,1 7.312,2 41.2,3 49,4 0.996,5 1.124,6 0.665,7 0.62,8 372.93,9 3.9,10 12,11 51,13 13,14 28,16 53,17 21,18 1,20 13,21 8,22 1,24 25,25 5,26 1,28 2,29 2,32 26,34 1,35 3.9,36 0.094,37 5,38 35,39 50.785,40 57.342,41 33.915,42 31.622,43 2,44 8}
{0 CHEMBL1079292,1 7.567,2 41.2,3 47.1,4 1,5 1.126,6 0.67,7 0.63,8 385.93,9 5.9,10 12,11 51,13 14,14 29,16 53,17 21,18 1,20 14,21 7,22 2,24 24,25 6,26 1,28 3,29 2,32 27,34 1,35 3.9,36 0.094,37 5,38 37,39 51.003,40 57.425,41 34.159,42 32.116,43 2,44 7.585}
{0 CHEMBL1079360,1 7.474,2 43.2,3 47.7,4 0.993,5 1.121,6 0.68,7 0.633,8 328.87,9 4.5,10 12,11 44,13 13,14 25,16 46,17 19,18 1,20 13,21 6,22 1,24 21,25 4,26 1,28 2,29 1,32 23,34 1,35 2.3,36 0.043,37 2,38 32,39 43.691,40 49.302,41 29.938,42 27.853,43 2.3,44 8.301}
{0 CHEMBL1079361,1 7.292,2 43.5,3 45.7,4 0.998,5 1.123,6 0.669,7 0.636,8 335.44,9 6.5,10 16,11 46,13 17,14 28,16 49,17 20,20 14,21 6,22 1,24 21,25 5,28 3,29 2,32 25,35 4.3,36 0.041,37 2,38 37,39 45.912,40 51.651,41 30.779,42 29.235,44 6.684}
{0 CHEMBL1079362,1 6.87,2 41.9,3 48.8,4 0.99,5 1.127,6 0.659,7 0.617,8 295.42,9 7,10 12,11 43,13 13,14 24,16 45,17 18,20 12,21 6,22 1,24 21,25 4,28 3,29 1,32 22,35 2.3,36 0.044,37 2,38 31,39 42.585,40 48.441,41 28.324,42 26.52,44 6.457}
{0 CHEMBL1080076,1 6.862,2 46.3,3 48.1,4 0.984,5 1.115,6 0.678,7 0.631,8 370.53,9 3.7,10 18,11 54,13 19,14 31,16 57,17 25,20 19,21 6,22 1,24 26,25 3,28 2,29 1,32 28,35 1.9,36 0.053,37 3,38 41,39 53.134,40 60.188,41 36.603,42 34.079,44 8.222}
{0 CHEMBL1080973,1 8.029,2 42.6,3 46.8,4 0.998,5 1.12,6 0.693,7 0.643,8 377.34,9 4.3,10 12,11 47,13 13,14 27,16 49,17 20,18 2,20 13,21 7,22 1,24 22,25 5,26 2,28 2,29 1,32 25,34 2,35 2.1,36 0.061,37 3,38 34,39 46.898,40 52.661,41 32.557,42 30.207,43 4.3,44 8.523}
{0 CHEMBL1080974,1 7.543,2 45,3 45,4 1.007,5 1.134,6 0.666,7 0.638,8 452.56,9 3.3,10 18,11 60,13 19,14 36,16 63,17 27,20 19,21 8,22 1,23 3,24 27,25 6,28 2,29 1,32 33,34 3,35 1.7,36 0.063,37 4,38 46,39 60.439,40 68.038,41 39.938,42 38.283,43 5,44 7.959}
{0 CHEMBL1080975,1 7.351,2 45.6,3 47.4,4 0.988,5 1.115,6 0.688,7 0.639,8 419,9 3.5,10 18,11 57,13 19,14 33,16 60,17 26,18 1,20 19,21 7,22 1,24 27,25 4,26 1,28 2,29 1,32 30,34 1,35 1.8,36 0.067,37 4,38 43,39 56.341,40 63.548,41 39.222,42 36.433,43 1.8,44 8.155}
{0 CHEMBL1081703,1 6.885,2 44.6,3 48.2,4 0.986,5 1.119,6 0.672,7 0.627,8 385.55,9 5.4,10 18,11 56,13 19,14 32,16 59,17 25,20 18,21 7,22 1,24 27,25 4,28 3,29 1,32 29,35 1.8,36 0.068,37 4,38 42,39 55.236,40 62.687,41 37.608,42 35.101,44 8.523}
{0 CHEMBL1615216,1 6.817,2 38.5,3 50,4 0.996,5 1.134,6 0.641,7 0.602,8 354.5,9 7.7,10 11,11 52,13 12,14 29,16 55,17 20,20 9,21 11,22 1,24 26,25 6,28 4,29 2,32 26,35 3.8,36 0.073,37 4,38 35.5,39 51.781,40 58.979,41 33.307,42 31.31,44 7.888}
{0 CHEMBL1672128,1 6.839,2 44.7,3 48.9,4 0.989,5 1.117,6 0.666,7 0.622,8 321.45,9 2.1,10 12,11 47,13 13,14 27,16 50,17 21,20 13,21 8,22 1,24 23,25 3,28 1,29 2,32 24,35 4.3,36 0.08,37 4,38 34,39 46.476,40 52.484,41 31.29,42 29.246,44 8.52}
{0 CHEMBL1672129,1 8.215,2 47.1,3 38.2,4 1.011,5 1.117,6 0.698,7 0.68,8 279.32,9 8.8,10 16,11 34,13 17,14 24,16 37,17 16,20 13,21 3,22 1,24 13,25 5,28 3,29 2,32 21,35 5.9,36 0.081,37 3,38 33,39 34.378,40 37.99,41 23.733,42 23.128,44 6.62}
{0 CHEMBL1672130,1 7.684,2 45,3 42.5,4 1.004,5 1.121,6 0.681,7 0.655,8 307.38,9 7.5,10 16,11 40,13 17,14 26,16 43,17 18,20 14,21 4,22 1,24 17,25 5,28 3,29 2,32 23,35 5,36 0.07,37 3,38 35,39 40.145,40 44.82,41 27.256,42 26.181,44 7.7}
{0 CHEMBL1672132,1 6.71,2 42,3 50,4 0.987,5 1.125,6 0.657,7 0.611,8 335.49,9 6,10 12,11 50,13 13,14 28,16 53,17 21,20 13,21 8,22 1,24 25,25 4,28 3,29 1,32 25,35 2,36 0.075,37 4,38 35,39 49.352,40 56.272,41 32.847,42 30.574,44 8.77}
{0 CHEMBL2021549,1 8.222,2 44.2,3 42.3,4 1.014,5 1.119,6 0.688,7 0.659,8 427.53,9 1.9,10 18,11 52,13 21,14 32,16 54,17 23,20 19,21 4,22 3,23 1,24 22,25 7,26 1,28 1,29 4,31 1,32 30,34 1,35 7.7,36 0.13,37 7,38 44,39 52.72,40 58.163,41 35.784,42 34.246,43 1.9,44 8.155}
{0 CHEMBL2021563,1 8.222,2 44.2,3 42.3,4 1.014,5 1.119,6 0.688,7 0.659,8 427.53,9 1.9,10 18,11 52,13 21,14 32,16 54,17 23,20 19,21 4,22 3,23 1,24 22,25 7,26 1,28 1,29 4,31 1,32 30,34 1,35 7.7,36 0.13,37 7,38 44,39 52.72,40 58.163,41 35.784,42 34.246,43 1.9,44 7.06}
{0 CHEMBL215387,1 5.774,2 33.8,3 58.8,4 0.985,5 1.14,6 0.601,7 0.547,8 392.65,9 2.9,11 68,13 2,14 30,16 70,17 23,20 2,21 21,22 2,24 40,25 5,28 2,29 3,32 28,35 4.4,36 0.186,37 13,38 32,39 66.974,40 77.514,41 40.841,42 37.196,44 7.959}
{0 CHEMBL242459,1 6.655,2 38.7,3 51.6,4 0.996,5 1.13,6 0.633,7 0.594,8 412.58,9 3.2,10 6,11 62,13 8,14 34,16 66,17 24,20 8,21 16,22 2,24 32,25 6,28 2,29 4,32 30,35 6.5,36 0.076,37 5,38 39,39 61.767,40 70.062,41 39.25,42 36.804,44 8.097}
{0 CHEMBL242655,1 5.833,2 32.4,3 58.8,4 0.99,5 1.143,6 0.593,7 0.543,8 396.64,9 2.9,11 68,13 1,14 30,16 70,17 22,20 1,21 21,22 1,24 40,25 6,28 2,29 4,32 28,35 5.9,36 0.2,37 14,38 31,39 67.301,40 77.723,41 40.296,42 36.911,44 8.301}
{0 CHEMBL436774,1 6.144,2 34.6,3 55.8,4 0.989,5 1.141,6 0.612,7 0.564,8 319.5,9 5.8,11 52,13 2,14 26,16 55,17 18,20 2,21 16,22 2,24 29,25 5,28 3,29 2,32 23,35 3.8,36 0.036,37 2,38 28,39 51.447,40 59.311,41 31.824,42 29.342,44 8.222}
{0 CHEMBL447085,1 7.069,2 44,3 48,4 0.997,5 1.125,6 0.66,7 0.623,8 353.47,9 2,10 12,11 50,13 13,14 29,16 53,17 22,20 13,21 9,22 1,23 1,24 24,25 4,28 1,29 2,32 26,34 1,35 4,36 0.057,37 3,38 36,39 49.872,40 56.239,41 32.989,42 31.156,43 2,44 8}
{0 CHEMBL482637,1 7.333,2 40.3,3 48.4,4 0.999,5 1.122,6 0.663,7 0.62,8 454.64,9 3.2,10 12,11 62,13 15,14 36,16 66,17 25,20 13,21 12,22 3,24 30,25 7,26 1,28 2,29 4,31 1,32 32,35 6.5,36 0.045,37 3,38 45,39 61.96,40 69.567,41 41.137,42 38.464,44 7.31}
{0 CHEMBL482845,1 7.24,2 44.2,3 46.2,4 0.998,5 1.119,6 0.668,7 0.634,8 376.49,9 3.8,10 12,11 52,13 14,14 32,16 56,17 23,20 14,21 9,22 2,24 24,25 5,28 2,29 3,32 28,35 5.8,36 0.018,37 1,38 40,39 51.905,40 58.192,41 34.75,42 32.982,44 7.456}
{0 CHEMBL483876,1 7.179,2 43.4,3 47.2,4 1,5 1.127,6 0.66,7 0.626,8 380.5,9 3.8,10 12,11 53,13 13,14 32,16 57,17 23,20 13,21 10,22 1,23 1,24 25,25 5,28 2,29 2,32 28,34 1,35 3.8,36 0.035,37 2,38 39,39 52.974,40 59.738,41 34.995,42 33.177,43 1.9,44 7.745}
{0 CHEMBL495586,1 7.541,2 40.6,3 46.9,4 1.004,5 1.122,6 0.665,7 0.628,8 482.65,9 3.1,10 12,11 64,13 16,14 38,16 68,17 26,20 14,21 12,22 4,24 30,25 8,26 1,28 2,29 5,31 1,32 34,35 7.8,36 0.044,37 3,38 48,39 64.287,40 71.776,41 42.591,42 40.179,44 7.678}
{0 CHEMBL495601,1 7.1,2 43.6,3 47.3,4 0.996,5 1.12,6 0.664,7 0.627,8 390.52,9 3.6,10 12,11 55,13 14,14 33,16 59,17 24,20 14,21 10,22 2,24 26,25 5,28 2,29 3,32 29,35 5.5,36 0.017,37 1,38 41,39 54.789,40 61.607,41 36.512,42 34.509,44 7.409}
{0 CHEMBL495792,1 7.364,2 43.5,3 45.2,4 1,5 1.123,6 0.67,7 0.638,8 456.59,9 6.5,10 17,11 62,13 19,14 39,16 67,17 27,20 17,21 10,22 2,24 28,25 7,28 4,29 3,32 34,35 4.8,36 0.045,37 3,38 49.5,39 61.992,40 69.604,41 41.523,42 39.552,44 7.678}
{0 CHEMBL495793,1 7.369,2 42.2,3 45.3,4 1.001,5 1.127,6 0.665,7 0.634,8 471.61,9 7.8,10 17,11 64,13 19,14 40,16 69,17 27,20 17,21 10,22 2,24 29,25 8,28 5,29 3,32 35,35 4.7,36 0.058,37 4,38 50.5,39 64.094,40 72.102,41 42.529,42 40.573,44 7.886}
{0 CHEMBL495794,1 7.838,2 41.4,3 44.8,4 1.009,5 1.12,6 0.674,7 0.64,8 454.59,9 3.4,10 12,11 58,13 16,14 36,16 62,17 24,20 14,21 10,22 4,24 26,25 8,26 1,28 2,29 5,31 1,32 32,35 8.6,36 0.048,37 3,38 46,39 58.52,40 64.946,41 39.068,42 37.125,44 7.921}
{0 CHEMBL495992,1 7.436,2 45.9,3 44.3,4 0.998,5 1.116,6 0.681,7 0.648,8 453.58,9 4.9,10 18,11 61,13 20,14 39,16 66,17 28,20 19,21 9,22 2,24 27,25 6,28 3,29 3,32 34,35 4.9,36 0.045,37 3,38 50,39 60.891,40 68.106,41 41.517,42 39.53,44 8.155}
{0 CHEMBL495993,1 7.402,2 43.1,3 45.1,4 1.002,5 1.123,6 0.667,7 0.637,8 377.48,9 5.9,10 12,11 51,13 14,14 32,16 55,17 22,20 13,21 9,22 2,24 23,25 6,28 3,29 3,32 28,35 5.9,36 0.036,37 2,38 40,39 51.123,40 57.275,41 33.995,42 32.477,44 7.699}
{0 CHEMBL495995,1 6.84,2 43.4,3 49.1,4 0.99,5 1.121,6 0.661,7 0.619,8 362.51,9 3.8,10 12,11 53,13 13,14 31,16 57,17 23,20 13,21 10,22 1,24 26,25 4,28 2,29 2,32 27,35 3.8,36 0.035,37 2,38 38,39 52.461,40 59.398,41 35.057,42 32.794,44 7.959}
{0 CHEMBL496189,1 7.24,2 44.2,3 46.2,4 0.998,5 1.119,6 0.668,7 0.634,8 376.49,9 3.8,10 12,11 52,13 14,14 32,16 56,17 23,20 14,21 9,22 2,24 24,25 5,28 2,29 3,32 28,35 5.8,36 0.036,37 2,38 40,39 51.905,40 58.192,41 34.75,42 32.982,44 7.538}
{0 CHEMBL497828,1 8.557,2 41.5,3 41.5,4 1.031,5 1.137,6 0.668,7 0.652,8 453.52,9 1.9,10 12,11 53,13 15,14 34,16 56,17 22,20 13,21 9,22 3,23 3,24 22,25 9,26 1,28 1,29 4,31 1,32 31,34 3,35 7.5,36 0.036,37 2,38 43,39 54.629,40 60.257,41 35.421,42 34.539,43 5.7,44 7.721}
{0 CHEMBL497829,1 8.838,2 41.5,3 43.4,4 1.014,5 1.116,6 0.704,7 0.661,8 468.43,9 1.9,10 12,11 53,13 15,14 33,16 56,17 22,18 2,20 13,21 9,22 3,24 23,25 8,26 3,28 1,29 4,31 1,32 30,34 2,35 7.5,36 0.054,37 3,38 42,39 53.738,40 59.126,41 37.324,42 35.044,43 3.8,44 8.398}
{0 CHEMBL519149,1 6.975,2 43.1,3 48.3,4 0.994,5 1.121,6 0.66,7 0.621,8 404.55,9 3.4,10 12,11 58,13 14,14 34,16 62,17 25,20 14,21 11,22 2,24 28,25 5,28 2,29 3,32 30,35 5.2,36 0.016,37 1,38 42,39 57.672,40 65.022,41 38.273,42 36.036,44 7.553}
{0 CHEMBL519336,1 7.468,2 40.7,3 47.5,4 1.001,5 1.121,6 0.667,7 0.626,8 440.61,9 3.4,10 12,11 59,13 15,14 35,16 63,17 24,20 13,21 11,22 3,24 28,25 7,26 1,28 2,29 4,31 1,32 31,35 6.8,36 0.048,37 3,38 44,39 59.076,40 66.152,41 39.375,42 36.937,44 7.638}
{0 CHEMBL522211,1 6.99,2 42.3,3 48.1,4 0.994,5 1.125,6 0.66,7 0.621,8 363.5,9 5.8,10 12,11 52,13 13,14 31,16 56,17 22,20 12,21 10,22 1,24 25,25 5,28 3,29 2,32 27,35 3.8,36 0.036,37 2,38 38,39 51.68,40 58.481,41 34.302,42 32.289,44 7.678}
{0 CHEMBL523565,1 7.16,2 41.5,3 47.2,4 1,5 1.126,6 0.656,7 0.623,8 379.5,9 5.7,10 12,11 53,13 13,14 32,16 57,17 22,20 12,21 10,22 1,24 25,25 6,28 3,29 3,32 28,35 5.7,36 0.035,37 2,38 39,39 53.007,40 59.69,41 34.756,42 33.003,44 7.509}
{0 CHEMBL524992,1 7.988,2 44.7,3 42.6,4 1.022,5 1.138,6 0.662,7 0.647,8 375.42,9 2.1,10 12,11 47,13 13,14 30,16 50,17 21,20 13,21 8,22 1,23 3,24 20,25 6,28 1,29 2,32 27,34 3,35 4.3,36 0.02,37 1,38 37,39 48.014,40 53.503,41 31.103,42 30.396,43 6.4,44 8}
{0 CHEMBL550242,1 7.337,2 41.8,3 45.5,4 1,5 1.128,6 0.665,7 0.633,8 403.53,9 9.1,10 17,11 55,13 18,14 34,16 59,17 23,20 14,21 9,22 1,24 25,25 7,28 5,29 2,32 30,35 3.6,36 0.051,37 3,38 43.5,39 55,40 62.062,41 36.552,42 34.805,44 7.658}
{0 CHEMBL550648,1 7.212,2 40.5,3 47.3,4 1.005,5 1.127,6 0.648,7 0.619,8 533.68,9 4.1,10 22,11 74,13 23,14 42,16 77,17 30,20 20,21 10,22 1,24 35,25 9,28 3,29 6,32 39,35 8.1,36 0.156,37 12,38 54,39 74.407,40 83.395,41 47.926,42 45.782,44 8}
{0 CHEMBL550652,1 6.925,2 38.3,3 48.9,4 0.996,5 1.137,6 0.645,7 0.608,8 325.46,9 10.6,10 11,11 47,13 12,14 27,16 50,17 18,20 9,21 9,22 1,24 23,25 6,28 5,29 1,32 24,35 2.1,36 0.06,37 3,38 33.5,39 46.789,40 53.438,41 30.336,42 28.563,44 4.699}
{0 CHEMBL551058,1 7.909,2 40.7,3 44.1,4 1.009,5 1.124,6 0.676,7 0.643,8 466.61,9 6.8,10 17,11 59,13 20,14 37,16 63,17 24,20 15,21 9,22 3,24 26,25 9,26 1,28 4,29 4,31 1,32 33,35 6.8,36 0.079,37 5,38 48.5,39 59.512,40 66.318,41 39.864,42 37.927,44 7.921}
{0 CHEMBL551138,1 8.183,2 50,3 39.1,4 1.011,5 1.122,6 0.7,7 0.68,8 376.43,9 4.3,10 18,11 46,13 20,14 30,16 48,17 23,19 1,20 19,21 3,22 1,23 2,24 18,25 5,28 2,29 1,32 28,33 1,34 2,35 2.2,36 0.125,37 6,38 42,39 46.509,40 51.622,41 32.194,42 31.265,43 4.3,44 8.155}
{0 CHEMBL551338,1 8.422,2 45.1,3 41.2,4 1.018,5 1.123,6 0.692,7 0.665,8 429.52,9 2,10 18,11 51,13 21,14 32,16 53,17 23,20 19,21 4,22 3,23 2,24 21,25 7,26 1,28 1,29 3,31 1,32 30,34 2,35 5.9,36 0.132,37 7,38 44,39 51.905,40 57.293,41 35.267,42 33.914,43 3.9,44 8.155}
{0 CHEMBL551517,1 7.657,2 41.2,3 43.1,4 1.007,5 1.132,6 0.667,7 0.643,8 390.49,9 11.8,10 17,11 51,13 18,14 33,16 55,17 21,20 13,21 8,22 1,24 22,25 8,28 6,29 2,32 29,35 3.9,36 0.073,37 4,38 42.5,39 51.334,40 57.73,41 34.034,42 32.772,44 7.456}
{0 CHEMBL551921,1 7.579,2 44.8,3 43.1,4 1,5 1.122,6 0.682,7 0.652,8 439.56,9 8.6,10 22,11 58,13 23,14 38,16 63,17 26,20 18,21 8,22 1,24 25,25 7,28 5,29 2,32 33,35 3.4,36 0.063,37 4,38 50,39 58,40 65.062,41 39.551,42 37.805,44 8.097}
{0 CHEMBL552061,1 7.579,2 44.8,3 43.1,4 1,5 1.122,6 0.682,7 0.652,8 439.56,9 8.6,10 22,11 58,13 23,14 38,16 63,17 26,20 18,21 8,22 1,24 25,25 7,28 5,29 2,32 33,35 3.4,36 0.063,37 4,38 50,39 58,40 65.062,41 39.551,42 37.805,44 7.678}
{0 CHEMBL552196,1 7.114,2 39.6,3 47.9,4 1.003,5 1.131,6 0.646,7 0.614,8 341.45,9 6.3,10 11,11 48,13 12,14 28,16 51,17 19,20 10,21 9,22 1,24 23,25 6,28 3,29 3,32 25,35 6.3,36 0.059,37 3,38 34.5,39 48.123,40 54.275,41 30.995,42 29.477,44 6.456}
{0 CHEMBL552381,1 7.49,2 42.3,3 44.2,4 1.002,5 1.128,6 0.669,7 0.64,8 389.5,9 9.6,10 17,11 52,13 18,14 33,16 56,17 22,20 14,21 8,22 1,24 23,25 7,28 5,29 2,32 29,35 3.8,36 0.054,37 3,38 42.5,39 52.116,40 58.647,41 34.79,42 33.278,44 6.215}
{0 CHEMBL552382,1 7.49,2 42.3,3 44.2,4 1.002,5 1.128,6 0.669,7 0.64,8 389.5,9 9.6,10 17,11 52,13 18,14 33,16 56,17 22,20 14,21 8,22 1,24 23,25 7,28 5,29 2,32 29,35 3.8,36 0.071,37 4,38 42.5,39 52.116,40 58.647,41 34.79,42 33.278,44 7.745}
{0 CHEMBL552402,1 7.23,2 44,3 46,4 0.996,5 1.121,6 0.671,7 0.635,8 361.48,9 6,10 16,11 50,13 17,14 31,16 54,17 22,20 14,21 8,22 1,24 23,25 5,28 3,29 2,32 27,35 4,36 0.056,37 3,38 40,39 49.796,40 56.066,41 33.54,42 31.762,44 7.796}
{0 CHEMBL555347,1 8.696,2 41.7,3 37.5,4 1.037,5 1.151,6 0.663,7 0.665,8 417.43,9 10.4,10 17,11 48,13 18,14 33,16 51,17 20,20 14,21 6,22 1,23 3,24 18,25 10,28 5,29 2,32 30,34 3,35 4.2,36 0.059,37 3,38 42.5,39 49.771,40 55.251,41 31.841,42 31.901,43 6.3,44 7.77}
{0 CHEMBL556234,1 8.957,2 42.1,3 38.6,4 1.039,5 1.142,6 0.673,7 0.666,8 510.55,9 3.5,10 18,11 57,13 21,14 37,16 59,17 24,20 18,21 6,22 3,23 4,24 22,25 11,26 1,28 2,29 4,31 1,32 35,34 4,35 7,36 0.153,37 9,38 49,39 59.243,40 65.095,41 38.364,42 37.944,43 7,44 8.222}
{0 CHEMBL556303,1 7.01,2 48.9,3 46.7,4 0.984,5 1.108,6 0.691,7 0.645,8 315.44,9 2.2,10 18,11 45,13 19,14 26,16 47,17 22,20 19,21 3,22 1,24 21,25 2,28 1,29 1,32 24,35 2.2,36 0.128,37 6,38 36,39 44.265,40 49.86,41 31.074,42 29.004,44 8.143}
{0 CHEMBL556487,1 7.49,2 42.3,3 44.2,4 1.002,5 1.128,6 0.669,7 0.64,8 389.5,9 9.6,10 17,11 52,13 18,14 33,16 56,17 22,20 14,21 8,22 1,24 23,25 7,28 5,29 2,32 29,35 3.8,36 0.071,37 4,38 42.5,39 52.116,40 58.647,41 34.79,42 33.278,44 7.824}
{0 CHEMBL556507,1 8.402,2 43.1,3 41.2,4 1.018,5 1.122,6 0.687,7 0.662,8 428.52,9 3.9,10 18,11 51,13 21,14 32,16 53,17 22,20 18,21 4,22 3,23 1,24 21,25 8,26 1,28 2,29 4,31 1,32 30,34 1,35 7.8,36 0.132,37 7,38 44,39 51.938,40 57.246,41 35.029,42 33.74,43 2,44 7.538}
{0 CHEMBL556716,1 8.395,2 46.2,3 40.4,4 1.012,5 1.116,6 0.703,7 0.674,8 436.54,9 3.8,10 18,11 52,13 22,14 33,16 54,17 24,19 1,20 19,21 4,22 3,23 1,24 21,25 7,26 1,28 2,29 3,31 1,32 31,33 1,34 1,35 5.8,36 0.13,37 7,38 47,39 52.611,40 58.037,41 36.574,42 35.026,43 1.9,44 8.046}
{0 CHEMBL556717,1 8.395,2 46.2,3 40.4,4 1.012,5 1.116,6 0.703,7 0.674,8 436.54,9 3.8,10 18,11 52,13 22,14 33,16 54,17 24,19 1,20 19,21 4,22 3,23 1,24 21,25 7,26 1,28 2,29 3,31 1,32 31,33 1,34 1,35 5.8,36 0.13,37 7,38 47,39 52.611,40 58.037,41 36.574,42 35.026,43 1.9,44 8.222}
{0 CHEMBL557032,1 7.657,2 41.2,3 43.1,4 1.007,5 1.132,6 0.667,7 0.643,8 390.49,9 11.8,10 17,11 51,13 18,14 33,16 55,17 21,20 13,21 8,22 1,24 22,25 8,28 6,29 2,32 29,35 3.9,36 0.073,37 4,38 42.5,39 51.334,40 57.73,41 34.034,42 32.772,44 7.77}
{0 CHEMBL559101,1 6.899,2 40,3 48.9,4 0.993,5 1.132,6 0.652,7 0.612,8 310.44,9 8.9,10 11,11 45,13 12,14 26,16 48,17 18,20 10,21 8,22 1,24 22,25 5,28 4,29 1,32 23,35 2.2,36 0.063,37 3,38 32.5,39 44.687,40 50.939,41 29.33,42 27.542,44 6.886}
{0 CHEMBL559531,1 7.724,2 42.9,3 42.9,4 1.01,5 1.125,6 0.669,7 0.647,8 432.52,9 7.1,10 17,11 56,13 19,14 36,16 60,17 24,20 16,21 8,22 2,24 24,25 8,28 4,29 4,32 32,35 7.1,36 0.083,37 5,38 46.5,39 56.552,40 62.983,41 37.455,42 36.213,44 7.77}
{0 CHEMBL560537,1 7.192,2 47.7,3 45.5,4 0.988,5 1.112,6 0.689,7 0.648,8 316.43,9 4.5,10 18,11 44,13 19,14 26,16 46,17 21,20 18,21 3,22 1,24 20,25 3,28 2,29 1,32 24,35 2.3,36 0.13,37 6,38 36,39 43.483,40 48.943,41 30.319,42 28.499,44 8.319}
{0 CHEMBL560538,1 7.069,2 44.1,3 47.1,4 0.992,5 1.121,6 0.67,7 0.631,8 240.33,9 5.9,10 12,11 34,13 13,14 19,16 35,17 15,20 12,21 3,22 1,24 16,25 3,28 2,29 1,32 18,35 2.9,36 0.143,37 5,38 26,39 33.716,40 38.112,41 22.796,42 21.445,44 7.155}
{0 CHEMBL560740,1 8.832,2 45.1,3 37.3,4 1.042,5 1.151,6 0.666,7 0.67,8 450.44,9 3.9,10 18,11 51,13 19,14 34,16 53,17 23,20 18,21 5,22 1,23 5,24 19,25 9,28 2,29 2,32 32,34 5,35 3.9,36 0.151,37 8,38 44,39 53.141,40 58.681,41 33.983,42 34.184,43 9.8,44 8.222}
{0 CHEMBL561259,1 7.265,2 39.5,3 46.5,4 1.003,5 1.133,6 0.652,7 0.622,8 312.41,9 9.3,10 11,11 43,13 12,14 26,16 46,17 17,20 9,21 8,22 1,24 20,25 6,28 4,29 2,32 23,35 4.7,36 0.065,37 3,38 32.5,39 43.131,40 48.734,41 28.023,42 26.73,44 7.252}
{0 CHEMBL561379,1 7.265,2 39.5,3 46.5,4 1.003,5 1.133,6 0.652,7 0.622,8 312.41,9 9.3,10 11,11 43,13 12,14 26,16 46,17 17,20 9,21 8,22 1,24 20,25 6,28 4,29 2,32 23,35 4.7,36 0.065,37 3,38 32.5,39 43.131,40 48.734,41 28.023,42 26.73,44 6.684}
{0 CHEMBL561479,1 7.031,2 46.8,3 46.8,4 0.987,5 1.114,6 0.683,7 0.639,8 330.46,9 4.3,10 18,11 47,13 19,14 27,16 49,17 22,20 18,21 4,22 1,24 22,25 3,28 2,29 1,32 25,35 2.1,36 0.143,37 7,38 37,39 46.367,40 52.358,41 32.08,42 30.026,44 7.585}
{0 CHEMBL561788,1 8.152,2 42.9,3 41.1,4 1.024,5 1.143,6 0.663,7 0.651,8 456.51,9 7.1,10 17,11 56,13 18,14 37,16 60,17 24,20 15,21 9,22 1,23 3,24 23,25 9,28 4,29 2,32 33,34 3,35 3.6,36 0.067,37 4,38 46.5,39 57.32,40 63.998,41 37.12,42 36.46,43 5.4,44 8.222}
{0 CHEMBL562081,1 8.59,2 42.1,3 42.1,4 1.018,5 1.118,6 0.696,7 0.661,8 489.63,9 1.8,10 18,11 57,13 23,14 35,16 59,17 24,20 19,21 5,22 5,23 1,24 24,25 9,26 2,28 1,29 5,31 2,32 33,34 1,35 8.8,36 0.136,37 8,38 49,39 58.007,40 63.707,41 39.648,42 37.674,43 1.8,44 8.097}
{0 CHEMBL562822,1 7.49,2 42.3,3 44.2,4 1.002,5 1.128,6 0.669,7 0.64,8 389.5,9 9.6,10 17,11 52,13 18,14 33,16 56,17 22,20 14,21 8,22 1,24 23,25 7,28 5,29 2,32 29,35 3.8,36 0.071,37 4,38 42.5,39 52.116,40 58.647,41 34.79,42 33.278,44 7.569}
{0 CHEMBL562869,1 6.925,2 38.3,3 48.9,4 0.996,5 1.137,6 0.645,7 0.608,8 325.46,9 10.6,10 11,11 47,13 12,14 27,16 50,17 18,20 9,21 9,22 1,24 23,25 6,28 5,29 1,32 24,35 2.1,36 0.06,37 3,38 33.5,39 46.789,40 53.438,41 30.336,42 28.563,44 6.77}
{0 CHEMBL562926,1 7.199,2 41.4,3 46.6,4 0.998,5 1.129,6 0.661,7 0.626,8 417.56,9 8.6,10 17,11 58,13 18,14 35,16 62,17 24,20 14,21 10,22 1,24 27,25 7,28 5,29 2,32 31,35 3.4,36 0.048,37 3,38 44.5,39 57.883,40 65.478,41 38.313,42 36.331,44 7.824}
{0 CHEMBL563216,1 8.009,2 47.7,3 40.9,4 1.012,5 1.128,6 0.686,7 0.665,8 352.41,9 4.5,10 18,11 44,13 19,14 28,16 46,17 21,20 18,21 3,22 1,23 2,24 18,25 5,28 2,29 1,32 26,34 2,35 2.3,36 0.13,37 6,38 38,39 44.509,40 49.622,41 30.194,42 29.265,43 4.5,44 8.155}
{0 CHEMBL563416,1 7.833,2 44.4,3 44.4,4 0.997,5 1.113,6 0.698,7 0.653,8 352.49,9 4.4,10 18,11 45,13 20,14 27,16 47,17 20,20 17,21 3,22 2,24 20,25 5,26 1,28 2,29 2,31 1,32 25,35 4.4,36 0.149,37 7,38 38,39 44.887,40 50.072,41 31.421,42 29.401,44 5.523}
{0 CHEMBL563417,1 8.187,2 46.7,3 40,4 1.019,5 1.13,6 0.681,7 0.666,8 368.41,9 4.4,10 18,11 45,13 19,14 29,16 47,17 21,20 18,21 3,22 1,23 2,24 18,25 6,28 2,29 2,32 27,34 2,35 4.4,36 0.128,37 6,38 39,39 45.836,40 50.832,41 30.648,42 29.98,43 4.4,44 8.046}
{0 CHEMBL563465,1 7.376,2 48.8,3 43.9,4 0.99,5 1.11,6 0.697,7 0.658,8 302.4,9 4.9,10 18,11 41,13 19,14 25,16 43,17 20,20 18,21 2,22 1,24 18,25 3,28 2,29 1,32 23,35 2.4,36 0.116,37 5,38 35,39 40.6,40 45.528,41 28.557,42 26.972,44 5.523}
{0 CHEMBL563527,1 7.031,2 46.8,3 46.8,4 0.987,5 1.114,6 0.683,7 0.639,8 330.46,9 4.3,10 18,11 47,13 19,14 27,16 49,17 22,20 18,21 4,22 1,24 22,25 3,28 2,29 1,32 25,35 2.1,36 0.143,37 7,38 37,39 46.367,40 52.358,41 32.08,42 30.026,44 6.824}
{0 CHEMBL563732,1 7.078,2 38.6,3 47.7,4 0.998,5 1.137,6 0.649,7 0.614,8 311.43,9 11.4,10 11,11 44,13 12,14 26,16 47,17 17,20 9,21 8,22 1,24 21,25 6,28 5,29 1,32 23,35 2.3,36 0.064,37 3,38 32.5,39 43.905,40 50.023,41 28.574,42 27.036,44 6.745}
{0 CHEMBL564145,1 8.25,2 44,3 42,4 1.012,5 1.121,6 0.691,7 0.661,8 412.52,9 4,10 18,11 50,13 21,14 31,16 52,17 22,20 18,21 4,22 3,23 1,24 21,25 7,26 1,28 2,29 3,31 1,32 29,34 1,35 6,36 0.135,37 7,38 43,39 50.611,40 56.037,41 34.574,42 33.026,43 2,44 7.854}
{0 CHEMBL564227,1 8.395,2 46.2,3 40.4,4 1.012,5 1.116,6 0.703,7 0.674,8 436.54,9 3.8,10 18,11 52,13 22,14 33,16 54,17 24,19 1,20 19,21 4,22 3,23 1,24 21,25 7,26 1,28 2,29 3,31 1,32 31,33 1,34 1,35 5.8,36 0.13,37 7,38 47,39 52.611,40 58.037,41 36.574,42 35.026,43 1.9,44 7.62}
{0 CHEMBL564547,1 7.097,2 39.1,3 47.8,4 1,5 1.134,6 0.647,7 0.614,8 326.44,9 8.7,10 11,11 46,13 12,14 27,16 49,17 18,20 9,21 9,22 1,24 22,25 6,28 4,29 2,32 24,35 4.3,36 0.061,37 3,38 33.5,39 46.014,40 52.149,41 29.784,42 28.256,44 7.319}
{0 CHEMBL564757,1 7.49,2 42.3,3 44.2,4 1.002,5 1.128,6 0.669,7 0.64,8 389.5,9 9.6,10 17,11 52,13 18,14 33,16 56,17 22,20 14,21 8,22 1,24 23,25 7,28 5,29 2,32 29,35 3.8,36 0.071,37 4,38 42.5,39 52.116,40 58.647,41 34.79,42 33.278,44 8}
{0 CHEMBL564893,1 8.832,2 45.1,3 37.3,4 1.042,5 1.151,6 0.666,7 0.67,8 450.44,9 3.9,10 18,11 51,13 19,14 34,16 53,17 23,20 18,21 5,22 1,23 5,24 19,25 9,28 2,29 2,32 32,34 5,35 3.9,36 0.151,37 8,38 44,39 53.141,40 58.681,41 33.983,42 34.184,43 9.8,44 8.155}
{0 CHEMBL564975,1 7.078,2 38.6,3 47.7,4 0.998,5 1.137,6 0.649,7 0.614,8 311.43,9 11.4,10 11,11 44,13 12,14 26,16 47,17 17,20 9,21 8,22 1,24 21,25 6,28 5,29 1,32 23,35 2.3,36 0.064,37 3,38 32.5,39 43.905,40 50.023,41 28.574,42 27.036,44 6.538}
{0 CHEMBL565028,1 7.192,2 47.7,3 45.5,4 0.988,5 1.112,6 0.689,7 0.648,8 316.43,9 4.5,10 18,11 44,13 19,14 26,16 46,17 21,20 18,21 3,22 1,24 20,25 3,28 2,29 1,32 24,35 2.3,36 0.13,37 6,38 36,39 43.483,40 48.943,41 30.319,42 28.499,44 7.745}
{0 CHEMBL565628,1 8.127,2 45.1,3 41.2,4 1.022,5 1.137,6 0.669,7 0.655,8 414.46,9 3.9,10 18,11 51,13 19,14 32,16 53,17 23,20 18,21 5,22 1,23 3,24 21,25 7,28 2,29 2,32 30,34 3,35 3.9,36 0.151,37 8,38 42,39 52.116,40 58.002,41 34.108,42 33.417,43 5.9,44 8.108}
{0 CHEMBL565841,1 9.441,2 42.1,3 36.8,4 1.047,5 1.15,6 0.676,7 0.675,8 358.77,9 5.3,10 12,11 38,13 13,14 25,16 39,17 16,18 1,20 12,21 4,22 1,23 3,24 14,25 8,26 1,28 2,29 2,32 24,34 4,35 5.3,36 0.154,37 6,38 32,39 39.789,40 43.7,41 25.682,42 25.664,43 10.5,44 8.155}
{0 CHEMBL565941,1 9.351,2 50,3 31.6,4 1.039,5 1.137,6 0.707,7 0.713,8 355.34,9 7.9,10 22,11 38,13 22,14 29,16 41,17 19,20 18,21 1,23 3,24 12,25 7,28 3,29 1,32 26,34 3,35 2.6,36 0.073,37 3,38 40,39 39.472,40 43.215,41 26.853,42 27.09,43 7.9,44 7.699}
{0 CHEMBL565942,1 9.351,2 50,3 31.6,4 1.039,5 1.137,6 0.707,7 0.713,8 355.34,9 7.9,10 22,11 38,13 22,14 29,16 41,17 19,20 18,21 1,23 3,24 12,25 7,28 3,29 1,32 26,34 3,35 2.6,36 0.073,37 3,38 40,39 39.472,40 43.215,41 26.853,42 27.09,43 7.9,44 7.721}
{0 CHEMBL565960,1 8.135,2 53.1,3 37.5,4 0.998,5 1.103,6 0.727,7 0.7,8 260.31,9 6.3,10 21,11 32,13 21,14 23,16 35,17 17,20 17,24 12,25 3,28 2,29 1,32 20,35 3.1,36 0.057,37 2,38 33.5,39 31.949,40 35.282,41 23.273,42 22.392,44 5.337}
{0 CHEMBL566038,1 6.671,2 43.5,3 50,4 0.984,5 1.121,6 0.663,7 0.615,8 413.61,9 4.8,10 18,11 62,13 19,14 34,16 65,17 27,20 18,21 9,22 1,24 31,25 4,28 3,29 1,32 31,35 1.6,36 0.138,37 9,38 44,39 61.003,40 69.517,41 41.131,42 38.154,44 8.046}
{0 CHEMBL566047,1 9.146,2 38.6,3 38.6,4 1.047,5 1.148,6 0.662,7 0.659,8 402.43,9 4.5,10 12,11 44,13 15,14 28,16 45,17 17,20 12,21 5,22 3,23 3,24 17,25 10,26 1,28 2,29 4,31 1,32 27,34 3,35 9.1,36 0.156,37 7,38 37,39 46.08,40 50.51,41 29.142,42 28.98,43 6.8,44 6.796}
{0 CHEMBL566048,1 9.824,2 37,3 37,4 1.054,5 1.151,6 0.674,7 0.67,8 451.89,9 6.5,10 12,11 46,13 15,14 30,16 47,17 17,18 1,20 12,21 5,22 3,23 3,24 17,25 12,26 2,28 3,29 4,31 1,32 29,34 4,35 8.7,36 0.17,37 8,38 39,39 48.505,40 52.952,41 31.006,42 30.829,43 8.7,44 7.721}
{0 CHEMBL566648,1 11.6,2 40.5,3 31,4 1.082,5 1.172,6 0.672,7 0.697,8 487.22,9 4.8,10 12,11 42,13 13,14 30,15 1,16 43,17 17,20 12,21 5,22 1,23 6,24 13,25 12,26 1,28 2,29 3,32 29,34 7,35 7.1,36 0.163,37 7,38 37,39 45.443,40 49.241,41 28.205,42 29.253,43 16.7,44 8.155}
{0 CHEMBL566658,1 9.146,2 38.6,3 38.6,4 1.047,5 1.148,6 0.662,7 0.659,8 402.43,9 4.5,10 12,11 44,13 15,14 28,16 45,17 17,20 12,21 5,22 3,23 3,24 17,25 10,26 1,28 2,29 4,31 1,32 27,34 3,35 9.1,36 0.156,37 7,38 37,39 46.08,40 50.51,41 29.142,42 28.98,43 6.8,44 7.602}
{0 CHEMBL567109,1 9.872,2 43.3,3 36.7,4 1.023,5 1.122,6 0.733,7 0.702,8 296.17,9 10,10 12,11 30,13 13,14 20,16 31,17 13,18 2,20 12,21 1,22 1,24 11,25 6,26 2,28 3,29 1,32 19,34 2,35 3.3,36 0.097,37 3,38 27,39 30.698,40 33.668,41 21.994,42 21.068,43 6.7,44 6.367}
{0 CHEMBL567110,1 9.722,2 40.5,3 33.3,4 1.077,5 1.176,6 0.639,7 0.672,8 408.33,9 4.8,10 12,11 42,13 13,14 29,16 43,17 17,20 12,21 5,22 1,23 6,24 14,25 11,28 2,29 3,32 28,34 6,35 7.1,36 0.163,37 7,38 36,39 45.214,40 49.4,41 26.853,42 28.228,43 14.3,44 8.222}
{0 CHEMBL567283,1 8.792,2 40.5,3 42.9,4 1.019,5 1.125,6 0.689,7 0.657,8 369.27,9 4.8,10 6,11 42,13 10,14 25,16 43,17 17,18 2,20 12,21 5,22 4,24 18,25 7,26 2,28 2,29 3,32 24,34 2,35 7.1,36 0.163,37 7,38 32,39 42.785,40 47.25,41 28.943,42 27.583,43 4.8,44 8.222}
{0 CHEMBL567294,1 9.926,2 39.5,3 32.6,4 1.056,5 1.16,6 0.679,7 0.691,8 426.82,9 14,10 17,11 43,13 18,14 31,16 45,17 17,18 1,20 13,21 4,22 1,23 3,24 14,25 12,26 1,28 6,29 2,32 29,34 4,35 4.7,36 0.156,37 7,38 40.5,39 45.429,40 49.863,41 29.182,42 29.696,43 9.3,44 6.745}
{0 CHEMBL567314,1 9.841,2 43.6,3 33.3,4 1.051,5 1.148,6 0.69,7 0.696,8 383.78,9 7.7,10 12,11 39,13 14,14 27,16 40,17 17,18 1,19 1,20 12,21 4,22 1,23 3,24 13,25 9,26 1,28 3,29 2,32 26,33 1,34 4,35 5.1,36 0.15,37 6,38 36,39 41.007,40 44.783,41 26.926,42 27.159,43 10.3,44 8.097}
{0 CHEMBL567491,1 6.975,2 43.1,3 48.3,4 0.994,5 1.121,6 0.66,7 0.621,8 404.55,9 3.4,10 12,11 58,13 16,14 32,16 60,17 25,20 18,21 7,22 4,24 28,25 5,28 2,29 3,32 30,35 5.2,36 0.167,37 10,38 42,39 57.672,40 65.022,41 38.273,42 36.036,44 8.398}
{0 CHEMBL567503,1 7.387,2 46.7,3 44.4,4 0.996,5 1.114,6 0.684,7 0.649,8 332.43,9 4.4,10 12,11 45,13 16,14 27,16 47,17 21,20 18,21 3,22 4,24 20,25 4,28 2,29 2,32 25,35 4.4,36 0.128,37 6,38 37,39 44.811,40 50.152,41 30.773,42 29.214,44 8}
{0 CHEMBL567703,1 8.862,2 42.6,3 38.9,4 1.034,5 1.136,6 0.679,7 0.667,8 478.53,9 3.7,10 18,11 54,13 21,14 35,16 56,17 23,20 18,21 5,22 3,23 3,24 21,25 10,26 1,28 2,29 4,31 1,32 33,34 3,35 7.4,36 0.143,37 8,38 47,39 55.847,40 61.341,41 36.665,42 36.034,43 5.6,44 8.367}
{0 CHEMBL568231,1 9.214,2 52.3,3 31.8,4 1.031,5 1.128,6 0.718,7 0.719,8 405.4,9 6.8,10 27,11 44,13 27,14 34,16 48,17 23,20 22,21 1,23 3,24 14,25 7,28 3,29 1,32 30,34 3,35 2.3,36 0.063,37 3,38 47.5,39 45.356,40 49.63,41 31.614,42 31.617,43 6.8,44 7.523}
{0 CHEMBL568342,1 8.225,2 41.3,3 45.7,4 1.003,5 1.125,6 0.691,7 0.646,8 378.33,9 6.5,10 12,11 46,13 13,14 27,16 48,17 19,18 2,20 12,21 7,22 1,24 21,25 6,26 2,28 3,29 1,32 25,34 2,35 2.2,36 0.125,37 6,38 34,39 46.116,40 51.744,41 31.801,42 29.702,43 4.3,44 6.301}
{0 CHEMBL568544,1 9.929,2 38.6,3 36.4,4 1.055,5 1.147,6 0.682,7 0.677,8 436.87,9 4.5,10 12,11 44,13 15,14 29,16 45,17 17,18 1,20 12,21 5,22 3,23 3,24 16,25 11,26 2,28 2,29 4,31 1,32 28,34 4,35 9.1,36 0.156,37 7,38 38,39 46.403,40 50.454,41 30,42 29.808,43 9.1,44 7.796}
{0 CHEMBL568696,1 10.82,2 46.9,3 25,4 1.091,5 1.179,6 0.677,7 0.726,8 346.25,9 6.3,10 16,11 32,13 16,14 26,16 34,17 15,20 13,21 2,23 6,24 8,25 9,28 2,29 1,32 24,34 6,35 3.1,36 0.059,37 2,38 34,39 34.909,40 37.735,41 21.659,42 23.218,43 18.8,44 5.824}
{0 CHEMBL568770,1 10.247,2 44.8,3 34.5,4 1.032,5 1.117,6 0.739,7 0.716,8 297.15,9 6.9,10 6,11 29,13 10,14 20,16 30,17 13,18 2,20 12,21 1,22 4,24 10,25 6,26 2,28 2,29 2,32 19,34 2,35 6.9,36 0.1,37 3,38 27,39 29.924,40 32.379,41 21.443,42 20.761,43 6.9,44 6.481}
{0 CHEMBL568773,1 7.205,2 45.7,3 45.7,4 0.991,5 1.118,6 0.681,7 0.642,8 331.45,9 6.5,10 18,11 46,13 19,14 27,16 48,17 21,20 18,21 3,22 1,24 21,25 4,28 3,29 1,32 25,35 2.2,36 0.125,37 6,38 37,39 45.585,40 51.441,41 31.324,42 29.52,44 8.071}
{0 CHEMBL569141,1 7.192,2 47.7,3 45.5,4 0.988,5 1.112,6 0.689,7 0.648,8 316.43,9 4.5,10 18,11 44,13 19,14 26,16 46,17 21,20 18,21 3,22 1,24 20,25 3,28 2,29 1,32 24,35 2.3,36 0.13,37 6,38 36,39 43.483,40 48.943,41 30.319,42 28.499,44 7.367}
{0 CHEMBL571898,1 7.192,2 47.7,3 45.5,4 0.988,5 1.112,6 0.689,7 0.648,8 316.43,9 4.5,10 18,11 44,13 19,14 26,16 46,17 21,20 18,21 3,22 1,24 20,25 3,28 2,29 1,32 24,35 2.3,36 0.13,37 6,38 36,39 43.483,40 48.943,41 30.319,42 28.499,44 8.119}
{0 CHEMBL572205,1 10.834,2 42.9,3 31.4,4 1.064,5 1.149,6 0.708,7 0.713,8 379.18,9 5.7,10 12,11 35,13 13,14 25,16 36,17 15,18 2,20 12,21 3,22 1,23 3,24 11,25 9,26 2,28 2,29 2,32 24,34 5,35 5.7,36 0.139,37 5,38 32,39 37.229,40 40.229,41 24.779,42 24.965,43 14.3,44 8.137}
{0 CHEMBL572206,1 9.441,2 42.1,3 36.8,4 1.047,5 1.15,6 0.676,7 0.675,8 358.77,9 5.3,10 12,11 38,13 13,14 25,16 39,17 16,18 1,20 12,21 4,22 1,23 3,24 14,25 8,26 1,28 2,29 2,32 24,34 4,35 5.3,36 0.154,37 6,38 32,39 39.789,40 43.7,41 25.682,42 25.664,43 10.5,44 7.658}
{0 CHEMBL576212,1 9.149,2 51.2,3 32.6,4 1.032,5 1.131,6 0.712,7 0.712,8 393.39,9 7,10 26,11 43,13 26,14 33,16 47,17 22,20 21,21 1,23 3,24 14,25 7,28 3,29 1,32 29,34 3,35 2.3,36 0.064,37 3,38 46,39 44.356,40 48.63,41 30.614,42 30.617,43 7,44 7.387}
{0 CHEMBL576449,1 8.535,2 42.1,3 39.5,4 1.039,5 1.151,6 0.653,7 0.654,8 324.33,9 5.3,10 12,11 38,13 13,14 24,16 39,17 16,20 12,21 4,22 1,23 3,24 15,25 7,28 2,29 2,32 23,34 3,35 5.3,36 0.154,37 6,38 31,39 39.465,40 43.756,41 24.824,42 24.837,43 7.9,44 7.301}
{0 CHEMBL576459,1 9.547,2 51.3,3 30.8,4 1.045,5 1.14,6 0.706,7 0.717,8 372.34,9 5.1,10 22,11 39,13 22,14 30,16 42,17 20,20 19,21 1,23 4,24 12,25 7,28 2,29 1,32 27,34 4,35 2.6,36 0.071,37 3,38 41,39 40.767,40 44.471,41 27.546,42 27.978,43 10.3,44 7.26}
{0 CHEMBL576719,1 9.595,2 48.3,3 31,4 1.051,5 1.148,6 0.693,7 0.708,8 278.25,9 6.9,10 16,11 29,13 16,14 22,16 31,17 14,20 13,21 1,23 3,24 9,25 6,28 2,29 1,32 20,34 3,35 3.4,36 0.065,37 2,38 30,39 30.487,40 33.301,41 20.085,42 20.542,43 10.3,44 7.119}
{0 CHEMBL576833,1 10.056,2 50,3 28.6,4 1.064,5 1.156,6 0.695,7 0.721,8 422.35,9 4.8,10 22,11 42,13 22,14 33,16 45,17 21,20 19,21 2,23 6,24 12,25 9,28 2,29 1,32 30,34 6,35 2.4,36 0.067,37 3,38 44,39 44.676,40 48.566,41 29.182,42 30.272,43 14.3,44 6.244}
{0 CHEMBL577044,1 10.056,2 50,3 28.6,4 1.064,5 1.156,6 0.695,7 0.721,8 422.35,9 4.8,10 22,11 42,13 22,14 33,16 45,17 21,20 19,21 2,23 6,24 12,25 9,28 2,29 1,32 30,34 6,35 2.4,36 0.067,37 3,38 44,39 44.676,40 48.566,41 29.182,42 30.272,43 14.3,44 6.886}
{0 CHEMBL577689,1 11.201,2 45.2,3 22.6,4 1.101,5 1.188,6 0.674,7 0.733,8 347.24,9 9.7,10 16,11 31,13 16,14 26,16 33,17 14,20 12,21 2,23 6,24 7,25 10,28 3,29 1,32 24,34 6,35 3.2,36 0.061,37 2,38 34,39 34.127,40 36.819,41 20.904,42 22.713,43 19.4,44 5}
{0 CHEMBL577695,1 10.82,2 46.9,3 25,4 1.091,5 1.179,6 0.677,7 0.726,8 346.25,9 6.3,10 16,11 32,13 16,14 26,16 34,17 15,20 13,21 2,23 6,24 8,25 9,28 2,29 1,32 24,34 6,35 3.1,36 0.059,37 2,38 34,39 34.909,40 37.735,41 21.659,42 23.218,43 18.8,44 6.896}
{0 CHEMBL577696,1 9.009,2 48.8,3 34.1,4 1.033,5 1.137,6 0.698,7 0.698,8 369.37,9 7.3,10 22,11 41,13 22,14 30,16 44,17 20,20 18,21 2,23 3,24 14,25 7,28 3,29 1,32 27,34 3,35 2.4,36 0.068,37 3,38 41,39 42.356,40 46.63,41 28.614,42 28.617,43 7.3,44 6.538}
{0 CHEMBL578048,1 9.808,2 46.7,3 30,4 1.06,5 1.15,6 0.685,7 0.709,8 294.25,9 6.7,10 16,11 30,13 16,14 23,16 32,17 14,20 13,21 1,23 3,24 9,25 7,28 2,29 2,32 21,34 3,35 6.7,36 0.094,37 3,38 31,39 31.814,40 34.511,41 20.54,42 21.256,43 10,44 6.77}
{0 CHEMBL578151,1 11.201,2 45.2,3 22.6,4 1.101,5 1.188,6 0.674,7 0.733,8 347.24,9 9.7,10 16,11 31,13 16,14 26,16 33,17 14,20 12,21 2,23 6,24 7,25 10,28 3,29 1,32 24,34 6,35 3.2,36 0.061,37 2,38 34,39 34.127,40 36.819,41 20.904,42 22.713,43 19.4,44 6.523}
{0 CHEMBL578548,1 10.056,2 50,3 28.6,4 1.064,5 1.156,6 0.695,7 0.721,8 422.35,9 4.8,10 22,11 42,13 22,14 33,16 45,17 21,20 19,21 2,23 6,24 12,25 9,28 2,29 1,32 30,34 6,35 2.4,36 0.067,37 3,38 44,39 44.676,40 48.566,41 29.182,42 30.272,43 14.3,44 7.102}
{0 CHEMBL578782,1 7.954,2 52.8,3 38.9,4 0.995,5 1.103,6 0.723,7 0.692,8 286.35,9 5.6,10 22,11 36,13 22,14 25,16 39,17 19,20 19,24 14,25 3,28 2,29 1,32 22,35 2.8,36 0.077,37 3,38 36,39 35.833,40 39.697,41 26.034,42 24.918,44 6.131}
{0 CHEMBL583880,1 10.056,2 50,3 28.6,4 1.064,5 1.156,6 0.695,7 0.721,8 422.35,9 4.8,10 22,11 42,13 22,14 33,16 45,17 21,20 19,21 2,23 6,24 12,25 9,28 2,29 1,32 30,34 6,35 2.4,36 0.067,37 3,38 44,39 44.676,40 48.566,41 29.182,42 30.272,43 14.3,44 7.155}
{0 CHEMBL584050,1 9.149,2 51.2,3 32.6,4 1.032,5 1.131,6 0.712,7 0.712,8 393.39,9 7,10 26,11 43,13 26,14 33,16 47,17 22,20 21,21 1,23 3,24 14,25 7,28 3,29 1,32 29,34 3,35 2.3,36 0.064,37 3,38 46,39 44.356,40 48.63,41 30.614,42 30.617,43 7,44 7.114}
{0 CHEMBL584611,1 11.201,2 45.2,3 22.6,4 1.101,5 1.188,6 0.674,7 0.733,8 347.24,9 9.7,10 16,11 31,13 16,14 26,16 33,17 14,20 12,21 2,23 6,24 7,25 10,28 3,29 1,32 24,34 6,35 3.2,36 0.061,37 2,38 34,39 34.127,40 36.819,41 20.904,42 22.713,43 19.4,44 5.469}
{0 CHEMBL585011,1 9.808,2 46.7,3 30,4 1.06,5 1.15,6 0.685,7 0.709,8 294.25,9 6.7,10 16,11 30,13 16,14 23,16 32,17 14,20 13,21 1,23 3,24 9,25 7,28 2,29 2,32 21,34 3,35 6.7,36 0.094,37 3,38 31,39 31.814,40 34.511,41 20.54,42 21.256,43 10,44 6.796}
{0 CHEMBL585949,1 9.929,2 38.6,3 36.4,4 1.055,5 1.147,6 0.682,7 0.677,8 436.87,9 4.5,10 12,11 44,13 15,14 29,16 45,17 17,18 1,20 12,21 5,22 3,23 3,24 16,25 11,26 2,28 2,29 4,31 1,32 28,34 4,35 9.1,36 0.156,37 7,38 38,39 46.403,40 50.454,41 30,42 29.808,43 9.1,44 7.959}
{0 CHEMBL589136,1 8.867,2 39.5,3 41.9,4 1.018,5 1.131,6 0.692,7 0.66,8 381.29,9 9.3,10 12,11 43,13 13,14 27,16 45,17 17,18 2,20 11,21 6,22 1,24 18,25 8,26 2,28 4,29 2,32 25,34 2,35 4.7,36 0.089,37 4,38 34,39 43.778,40 48.622,41 29.739,42 28.385,43 4.7,44 7.959}
{0 CHEMBL590600,1 8.218,2 39.5,3 41.9,4 1.034,5 1.155,6 0.642,7 0.637,8 353.38,9 7,10 11,11 43,13 12,14 27,16 45,17 17,20 11,21 6,22 1,23 3,24 18,25 8,28 3,29 2,32 25,34 3,35 4.7,36 0.067,37 3,38 33.5,39 44.451,40 49.67,41 27.591,42 27.385,43 7,44 7.959}
{0 CHEMBL608263,1 8.819,2 41.7,3 41.7,4 1.021,5 1.122,6 0.691,7 0.663,8 423.32,9 4.2,10 12,11 48,13 14,14 30,16 50,17 20,18 2,20 14,21 6,22 2,24 20,25 8,26 2,28 2,29 4,32 28,34 2,35 8.3,36 0.1,37 5,38 38,39 48.996,40 53.874,41 33.159,42 31.825,43 4.2,44 8.276}
