{
  "data_features": {
    "feature": [
      {
        "data_type": "nominal",
        "index": "0",
        "is_ignore": "false",
        "is_row_identifier": "true",
        "is_target": "false",
        "name": "molecule_id",
        "nominal_value": [
          "CHEMBL100004",
          "CHEMBL100145",
          "CHEMBL100150",
          "CHEMBL100159",
          "CHEMBL100190",
          "CHEMBL100201",
          "CHEMBL100251",
          "CHEMBL100257",
          "CHEMBL100281",
          "CHEMBL100321",
          "CHEMBL100340",
          "CHEMBL100493",
          "CHEMBL100497",
          "CHEMBL100522",
          "CHEMBL100547",
          "CHEMBL100597",
          "CHEMBL100641",
          "CHEMBL100642",
          "CHEMBL100809",
          "CHEMBL100839",
          "CHEMBL100851",
          "CHEMBL100853",
          "CHEMBL100894",
          "CHEMBL100971",
          "CHEMBL101245",
          "CHEMBL101342",
          "CHEMBL101760",
          "CHEMBL101794",
          "CHEMBL101957",
          "CHEMBL102070",
          "CHEMBL102666",
          "CHEMBL102774",
          "CHEMBL102918",
          "CHEMBL103171",
          "CHEMBL103180",
          "CHEMBL103231",
          "CHEMBL103287",
          "CHEMBL103368",
          "CHEMBL103393",
          "CHEMBL103408",
          "CHEMBL103465",
          "CHEMBL103476",
          "CHEMBL103477",
          "CHEMBL103533",
          "CHEMBL103546",
          "CHEMBL103560",
          "CHEMBL103561",
          "CHEMBL103571",
          "CHEMBL103584",
          "CHEMBL103596",
          "CHEMBL103636",
          "CHEMBL103694",
          "CHEMBL103753",
          "CHEMBL103761",
          "CHEMBL103773",
          "CHEMBL103801",
          "CHEMBL103903",
          "CHEMBL103995",
          "CHEMBL105500",
          "CHEMBL106350",
          "CHEMBL106475",
          "CHEMBL106526",
          "CHEMBL106564",
          "CHEMBL106800",
          "CHEMBL106819",
          "CHEMBL106908",
          "CHEMBL107113",
          "CHEMBL107159",
          "CHEMBL107198",
          "CHEMBL107241",
          "CHEMBL107321",
          "CHEMBL107881",
          "CHEMBL107951",
          "CHEMBL108086",
          "CHEMBL108238",
          "CHEMBL108260",
          "CHEMBL108291",
          "CHEMBL108295",
          "CHEMBL108714",
          "CHEMBL109083",
          "CHEMBL112481",
          "CHEMBL113603",
          "CHEMBL115529",
          "CHEMBL115695",
          "CHEMBL1160079",
          "CHEMBL1160088",
          "CHEMBL116198",
          "CHEMBL116325",
          "CHEMBL116515",
          "CHEMBL116938",
          "CHEMBL11696",
          "CHEMBL11713",
          "CHEMBL117250",
          "CHEMBL11731",
          "CHEMBL11754",
          "CHEMBL117733",
          "CHEMBL118017",
          "CHEMBL118182",
          "CHEMBL118247",
          "CHEMBL118302",
          "CHEMBL118511",
          "CHEMBL118672",
          "CHEMBL11872",
          "CHEMBL118780",
          "CHEMBL118793",
          "CHEMBL118813",
          "CHEMBL118840",
          "CHEMBL119317",
          "CHEMBL119366",
          "CHEMBL119371",
          "CHEMBL119412",
          "CHEMBL119417",
          "CHEMBL119425",
          "CHEMBL119439",
          "CHEMBL119452",
          "CHEMBL119470",
          "CHEMBL11962",
          "CHEMBL119659",
          "CHEMBL119660",
          "CHEMBL119763",
          "CHEMBL11977",
          "CHEMBL119847",
          "CHEMBL11989",
          "CHEMBL12012",
          "CHEMBL120322",
          "CHEMBL1203313",
          "CHEMBL120515",
          "CHEMBL12055",
          "CHEMBL12067",
          "CHEMBL12119",
          "CHEMBL12125",
          "CHEMBL12183",
          "CHEMBL12337",
          "CHEMBL12352",
          "CHEMBL123570",
          "CHEMBL12368",
          "CHEMBL12382",
          "CHEMBL12399",
          "CHEMBL124071",
          "CHEMBL124184",
          "CHEMBL124312",
          "CHEMBL12438",
          "CHEMBL12439",
          "CHEMBL124394",
          "CHEMBL124521",
          "CHEMBL124523",
          "CHEMBL124534",
          "CHEMBL124535",
          "CHEMBL124562",
          "CHEMBL124581",
          "CHEMBL124747",
          "CHEMBL124799",
          "CHEMBL124906",
          "CHEMBL124980",
          "CHEMBL124985",
          "CHEMBL12499",
          "CHEMBL125078",
          "CHEMBL125080",
          "CHEMBL125315",
          "CHEMBL125411",
          "CHEMBL125412",
          "CHEMBL125418",
          "CHEMBL125419",
          "CHEMBL125465",
          "CHEMBL125513",
          "CHEMBL12554",
          "CHEMBL12556",
          "CHEMBL125576",
          "CHEMBL12558",
          "CHEMBL125680",
          "CHEMBL125903",
          "CHEMBL126016",
          "CHEMBL126302",
          "CHEMBL126523",
          "CHEMBL126524",
          "CHEMBL126814",
          "CHEMBL126958",
          "CHEMBL126981",
          "CHEMBL127009",
          "CHEMBL127010",
          "CHEMBL12708",
          "CHEMBL127183",
          "CHEMBL127266",
          "CHEMBL127324",
          "CHEMBL127374",
          "CHEMBL127416",
          "CHEMBL127417",
          "CHEMBL127419",
          "CHEMBL127446",
          "CHEMBL127464",
          "CHEMBL127678",
          "CHEMBL127704",
          "CHEMBL12773",
          "CHEMBL127746",
          "CHEMBL127766",
          "CHEMBL127799",
          "CHEMBL127875",
          "CHEMBL127887",
          "CHEMBL127890",
          "CHEMBL128034",
          "CHEMBL12836",
          "CHEMBL12882",
          "CHEMBL130034",
          "CHEMBL131597",
          "CHEMBL131690",
          "CHEMBL132028",
          "CHEMBL132246",
          "CHEMBL132636",
          "CHEMBL132655",
          "CHEMBL132665",
          "CHEMBL132780",
          "CHEMBL132821",
          "CHEMBL132824",
          "CHEMBL132852",
          "CHEMBL133120",
          "CHEMBL133197",
          "CHEMBL133425",
          "CHEMBL133457",
          "CHEMBL133555",
          "CHEMBL133565",
          "CHEMBL133586",
          "CHEMBL133742",
          "CHEMBL133921",
          "CHEMBL133964",
          "CHEMBL134025",
          "CHEMBL134094",
          "CHEMBL134123",
          "CHEMBL134143",
          "CHEMBL134877",
          "CHEMBL134965",
          "CHEMBL13835",
          "CHEMBL14604",
          "CHEMBL147079",
          "CHEMBL147337",
          "CHEMBL148491",
          "CHEMBL148549",
          "CHEMBL149102",
          "CHEMBL150892",
          "CHEMBL150968",
          "CHEMBL151075",
          "CHEMBL151310",
          "CHEMBL151688",
          "CHEMBL153901",
          "CHEMBL154113",
          "CHEMBL154205",
          "CHEMBL154282",
          "CHEMBL154459",
          "CHEMBL154481",
          "CHEMBL154536",
          "CHEMBL154537",
          "CHEMBL154591",
          "CHEMBL154856",
          "CHEMBL154993",
          "CHEMBL155003",
          "CHEMBL155380",
          "CHEMBL155500",
          "CHEMBL155540",
          "CHEMBL155590",
          "CHEMBL155650",
          "CHEMBL155654",
          "CHEMBL155663",
          "CHEMBL155821",
          "CHEMBL156251",
          "CHEMBL156397",
          "CHEMBL156402",
          "CHEMBL156510",
          "CHEMBL156823",
          "CHEMBL156891",
          "CHEMBL156926",
          "CHEMBL156972",
          "CHEMBL157123",
          "CHEMBL157246",
          "CHEMBL157330",
          "CHEMBL157596",
          "CHEMBL157989",
          "CHEMBL158006",
          "CHEMBL158254",
          "CHEMBL158268",
          "CHEMBL158384",
          "CHEMBL158489",
          "CHEMBL158907",
          "CHEMBL158908",
          "CHEMBL158974",
          "CHEMBL159007",
          "CHEMBL159055",
          "CHEMBL160529",
          "CHEMBL160530",
          "CHEMBL160653",
          "CHEMBL160759",
          "CHEMBL160888",
          "CHEMBL160910",
          "CHEMBL160994",
          "CHEMBL160995",
          "CHEMBL161096",
          "CHEMBL161127",
          "CHEMBL161597",
          "CHEMBL161674",
          "CHEMBL162251",
          "CHEMBL170370",
          "CHEMBL170398",
          "CHEMBL170749",
          "CHEMBL171294",
          "CHEMBL172484",
          "CHEMBL172697",
          "CHEMBL172819",
          "CHEMBL172859",
          "CHEMBL172949",
          "CHEMBL173104",
          "CHEMBL173122",
          "CHEMBL173157",
          "CHEMBL173191",
          "CHEMBL173215",
          "CHEMBL173304",
          "CHEMBL173318",
          "CHEMBL173471",
          "CHEMBL173497",
          "CHEMBL173531",
          "CHEMBL173571",
          "CHEMBL173584",
          "CHEMBL173586",
          "CHEMBL173642",
          "CHEMBL173742",
          "CHEMBL174104",
          "CHEMBL174183",
          "CHEMBL174192",
          "CHEMBL174198",
          "CHEMBL174262",
          "CHEMBL174402",
          "CHEMBL174454",
          "CHEMBL174479",
          "CHEMBL174550",
          "CHEMBL174592",
          "CHEMBL174618",
          "CHEMBL174668",
          "CHEMBL174859",
          "CHEMBL174989",
          "CHEMBL176678",
          "CHEMBL176725",
          "CHEMBL176797",
          "CHEMBL177351",
          "CHEMBL1788193",
          "CHEMBL1793831",
          "CHEMBL17997",
          "CHEMBL1907928",
          "CHEMBL204022",
          "CHEMBL20869",
          "CHEMBL20873",
          "CHEMBL2093039",
          "CHEMBL20974",
          "CHEMBL21033",
          "CHEMBL2114048",
          "CHEMBL2114467",
          "CHEMBL2115332",
          "CHEMBL2115490",
          "CHEMBL227457",
          "CHEMBL24879",
          "CHEMBL258053",
          "CHEMBL258253",
          "CHEMBL262427",
          "CHEMBL262465",
          "CHEMBL263022",
          "CHEMBL263675",
          "CHEMBL263933",
          "CHEMBL264467",
          "CHEMBL264497",
          "CHEMBL265057",
          "CHEMBL265773",
          "CHEMBL266184",
          "CHEMBL266886",
          "CHEMBL267229",
          "CHEMBL267357",
          "CHEMBL268596",
          "CHEMBL268597",
          "CHEMBL268965",
          "CHEMBL269131",
          "CHEMBL269132",
          "CHEMBL269133",
          "CHEMBL269134",
          "CHEMBL269340",
          "CHEMBL273392",
          "CHEMBL273445",
          "CHEMBL273638",
          "CHEMBL273639",
          "CHEMBL273776",
          "CHEMBL273945",
          "CHEMBL274110",
          "CHEMBL274420",
          "CHEMBL274843",
          "CHEMBL275573",
          "CHEMBL275912",
          "CHEMBL277186",
          "CHEMBL280164",
          "CHEMBL283282",
          "CHEMBL28509",
          "CHEMBL28595",
          "CHEMBL288399",
          "CHEMBL28902",
          "CHEMBL290038",
          "CHEMBL29067",
          "CHEMBL290693",
          "CHEMBL290840",
          "CHEMBL291177",
          "CHEMBL291332",
          "CHEMBL291372",
          "CHEMBL291432",
          "CHEMBL291515",
          "CHEMBL291668",
          "CHEMBL292508",
          "CHEMBL292550",
          "CHEMBL292704",
          "CHEMBL292734",
          "CHEMBL292860",
          "CHEMBL293259",
          "CHEMBL293457",
          "CHEMBL293641",
          "CHEMBL293642",
          "CHEMBL293653",
          "CHEMBL293662",
          "CHEMBL293862",
          "CHEMBL293906",
          "CHEMBL293916",
          "CHEMBL294589",
          "CHEMBL294983",
          "CHEMBL295148",
          "CHEMBL295205",
          "CHEMBL295212",
          "CHEMBL295379",
          "CHEMBL295434",
          "CHEMBL295639",
          "CHEMBL295916",
          "CHEMBL296047",
          "CHEMBL296072",
          "CHEMBL296238",
          "CHEMBL296432",
          "CHEMBL296539",
          "CHEMBL29665",
          "CHEMBL296668",
          "CHEMBL296785",
          "CHEMBL296849",
          "CHEMBL296921",
          "CHEMBL296958",
          "CHEMBL296973",
          "CHEMBL297147",
          "CHEMBL297182",
          "CHEMBL297298",
          "CHEMBL297375",
          "CHEMBL297458",
          "CHEMBL297623",
          "CHEMBL297624",
          "CHEMBL297765",
          "CHEMBL297778",
          "CHEMBL297797",
          "CHEMBL297974",
          "CHEMBL297988",
          "CHEMBL298011",
          "CHEMBL298209",
          "CHEMBL299944",
          "CHEMBL301484",
          "CHEMBL302683",
          "CHEMBL302696",
          "CHEMBL302863",
          "CHEMBL302900",
          "CHEMBL303312",
          "CHEMBL303357",
          "CHEMBL303480",
          "CHEMBL304190",
          "CHEMBL304427",
          "CHEMBL304453",
          "CHEMBL304879",
          "CHEMBL305105",
          "CHEMBL305145",
          "CHEMBL305372",
          "CHEMBL307760",
          "CHEMBL313414",
          "CHEMBL314343",
          "CHEMBL314507",
          "CHEMBL314577",
          "CHEMBL314708",
          "CHEMBL314744",
          "CHEMBL315854",
          "CHEMBL316463",
          "CHEMBL316666",
          "CHEMBL316911",
          "CHEMBL316969",
          "CHEMBL317069",
          "CHEMBL317090",
          "CHEMBL317116",
          "CHEMBL317119",
          "CHEMBL31714",
          "CHEMBL317193",
          "CHEMBL317335",
          "CHEMBL317357",
          "CHEMBL317380",
          "CHEMBL317735",
          "CHEMBL317745",
          "CHEMBL318009",
          "CHEMBL318044",
          "CHEMBL318159",
          "CHEMBL318163",
          "CHEMBL318172",
          "CHEMBL318348",
          "CHEMBL318460",
          "CHEMBL318563",
          "CHEMBL318590",
          "CHEMBL318874",
          "CHEMBL318908",
          "CHEMBL319229",
          "CHEMBL319325",
          "CHEMBL319346",
          "CHEMBL319603",
          "CHEMBL319609",
          "CHEMBL319806",
          "CHEMBL319811",
          "CHEMBL319960",
          "CHEMBL320226",
          "CHEMBL320371",
          "CHEMBL320676",
          "CHEMBL320855",
          "CHEMBL320900",
          "CHEMBL321486",
          "CHEMBL321722",
          "CHEMBL322184",
          "CHEMBL322772",
          "CHEMBL322832",
          "CHEMBL323023",
          "CHEMBL323067",
          "CHEMBL323151",
          "CHEMBL323290",
          "CHEMBL323382",
          "CHEMBL323407",
          "CHEMBL323429",
          "CHEMBL323940",
          "CHEMBL324121",
          "CHEMBL324154",
          "CHEMBL324709",
          "CHEMBL325700",
          "CHEMBL325928",
          "CHEMBL326012",
          "CHEMBL326039",
          "CHEMBL326077",
          "CHEMBL326201",
          "CHEMBL326215",
          "CHEMBL326474",
          "CHEMBL326517",
          "CHEMBL327034",
          "CHEMBL327732",
          "CHEMBL327771",
          "CHEMBL327953",
          "CHEMBL328632",
          "CHEMBL329498",
          "CHEMBL329508",
          "CHEMBL330219",
          "CHEMBL330269",
          "CHEMBL330708",
          "CHEMBL331124",
          "CHEMBL331512",
          "CHEMBL331566",
          "CHEMBL331567",
          "CHEMBL332448",
          "CHEMBL332455",
          "CHEMBL332542",
          "CHEMBL332848",
          "CHEMBL333242",
          "CHEMBL333674",
          "CHEMBL333780",
          "CHEMBL334275",
          "CHEMBL334852",
          "CHEMBL335044",
          "CHEMBL335113",
          "CHEMBL335176",
          "CHEMBL335432",
          "CHEMBL335556",
          "CHEMBL335853",
          "CHEMBL336612",
          "CHEMBL336816",
          "CHEMBL338090",
          "CHEMBL338127",
          "CHEMBL338260",
          "CHEMBL338345",
          "CHEMBL338368",
          "CHEMBL338441",
          "CHEMBL338475",
          "CHEMBL338476",
          "CHEMBL338519",
          "CHEMBL338689",
          "CHEMBL338828",
          "CHEMBL338850",
          "CHEMBL338883",
          "CHEMBL338940",
          "CHEMBL338977",
          "CHEMBL339006",
          "CHEMBL339676",
          "CHEMBL340164",
          "CHEMBL340247",
          "CHEMBL340480",
          "CHEMBL340489",
          "CHEMBL340544",
          "CHEMBL340989",
          "CHEMBL341265",
          "CHEMBL341513",
          "CHEMBL345213",
          "CHEMBL345420",
          "CHEMBL345748",
          "CHEMBL345909",
          "CHEMBL346367",
          "CHEMBL346391",
          "CHEMBL346722",
          "CHEMBL346787",
          "CHEMBL347349",
          "CHEMBL347433",
          "CHEMBL347488",
          "CHEMBL347593",
          "CHEMBL347597",
          "CHEMBL348494",
          "CHEMBL348623",
          "CHEMBL349327",
          "CHEMBL350437",
          "CHEMBL350819",
          "CHEMBL351410",
          "CHEMBL351759",
          "CHEMBL351997",
          "CHEMBL352872",
          "CHEMBL353618",
          "CHEMBL354819",
          "CHEMBL358635",
          "CHEMBL366508",
          "CHEMBL366553",
          "CHEMBL366987",
          "CHEMBL366998",
          "CHEMBL367011",
          "CHEMBL367085",
          "CHEMBL367130",
          "CHEMBL367160",
          "CHEMBL367295",
          "CHEMBL367393",
          "CHEMBL367398",
          "CHEMBL367418",
          "CHEMBL367425",
          "CHEMBL367530",
          "CHEMBL367673",
          "CHEMBL367786",
          "CHEMBL367922",
          "CHEMBL367941",
          "CHEMBL367964",
          "CHEMBL368113",
          "CHEMBL368162",
          "CHEMBL368185",
          "CHEMBL368292",
          "CHEMBL368410",
          "CHEMBL368586",
          "CHEMBL368657",
          "CHEMBL368923",
          "CHEMBL369225",
          "CHEMBL369233",
          "CHEMBL369395",
          "CHEMBL369411",
          "CHEMBL369578",
          "CHEMBL369614",
          "CHEMBL369643",
          "CHEMBL369854",
          "CHEMBL380444",
          "CHEMBL414007",
          "CHEMBL414696",
          "CHEMBL417045",
          "CHEMBL417432",
          "CHEMBL417532",
          "CHEMBL417563",
          "CHEMBL418125",
          "CHEMBL418309",
          "CHEMBL418792",
          "CHEMBL418989",
          "CHEMBL419071",
          "CHEMBL419620",
          "CHEMBL419779",
          "CHEMBL419786",
          "CHEMBL41988",
          "CHEMBL420092",
          "CHEMBL420527",
          "CHEMBL420697",
          "CHEMBL420826",
          "CHEMBL421103",
          "CHEMBL421204",
          "CHEMBL421618",
          "CHEMBL421827",
          "CHEMBL421843",
          "CHEMBL421954",
          "CHEMBL422003",
          "CHEMBL422160",
          "CHEMBL423305",
          "CHEMBL423524",
          "CHEMBL423711",
          "CHEMBL423891",
          "CHEMBL424947",
          "CHEMBL425688",
          "CHEMBL426579",
          "CHEMBL427121",
          "CHEMBL42725",
          "CHEMBL427307",
          "CHEMBL42848",
          "CHEMBL429877",
          "CHEMBL430638",
          "CHEMBL430741",
          "CHEMBL430748",
          "CHEMBL431037",
          "CHEMBL431049",
          "CHEMBL431069",
          "CHEMBL431470",
          "CHEMBL431664",
          "CHEMBL432832",
          "CHEMBL433015",
          "CHEMBL433516",
          "CHEMBL433795",
          "CHEMBL434028",
          "CHEMBL434460",
          "CHEMBL435037",
          "CHEMBL435115",
          "CHEMBL43887",
          "CHEMBL43993",
          "CHEMBL439937",
          "CHEMBL440088",
          "CHEMBL44060",
          "CHEMBL440663",
          "CHEMBL44110",
          "CHEMBL442170",
          "CHEMBL44281",
          "CHEMBL44316",
          "CHEMBL44434",
          "CHEMBL445097",
          "CHEMBL445355",
          "CHEMBL44540",
          "CHEMBL44597",
          "CHEMBL44617",
          "CHEMBL44679",
          "CHEMBL44740",
          "CHEMBL44844",
          "CHEMBL44846",
          "CHEMBL44887",
          "CHEMBL44975",
          "CHEMBL44978",
          "CHEMBL44995",
          "CHEMBL44997",
          "CHEMBL45073",
          "CHEMBL45092",
          "CHEMBL45182",
          "CHEMBL45321",
          "CHEMBL46375",
          "CHEMBL46421",
          "CHEMBL46615",
          "CHEMBL46616",
          "CHEMBL46643",
          "CHEMBL46682",
          "CHEMBL46735",
          "CHEMBL46752",
          "CHEMBL46754",
          "CHEMBL46762",
          "CHEMBL46870",
          "CHEMBL46907",
          "CHEMBL46928",
          "CHEMBL46972",
          "CHEMBL46976",
          "CHEMBL47069",
          "CHEMBL47073",
          "CHEMBL47149",
          "CHEMBL47158",
          "CHEMBL47159",
          "CHEMBL47167",
          "CHEMBL47192",
          "CHEMBL47199",
          "CHEMBL47219",
          "CHEMBL47531",
          "CHEMBL475534",
          "CHEMBL47760",
          "CHEMBL47843",
          "CHEMBL47998",
          "CHEMBL48129",
          "CHEMBL514432",
          "CHEMBL538043",
          "CHEMBL539263",
          "CHEMBL539673",
          "CHEMBL540829",
          "CHEMBL541329",
          "CHEMBL541330",
          "CHEMBL542731",
          "CHEMBL543420",
          "CHEMBL543662",
          "CHEMBL543663",
          "CHEMBL543897",
          "CHEMBL544141",
          "CHEMBL544368",
          "CHEMBL544606",
          "CHEMBL544607",
          "CHEMBL545072",
          "CHEMBL545075",
          "CHEMBL545304",
          "CHEMBL545306",
          "CHEMBL545536",
          "CHEMBL545684",
          "CHEMBL545770",
          "CHEMBL545771",
          "CHEMBL545773",
          "CHEMBL552673",
          "CHEMBL552771",
          "CHEMBL552805",
          "CHEMBL553093",
          "CHEMBL553152",
          "CHEMBL554052",
          "CHEMBL554398",
          "CHEMBL554462",
          "CHEMBL554463",
          "CHEMBL554536",
          "CHEMBL555357",
          "CHEMBL555553",
          "CHEMBL555567",
          "CHEMBL555768",
          "CHEMBL555796",
          "CHEMBL555845",
          "CHEMBL559013",
          "CHEMBL56800",
          "CHEMBL56856",
          "CHEMBL56917",
          "CHEMBL57542",
          "CHEMBL60081",
          "CHEMBL603",
          "CHEMBL60359",
          "CHEMBL60477",
          "CHEMBL60676",
          "CHEMBL60996",
          "CHEMBL61014",
          "CHEMBL61384",
          "CHEMBL61416",
          "CHEMBL61627",
          "CHEMBL61678",
          "CHEMBL61680",
          "CHEMBL61936",
          "CHEMBL61937",
          "CHEMBL6202",
          "CHEMBL6203",
          "CHEMBL6211",
          "CHEMBL6217",
          "CHEMBL62219",
          "CHEMBL62284",
          "CHEMBL62308",
          "CHEMBL6232",
          "CHEMBL62322",
          "CHEMBL62424",
          "CHEMBL6244",
          "CHEMBL62497",
          "CHEMBL62503",
          "CHEMBL62530",
          "CHEMBL6263",
          "CHEMBL62650",
          "CHEMBL6270",
          "CHEMBL62722",
          "CHEMBL62725",
          "CHEMBL62812",
          "CHEMBL62815",
          "CHEMBL62822",
          "CHEMBL62830",
          "CHEMBL62873",
          "CHEMBL62904",
          "CHEMBL62942",
          "CHEMBL62983",
          "CHEMBL63100",
          "CHEMBL63111",
          "CHEMBL6319",
          "CHEMBL6322",
          "CHEMBL63383",
          "CHEMBL6341",
          "CHEMBL6350",
          "CHEMBL6359",
          "CHEMBL64034",
          "CHEMBL64035",
          "CHEMBL64057",
          "CHEMBL64094",
          "CHEMBL64125",
          "CHEMBL64180",
          "CHEMBL64194",
          "CHEMBL64198",
          "CHEMBL64209",
          "CHEMBL64214",
          "CHEMBL64285",
          "CHEMBL64428",
          "CHEMBL64445",
          "CHEMBL64449",
          "CHEMBL64462",
          "CHEMBL64464",
          "CHEMBL64472",
          "CHEMBL64493",
          "CHEMBL64587",
          "CHEMBL646",
          "CHEMBL64621",
          "CHEMBL64636",
          "CHEMBL64669",
          "CHEMBL64691",
          "CHEMBL64716",
          "CHEMBL64745",
          "CHEMBL64764",
          "CHEMBL64860",
          "CHEMBL64882",
          "CHEMBL65089",
          "CHEMBL65132",
          "CHEMBL65144",
          "CHEMBL65199",
          "CHEMBL65228",
          "CHEMBL65377",
          "CHEMBL65556",
          "CHEMBL65715",
          "CHEMBL661",
          "CHEMBL66185",
          "CHEMBL66234",
          "CHEMBL66344",
          "CHEMBL66374",
          "CHEMBL66396",
          "CHEMBL66414",
          "CHEMBL66495",
          "CHEMBL66537",
          "CHEMBL66814",
          "CHEMBL66826",
          "CHEMBL66933",
          "CHEMBL67016",
          "CHEMBL67031",
          "CHEMBL67232",
          "CHEMBL67302",
          "CHEMBL67396",
          "CHEMBL67618",
          "CHEMBL68407",
          "CHEMBL68653",
          "CHEMBL70229",
          "CHEMBL8529",
          "CHEMBL86916",
          "CHEMBL87164",
          "CHEMBL88886",
          "CHEMBL89018",
          "CHEMBL89059",
          "CHEMBL89088",
          "CHEMBL89784",
          "CHEMBL90243",
          "CHEMBL90271",
          "CHEMBL90504",
          "CHEMBL92585",
          "CHEMBL93223",
          "CHEMBL93374",
          "CHEMBL93677",
          "CHEMBL93807",
          "CHEMBL93952",
          "CHEMBL94138",
          "CHEMBL95440",
          "CHEMBL98046",
          "CHEMBL98090",
          "CHEMBL98318",
          "CHEMBL98359",
          "CHEMBL98813",
          "CHEMBL98818",
          "CHEMBL98831",
          "CHEMBL98835",
          "CHEMBL98844",
          "CHEMBL98853",
          "CHEMBL98874",
          "CHEMBL98990",
          "CHEMBL98999",
          "CHEMBL99053",
          "CHEMBL99070",
          "CHEMBL99385",
          "CHEMBL99395",
          "CHEMBL99413",
          "CHEMBL99481",
          "CHEMBL99528",
          "CHEMBL99583",
          "CHEMBL99621",
          "CHEMBL99721",
          "CHEMBL99754",
          "CHEMBL99773",
          "CHEMBL99794",
          "CHEMBL99795",
          "CHEMBL99833",
          "CHEMBL99920",
          "CHEMBL99928",
          "CHEMBL99966",
          "CHEMBL99976"
        ],
        "number_of_missing_values": "0"
      },
      {
        "data_type": "numeric",
        "index": "1",
        "is_ignore": "false",
        "is_row_identifier": "false",
        "is_target": "false",
        "name": "AMW",
        "number_of_missing_values": "0"
      },
      {
        "data_type": "numeric",
        "index": "2",
        "is_ignore": "false",
        "is_row_identifier": "false",
        "is_target": "false",
        "name": "C.",
        "number_of_missing_values": "0"
      },
      {
        "data_type": "numeric",
        "index": "3",
        "is_ignore": "false",
        "is_row_identifier": "false",
        "is_target": "false",
        "name": "H.",
        "number_of_missing_values": "0"
      },
      {
        "data_type": "numeric",
        "index": "4",
        "is_ignore": "false",
        "is_row_identifier": "false",
        "is_target": "false",
        "name": "Me",
        "number_of_missing_values": "0"
      },
      {
        "data_type": "numeric",
        "index": "5",
        "is_ignore": "false",
        "is_row_identifier": "false",
        "is_target": "false",
        "name": "Mi",
        "number_of_missing_values": "0"
      },
      {
        "data_type": "numeric",
        "index": "6",
        "is_ignore": "false",
        "is_row_identifier": "false",
        "is_target": "false",
        "name": "Mp",
        "number_of_missing_values": "0"
      },
      {
        "data_type": "numeric",
        "index": "7",
        "is_ignore": "false",
        "is_row_identifier": "false",
        "is_target": "false",
        "name": "Mv",
        "number_of_missing_values": "0"
      },
      {
        "data_type": "numeric",
        "index": "8",
        "is_ignore": "false",
        "is_row_identifier": "false",
        "is_target": "false",
        "name": "MW",
        "number_of_missing_values": "0"
      },
      {
        "data_type": "numeric",
        "index": "9",
        "is_ignore": "false",
        "is_row_identifier": "false",
        "is_target": "false",
        "name": "N.",
        "number_of_missing_values": "0"
      },
      {
        "data_type": "numeric",
        "index": "10",
        "is_ignore": "false",
        "is_row_identifier": "false",
        "is_target": "false",
        "name": "nAB",
        "number_of_missing_values": "0"
      },
      {
        "data_type": "numeric",
        "index": "11",
        "is_ignore": "false",
        "is_row_identifier": "false",
        "is_target": "false",
        "name": "nAT",
        "number_of_missing_values": "0"
      },
      {
        "data_type": "numeric",
        "index": "12",
        "is_ignore": "false",
        "is_row_identifier": "false",
        "is_target": "false",
        "name": "nB",
        "number_of_missing_values": "0"
      },
      {
        "data_type": "numeric",
        "index": "13",
        "is_ignore": "false",
        "is_row_identifier": "false",
        "is_target": "false",
        "name": "nBM",
        "number_of_missing_values": "0"
      },
      {
        "data_type": "numeric",
        "index": "14",
        "is_ignore": "false",
        "is_row_identifier": "false",
        "is_target": "false",
        "name": "nBO",
        "number_of_missing_values": "0"
      },
      {
        "data_type": "numeric",
        "index": "15",
        "is_ignore": "false",
        "is_row_identifier": "false",
        "is_target": "false",
        "name": "nBR",
        "number_of_missing_values": "0"
      },
      {
        "data_type": "numeric",
        "index": "16",
        "is_ignore": "false",
        "is_row_identifier": "false",
        "is_target": "false",
        "name": "nBT",
        "number_of_missing_values": "0"
      },
      {
        "data_type": "numeric",
        "index": "17",
        "is_ignore": "false",
        "is_row_identifier": "false",
        "is_target": "false",
        "name": "nC",
        "number_of_missing_values": "0"
      },
      {
        "data_type": "numeric",
        "index": "18",
        "is_ignore": "false",
        "is_row_identifier": "false",
        "is_target": "false",
        "name": "nCL",
        "number_of_missing_values": "0"
      },
      {
        "data_type": "numeric",
        "index": "19",
        "is_ignore": "false",
        "is_row_identifier": "false",
        "is_target": "false",
        "name": "nCsp",
        "number_of_missing_values": "0"
      },
      {
        "data_type": "numeric",
        "index": "20",
        "is_ignore": "false",
        "is_row_identifier": "false",
        "is_target": "false",
        "name": "nCsp2",
        "number_of_missing_values": "0"
      },
      {
        "data_type": "numeric",
        "index": "21",
        "is_ignore": "false",
        "is_row_identifier": "false",
        "is_target": "false",
        "name": "nCsp3",
        "number_of_missing_values": "0"
      },
      {
        "data_type": "numeric",
        "index": "22",
        "is_ignore": "false",
        "is_row_identifier": "false",
        "is_target": "false",
        "name": "nDB",
        "number_of_missing_values": "0"
      },
      {
        "data_type": "numeric",
        "index": "23",
        "is_ignore": "false",
        "is_row_identifier": "false",
        "is_target": "false",
        "name": "nF",
        "number_of_missing_values": "0"
      },
      {
        "data_type": "numeric",
        "index": "24",
        "is_ignore": "false",
        "is_row_identifier": "false",
        "is_target": "false",
        "name": "nH",
        "number_of_missing_values": "0"
      },
      {
        "data_type": "numeric",
        "index": "25",
        "is_ignore": "false",
        "is_row_identifier": "false",
        "is_target": "false",
        "name": "nHet",
        "number_of_missing_values": "0"
      },
      {
        "data_type": "numeric",
        "index": "26",
        "is_ignore": "false",
        "is_row_identifier": "false",
        "is_target": "false",
        "name": "nHM",
        "number_of_missing_values": "0"
      },
      {
        "data_type": "numeric",
        "index": "27",
        "is_ignore": "false",
        "is_row_identifier": "false",
        "is_target": "false",
        "name": "nI",
        "number_of_missing_values": "0"
      },
      {
        "data_type": "numeric",
        "index": "28",
        "is_ignore": "false",
        "is_row_identifier": "false",
        "is_target": "false",
        "name": "nN",
        "number_of_missing_values": "0"
      },
      {
        "data_type": "numeric",
        "index": "29",
        "is_ignore": "false",
        "is_row_identifier": "false",
        "is_target": "false",
        "name": "nO",
        "number_of_missing_values": "0"
      },
      {
        "data_type": "numeric",
        "index": "30",
        "is_ignore": "false",
        "is_row_identifier": "false",
        "is_target": "false",
        "name": "nP",
        "number_of_missing_values": "0"
      },
      {
        "data_type": "numeric",
        "index": "31",
        "is_ignore": "false",
        "is_row_identifier": "false",
        "is_target": "false",
        "name": "nS",
        "number_of_missing_values": "0"
      },
      {
        "data_type": "numeric",
        "index": "32",
        "is_ignore": "false",
        "is_row_identifier": "false",
        "is_target": "false",
        "name": "nSK",
        "number_of_missing_values": "0"
      },
      {
        "data_type": "numeric",
        "index": "33",
        "is_ignore": "false",
        "is_row_identifier": "false",
        "is_target": "false",
        "name": "nTB",
        "number_of_missing_values": "0"
      },
      {
        "data_type": "numeric",
        "index": "34",
        "is_ignore": "false",
        "is_row_identifier": "false",
        "is_target": "false",
        "name": "nX",
        "number_of_missing_values": "0"
      },
      {
        "data_type": "numeric",
        "index": "35",
        "is_ignore": "false",
        "is_row_identifier": "false",
        "is_target": "false",
        "name": "O.",
        "number_of_missing_values": "0"
      },
      {
        "data_type": "numeric",
        "index": "36",
        "is_ignore": "false",
        "is_row_identifier": "false",
        "is_target": "false",
        "name": "RBF",
        "number_of_missing_values": "0"
      },
      {
        "data_type": "numeric",
        "index": "37",
        "is_ignore": "false",
        "is_row_identifier": "false",
        "is_target": "false",
        "name": "RBN",
        "number_of_missing_values": "0"
      },
      {
        "data_type": "numeric",
        "index": "38",
        "is_ignore": "false",
        "is_row_identifier": "false",
        "is_target": "false",
        "name": "SCBO",
        "number_of_missing_values": "0"
      },
      {
        "data_type": "numeric",
        "index": "39",
        "is_ignore": "false",
        "is_row_identifier": "false",
        "is_target": "false",
        "name": "Se",
        "number_of_missing_values": "0"
      },
      {
        "data_type": "numeric",
        "index": "40",
        "is_ignore": "false",
        "is_row_identifier": "false",
        "is_target": "false",
        "name": "Si",
        "number_of_missing_values": "0"
      },
      {
        "data_type": "numeric",
        "index": "41",
        "is_ignore": "false",
        "is_row_identifier": "false",
        "is_target": "false",
        "name": "Sp",
        "number_of_missing_values": "0"
      },
      {
        "data_type": "numeric",
        "index": "42",
        "is_ignore": "false",
        "is_row_identifier": "false",
        "is_target": "false",
        "name": "Sv",
        "number_of_missing_values": "0"
      },
      {
        "data_type": "numeric",
        "index": "43",
        "is_ignore": "false",
        "is_row_identifier": "false",
        "is_target": "false",
        "name": "X.",
        "number_of_missing_values": "0"
      },
      {
        "data_type": "numeric",
        "index": "44",
        "is_ignore": "false",
        "is_row_identifier": "false",
        "is_target": "true",
        "name": "pXC50",
        "number_of_missing_values": "0"
      }
    ]
  }
}