"molecule_id","SpMax2_Bh.p.","nRCOOR","SpMax3_Bh.s.","SpMax4_Bh.m.","SssCH2","GATS1v","P_VSA_s_3","SpMin3_Bh.s.","C.008","nCrs","NsssCH","SpMin2_Bh.i.","SsssCH","SpDiam_AEA.bo.","CATS2D_04_AA","AAC","AECC","ALOGP","ALOGP2","AMR","AMW","ARR","ATS1e","ATS1i","ATS1m","ATS1p","ATS1s","ATS1v","ATS2e","ATS2i","ATS2m","ATS2p","ATS2s","ATS2v","ATS3e","ATS3i","ATS3m","ATS3p","ATS3s","ATS3v","ATS4e","ATS4i","ATS4m","ATS4p","ATS4s","ATS4v","ATS5e","ATS5i","ATS5m","ATS5p","ATS5s","ATS5v","ATS6e","ATS6i","ATS6m","ATS6p","ATS6s","ATS6v","ATS7e","ATS7i","ATS7m","ATS7p","ATS7s","ATS7v","ATS8e","ATS8i","pXC50"
{1 3.905,3 6.999,4 3.412,6 0.694,7 19.313,8 0.614,10 1,12 1.853,14 5.752,16 1.973,17 7.273,18 1.507,19 2.27,20 81.987,21 10.266,22 0.5,23 3.652,24 3.715,25 3.633,26 3.3,27 4.878,28 3.275,29 4.156,30 4.223,31 3.979,32 3.708,33 5.787,34 3.689,35 4.441,36 4.547,37 4.151,38 3.861,39 5.854,40 3.824,41 4.52,42 4.643,43 4.116,44 3.794,45 6.122,46 3.771,47 4.437,48 4.607,49 3.806,50 3.655,51 5.748,52 3.591,53 4.289,54 4.439,55 3.86,56 3.514,57 5.949,58 3.443,59 4.111,60 4.269,61 3.654,62 3.32,63 5.546,64 3.249,65 3.79,66 3.943,67 4.959}
{0 CHEMBL112,1 3.289,3 4.65,4 2.687,6 0.921,7 7.461,8 0.218,12 1.392,14 4.75,16 1.595,17 5.455,18 0.683,19 0.466,20 40.834,21 7.559,22 0.545,23 3.087,24 3.198,25 2.624,26 2.583,27 4.359,28 2.578,29 3.492,30 3.647,31 2.904,32 2.85,33 4.814,34 2.825,35 3.696,36 3.879,37 2.747,38 2.838,39 4.988,40 2.794,41 3.557,42 3.802,43 2.463,44 2.644,45 4.684,46 2.544,47 3.308,48 3.531,49 2.251,50 2.396,51 4.579,52 2.295,53 3.107,54 3.359,55 1.76,56 2.026,57 4.256,58 1.905,59 2.644,60 2.929,61 1.502,62 1.435,63 4.229,64 1.326,65 1.938,66 2.086,67 5.149}
{0 CHEMBL1142,1 2.835,3 4.351,4 2.246,6 0.785,7 2.757,8 0.079,12 0.931,14 4.478,16 1.563,17 3.75,18 0.816,19 0.666,20 32.453,21 7.276,22 0.75,23 2.815,24 2.94,25 2.317,26 2.327,27 4.111,28 2.314,29 3.145,30 3.286,31 2.56,32 2.602,33 4.419,34 2.558,35 3.354,36 3.551,37 2.362,38 2.534,39 4.61,40 2.446,41 3.206,42 3.505,43 1.572,44 2.063,45 4.185,46 1.862,47 2.523,48 2.882,49 1.052,50 1.277,51 3.638,52 1.06,53 1.524,54 1.701,55 0.279,56 0.46,57 2.833,58 0.455,59 1.02,60 1.365,61 0.014,62 0.255,63 1.099,64 0.13,67 5.022}
{0 CHEMBL116438,1 3.849,3 6.467,4 3.35,6 0.899,7 21.991,8 0.788,12 1.886,14 4.914,16 1.423,17 12.741,18 3.357,19 11.271,20 105.416,21 7.839,22 0.429,23 3.939,24 4.018,25 3.509,26 3.454,27 5.239,28 3.458,29 4.36,30 4.48,31 3.802,32 3.758,33 5.638,34 3.754,35 4.561,36 4.685,37 3.888,38 3.872,39 5.92,40 3.848,41 4.646,42 4.817,43 3.757,44 3.843,45 5.94,46 3.782,47 4.634,48 4.841,49 3.614,50 3.768,51 5.833,52 3.69,53 4.509,54 4.707,55 3.517,56 3.655,57 5.72,58 3.58,59 4.414,60 4.625,61 3.548,62 3.534,63 5.707,64 3.485,65 4.3,66 4.465,67 4.947}
{0 CHEMBL118,1 3.921,3 7.999,4 3.617,6 0.857,7 16.192,8 0.772,12 1.9,14 5.518,16 1.964,17 9.308,18 4.552,19 20.716,20 93.418,21 9.535,22 0.607,23 3.826,24 3.914,25 3.731,26 3.416,27 5.051,28 3.406,29 4.361,30 4.477,31 4.095,32 3.769,33 6.258,34 3.775,35 4.518,36 4.669,37 4.033,38 3.867,39 5.978,40 3.841,41 4.618,42 4.81,43 3.958,44 3.836,45 5.991,46 3.809,47 4.521,48 4.729,49 3.841,50 3.771,51 5.759,52 3.739,53 4.42,54 4.586,55 3.977,56 3.708,57 5.911,58 3.711,59 4.542,60 4.73,61 3.983,62 3.635,63 6.188,64 3.663,65 4.418,66 4.632,67 4.155}
{0 CHEMBL119296,1 3.191,3 3.936,4 2.215,5 5.043,6 1.508,7 11.815,8 0.431,12 1.31,14 3.604,16 1.206,17 4.714,18 -0.378,19 0.143,20 31.979,21 4.867,23 3.05,24 3.254,25 2.148,26 2.399,27 3.97,28 2.297,29 3.576,30 3.854,31 2.135,32 2.697,33 4.287,34 2.491,35 3.83,36 4.192,37 1.98,38 2.693,39 4.401,40 2.415,41 3.63,42 3.998,43 1.771,44 2.457,45 4.238,46 2.182,47 3.382,48 3.757,49 1.507,50 2.148,51 4.043,52 1.877,53 3.051,54 3.441,55 1.155,56 1.724,57 3.932,58 1.449,59 2.523,60 2.939,61 0.371,62 1.135,63 3.219,64 0.856,65 1.515,66 1.922,67 6.301}
{0 CHEMBL1214193,1 3.362,3 4.315,4 2.845,5 6.476,6 1.502,7 15.169,8 0.961,12 1.47,14 3.838,16 1.274,17 7.727,18 -2.209,19 4.878,20 48.183,21 5.171,23 3.456,24 3.664,25 2.622,26 2.741,27 4.369,28 2.67,29 4.001,30 4.284,31 2.657,32 3.047,33 4.751,34 2.884,35 4.253,36 4.61,37 2.576,38 3.097,39 4.909,40 2.865,41 4.117,42 4.471,43 2.432,44 2.992,45 4.712,46 2.758,47 3.995,48 4.339,49 2.313,50 2.891,51 4.605,52 2.651,53 3.927,54 4.29,55 2.175,56 2.732,57 4.551,58 2.489,59 3.728,60 4.095,61 2.013,62 2.517,63 4.46,64 2.279,65 3.484,66 3.849,67 4.201}
{0 CHEMBL1214194,1 3.465,3 4.217,4 3.196,5 6.869,6 1.717,7 12.634,8 0.993,12 1.565,14 4.454,16 1.214,17 8.75,18 0.736,19 0.542,20 74.045,21 5.01,23 3.832,24 4.02,25 3.021,26 3.132,27 4.642,28 3.044,29 4.446,30 4.762,31 3.183,32 3.464,33 5.059,34 3.345,35 4.578,36 4.841,37 3.152,38 3.728,39 5.226,40 3.519,41 4.907,42 5.268,43 3.101,44 3.751,45 5.373,46 3.465,47 4.761,48 5.142,49 3.088,50 3.568,51 5.264,52 3.366,53 4.475,54 4.734,55 2.887,56 3.617,57 5.15,58 3.373,59 4.808,60 5.205,61 2.717,62 3.52,63 5.2,64 3.177,65 4.359,66 4.744,67 6.284}
{0 CHEMBL1214195,1 3.426,3 4.363,4 2.965,5 1.469,6 0.902,7 12.114,8 0.691,12 1.497,14 5.279,16 1.296,17 6.214,18 1.718,19 2.952,20 60.652,21 6.653,22 0.733,23 3.405,24 3.551,25 2.875,26 2.984,27 4.461,28 2.932,29 3.879,30 4.066,31 3.132,32 3.342,33 4.837,34 3.252,35 4.13,36 4.384,37 3.156,38 3.426,39 5.007,40 3.304,41 4.048,42 4.299,43 2.971,44 3.316,45 4.902,46 3.174,47 3.967,48 4.228,49 2.729,50 3.187,51 4.778,52 3.009,53 3.862,54 4.156,55 2.396,56 2.959,57 4.648,58 2.74,59 3.636,60 3.963,61 1.99,62 2.594,63 4.435,64 2.347,65 3.201,66 3.565,67 6.377}
{0 CHEMBL1214248,1 3.515,3 7.999,4 3.46,5 4.546,6 1.305,7 32.182,8 1.169,12 1.607,14 5.357,16 1.867,17 15.462,18 0.715,19 0.512,20 83.465,21 7.888,23 3.987,24 4.134,25 3.513,26 3.273,27 5.165,28 3.312,29 4.618,30 4.831,31 3.968,32 3.584,33 6.491,34 3.598,35 4.839,36 5.117,37 3.873,38 3.674,39 6.49,40 3.603,41 4.768,42 5.062,43 3.519,44 3.645,45 5.796,46 3.544,47 4.762,48 5.05,49 3.499,50 3.593,51 5.886,52 3.511,53 4.705,54 4.992,55 3.47,56 3.506,57 5.885,58 3.435,59 4.638,60 4.935,61 3.447,62 3.415,63 5.915,64 3.342,65 4.487,66 4.765,67 4.939}
{0 CHEMBL1214249,1 3.444,3 7.999,4 3.367,5 1.436,6 1.266,7 24.578,8 1.002,12 1.535,14 5.352,16 1.977,17 13.13,18 0.011,20 69.091,21 8.593,23 3.811,24 3.954,25 3.403,26 3.049,27 5.071,28 3.129,29 4.435,30 4.639,31 3.889,32 3.332,33 6.448,34 3.407,35 4.619,36 4.883,37 3.785,38 3.414,39 6.436,40 3.396,41 4.523,42 4.8,43 3.387,44 3.381,45 5.661,46 3.325,47 4.542,48 4.819,49 3.381,50 3.3,51 5.814,52 3.272,53 4.462,54 4.751,55 3.356,56 3.186,57 5.847,58 3.162,59 4.281,60 4.546,61 3.233,62 3.106,63 5.543,64 3.098,65 4.27,66 4.524,67 4.018}
{0 CHEMBL12567,1 3.424,2 1,3 6.351,4 3.009,6 0.836,7 24.959,8 0.542,12 1.488,14 5.34,15 1,16 1.516,17 6.25,18 1.448,19 2.097,20 54.086,21 9.175,22 0.353,23 3.337,24 3.38,25 3.046,26 2.834,27 4.711,28 2.892,29 3.785,30 3.855,31 3.412,32 3.154,33 5.351,34 3.214,35 3.917,36 3.993,37 3.448,38 3.263,39 5.308,40 3.314,41 3.959,42 4.051,43 3.398,44 3.183,45 5.43,46 3.226,47 3.97,48 4.115,49 3.259,50 2.912,51 5.738,52 2.962,53 3.578,54 3.745,55 2.579,56 2.374,57 5.03,58 2.418,59 2.929,60 3.065,61 2.164,62 1.97,63 4.522,64 1.96,65 2.724,66 2.874,67 5.119}
{0 CHEMBL1356238,1 2.942,3 4.067,4 2.416,6 0.893,7 1.122,8 0.05,12 0.903,14 4.759,16 1.914,17 3.5,18 0.734,19 0.539,20 34.08,21 9.783,22 0.75,23 2.689,24 2.773,25 2.495,26 2.335,27 3.994,28 2.263,29 3.041,30 3.15,31 2.807,32 2.574,33 4.376,34 2.513,35 3.226,36 3.392,37 2.831,38 2.58,39 4.685,40 2.448,41 2.87,42 3.078,43 1.845,44 2.008,45 4.152,46 1.761,47 1.927,48 2.214,49 0.366,50 0.962,51 2.786,52 0.679,53 0.635,54 0.899,55 0.007,56 0.135,57 0.693,58 0.067,67 5.79}
{0 CHEMBL1401508,1 3.857,3 6.47,4 3.507,5 -0.349,6 0.819,7 35.664,8 1.034,9 4,10 4,11 4,12 1.899,13 -4.278,14 5.517,15 1,16 1.492,17 11.914,18 2.623,19 6.881,20 119.509,21 8.464,22 0.462,23 4.202,24 4.259,25 3.842,26 3.681,27 5.474,28 3.724,29 4.711,30 4.793,31 4.262,32 4.083,33 5.961,34 4.127,35 5.026,36 5.125,37 4.465,38 4.253,39 6.41,40 4.295,41 5.11,42 5.236,43 4.432,44 4.272,45 6.515,46 4.288,47 5.113,48 5.262,49 4.308,50 4.267,51 6.386,52 4.252,53 5.073,54 5.237,55 4.254,56 4.193,57 6.369,58 4.17,59 4.985,60 5.158,61 4.187,62 4.078,63 6.29,64 4.069,65 4.863,66 5.012,67 5.192}
{0 CHEMBL14060,1 2.749,3 3.674,4 1.884,6 0.847,8 0.125,12 0.845,14 4.336,16 1.314,17 3.286,18 1.563,19 2.442,20 27.752,21 7.24,22 0.857,23 2.659,24 2.754,25 2.182,26 2.255,27 3.905,28 2.221,29 2.996,30 3.122,31 2.36,32 2.493,33 4.229,34 2.427,35 3.178,36 3.39,37 2.07,38 2.342,39 4.326,40 2.224,41 2.818,42 3.106,43 1.159,44 1.674,45 3.799,46 1.471,47 1.908,48 2.251,49 0.202,50 0.758,51 2.565,52 0.548,53 0.635,54 0.899,55 0.007,56 0.135,57 0.693,58 0.067,67 5.569}
{0 CHEMBL1414,1 3.072,3 6.351,4 2.864,6 0.976,7 14.582,8 0.563,12 1.19,14 5.038,15 1,16 1.528,17 5.143,18 1.134,19 1.286,20 47.437,21 8.258,22 0.429,23 3.308,24 3.369,25 2.903,26 2.679,27 4.682,28 2.74,29 3.734,30 3.848,31 3.205,32 2.946,33 5.191,34 3.013,35 3.799,36 3.861,37 3.349,38 3.053,39 5.355,40 3.122,41 3.953,42 4.061,43 3.219,44 3.013,45 5.374,46 3.055,47 3.981,48 4.154,49 3.052,50 2.857,51 5.457,52 2.85,53 3.719,54 3.902,55 2.577,56 2.532,57 5.29,58 2.486,59 3.485,60 3.721,61 1.223,62 2.016,63 4.787,64 1.848,65 2.721,66 3.192,67 5.067}
{0 CHEMBL145,1 3.374,3 6.402,4 2.794,6 0.752,7 4.095,8 0.156,12 1.447,14 4.793,16 1.51,17 6.308,18 1.367,19 1.87,20 46.523,21 8.58,22 0.462,23 3.168,24 3.229,25 2.778,26 2.656,27 4.62,28 2.691,29 3.496,30 3.567,31 3.085,32 2.938,33 5.14,34 2.956,35 3.756,36 3.881,37 3.034,38 2.974,39 5.311,40 2.963,41 3.71,42 3.895,43 2.691,44 2.777,45 5.024,46 2.725,47 3.462,48 3.673,49 2.574,50 2.5,51 4.832,52 2.479,53 3.249,54 3.389,55 2.415,56 2.138,57 4.835,58 2.22,59 2.974,60 3.118,61 2.224,62 1.686,63 4.949,64 1.802,65 2.479,66 2.613,67 5}
{0 CHEMBL145781,1 3.827,2 1,3 4.746,4 3.063,5 0.489,6 0.845,7 28.642,8 0.64,12 1.865,14 5.169,15 1,16 1.349,17 8.737,18 3.467,19 12.019,20 72.7,21 8.138,22 0.571,23 3.554,24 3.625,25 3.206,26 3.171,27 4.739,28 3.167,29 4.028,30 4.125,31 3.532,32 3.504,33 5.278,34 3.489,35 4.232,36 4.381,37 3.497,38 3.551,39 5.353,40 3.509,41 4.182,42 4.368,43 3.253,44 3.37,45 5.259,46 3.296,47 3.995,48 4.208,49 3.094,50 3.191,51 5.034,52 3.125,53 3.794,54 3.956,55 3.027,56 3.092,57 5.006,58 3.043,59 3.71,60 3.882,61 2.887,62 3.087,63 4.756,64 2.999,65 3.717,66 3.921,67 5.092}
{0 CHEMBL153094,1 3.673,3 4.836,4 3.192,5 9.553,6 1.447,7 24.869,8 1.038,12 1.668,14 5.571,16 1.511,17 9.6,18 2.993,19 8.96,20 62.721,21 6.248,23 3.659,24 3.789,25 3.299,26 3.1,27 4.477,28 3,29 4.28,30 4.488,31 3.291,32 3.406,33 5.608,34 3.247,35 4.511,36 4.812,37 3.007,38 3.476,39 5.212,40 3.241,41 4.434,42 4.736,43 2.944,44 3.406,45 5.166,46 3.168,47 4.376,48 4.683,49 2.871,50 3.318,51 5.118,52 3.078,53 4.266,54 4.569,55 2.791,56 3.199,57 5.042,58 2.964,59 4.141,60 4.44,61 2.704,62 3.064,63 4.959,64 2.836,65 4,66 4.292,67 6.057}
{0 CHEMBL165,1 3.781,3 6.446,4 2.897,6 0.762,7 6.371,8 0.531,12 1.82,14 4.786,16 1.373,17 8.059,18 3.014,19 9.084,20 66.595,21 7.871,22 0.667,23 3.472,24 3.552,25 3.049,26 3.059,27 4.779,28 3.048,29 3.845,30 3.944,31 3.359,32 3.392,33 5.161,34 3.361,35 4.133,36 4.285,37 3.304,38 3.454,39 5.376,40 3.385,41 4.105,42 4.33,43 3.093,44 3.269,45 5.339,46 3.162,47 3.878,48 4.09,49 2.848,50 3.077,51 5.023,52 2.981,53 3.711,54 3.912,55 2.817,56 3.002,57 4.832,58 2.917,59 3.665,60 3.861,61 2.843,62 2.928,63 4.873,64 2.864,65 3.598,66 3.773,67 5.041}
{0 CHEMBL171476,1 3.799,3 6.999,4 3.45,5 7.471,6 1.355,7 29.461,8 1.052,12 1.691,14 5.591,16 1.76,17 12.2,18 1.053,19 1.109,20 77.629,21 7.557,23 3.849,24 3.948,25 3.745,26 3.259,27 4.764,28 3.194,29 4.468,30 4.631,31 3.724,32 3.549,33 6.113,34 3.448,35 4.669,36 4.932,37 3.378,38 3.636,39 5.544,40 3.446,41 4.619,42 4.884,43 3.34,44 3.601,45 5.527,46 3.406,47 4.607,48 4.884,49 3.293,50 3.546,51 5.51,52 3.345,53 4.52,54 4.792,55 3.241,56 3.453,57 5.459,58 3.259,59 4.425,60 4.69,61 3.186,62 3.349,63 5.406,64 3.165,65 4.32,66 4.577,67 5.919}
{0 CHEMBL18,1 3.754,3 4.98,4 3.195,5 0.562,6 0.849,7 44.003,8 0.765,12 1.748,14 5.534,16 1.989,17 7,18 1.616,19 2.612,20 63.193,21 9.937,22 0.588,23 3.402,24 3.464,25 3.469,26 3.052,27 4.525,28 2.976,29 3.914,30 4.012,31 3.815,32 3.385,33 5.505,34 3.306,35 4.022,36 4.159,37 3.728,38 3.349,39 5.409,40 3.269,41 3.796,42 3.916,43 3.437,44 3.232,45 5.025,46 3.133,47 3.741,48 3.898,49 3.21,50 3.1,51 4.991,52 2.956,53 3.781,54 3.978,55 3.022,56 2.904,57 5.057,58 2.787,59 3.491,60 3.706,61 2.56,62 2.514,63 4.843,64 2.33,65 2.907,66 3.09,67 5.301}
{0 CHEMBL1822699,1 4.01,3 6.999,4 3.779,5 3.361,6 0.956,7 46.178,8 1.155,12 1.954,14 5.967,15 3,16 1.556,17 10.814,18 5.904,19 34.857,20 172.923,21 7.555,22 0.5,23 4.464,24 4.572,25 4.15,26 4.053,27 5.506,28 4.009,29 5.026,30 5.189,31 4.5,32 4.464,33 6.214,34 4.418,35 5.3,36 5.486,37 4.676,38 4.692,39 6.347,40 4.644,41 5.435,42 5.593,43 4.777,44 4.859,45 6.554,46 4.797,47 5.631,48 5.835,49 4.794,50 4.958,51 6.668,52 4.87,53 5.63,54 5.842,55 4.764,56 4.914,57 6.656,58 4.814,59 5.51,60 5.702,61 4.717,62 4.823,63 6.481,64 4.726,65 5.48,66 5.678,67 4.495}
{0 CHEMBL1822700,1 4.007,3 6.999,4 3.779,5 3.321,6 0.956,7 46.178,8 1.157,12 1.953,14 5.968,15 3,16 1.556,17 10.326,18 5.904,19 34.857,20 172.923,21 7.555,22 0.5,23 4.464,24 4.572,25 4.15,26 4.053,27 5.506,28 4.009,29 5.026,30 5.189,31 4.5,32 4.464,33 6.214,34 4.418,35 5.3,36 5.486,37 4.676,38 4.692,39 6.347,40 4.644,41 5.435,42 5.593,43 4.8,44 4.862,45 6.544,46 4.8,47 5.635,48 5.834,49 4.846,50 4.976,51 6.692,52 4.888,53 5.657,54 5.861,55 4.864,56 4.957,57 6.702,58 4.862,59 5.574,60 5.755,61 4.84,62 4.878,63 6.742,64 4.794,65 5.519,66 5.708,67 4.462}
{0 CHEMBL1822701,1 4.027,3 6.999,4 3.779,5 3.652,6 0.97,7 48.712,8 1.169,12 1.969,14 5.955,15 3,16 1.541,17 11.614,18 5.911,19 34.939,20 177.758,21 7.449,22 0.49,23 4.496,24 4.607,25 4.169,26 4.083,27 5.527,28 4.037,29 5.063,30 5.231,31 4.513,32 4.495,33 6.232,34 4.445,35 5.336,36 5.522,37 4.682,38 4.722,39 6.364,40 4.665,41 5.488,42 5.657,43 4.759,44 4.874,45 6.568,46 4.799,47 5.652,48 5.864,49 4.771,50 4.959,51 6.651,52 4.861,53 5.665,54 5.885,55 4.745,56 4.921,57 6.66,58 4.819,59 5.54,60 5.737,61 4.693,62 4.839,63 6.544,64 4.75,65 5.499,66 5.696,67 4.672}
{0 CHEMBL1822702,1 4.035,3 6.999,4 3.779,5 4.368,6 0.982,7 51.247,8 1.169,12 1.975,14 5.981,15 3,16 1.527,17 12.467,18 6.232,19 38.839,20 182.513,21 7.351,22 0.48,23 4.528,24 4.64,25 4.186,26 4.113,27 5.548,28 4.063,29 5.098,30 5.269,31 4.528,32 4.524,33 6.25,34 4.469,35 5.376,36 5.569,37 4.693,38 4.75,39 6.385,40 4.688,41 5.517,42 5.688,43 4.765,44 4.899,45 6.581,46 4.818,47 5.694,48 5.914,49 4.753,50 4.973,51 6.663,52 4.864,53 5.685,54 5.913,55 4.721,56 4.923,57 6.643,58 4.81,59 5.579,60 5.784,61 4.674,62 4.848,63 6.549,64 4.755,65 5.529,66 5.73,67 4.724}
{0 CHEMBL182455,1 3.797,3 6.999,4 3.359,5 4.874,6 1.336,7 24.392,8 0.889,12 1.675,14 5.582,16 1.828,17 10.667,18 0.141,19 0.02,20 68.427,21 8.012,23 3.718,24 3.807,25 3.688,26 3.114,27 4.67,28 3.06,29 4.33,30 4.478,31 3.657,32 3.383,33 6.072,34 3.303,35 4.499,36 4.748,37 3.28,38 3.458,39 5.443,40 3.285,41 4.44,42 4.69,43 3.238,44 3.415,45 5.425,46 3.238,47 4.425,48 4.69,49 3.186,50 3.349,51 5.406,52 3.165,53 4.32,54 4.577,55 3.128,56 3.234,57 5.349,58 3.062,59 4.203,60 4.449,61 3.066,62 3.104,63 5.289,64 2.946,65 4.071,66 4.302,67 5.948}
{0 CHEMBL186422,1 3.361,3 4.176,4 2.638,6 0.772,7 10.647,8 0.241,12 1.424,14 5.103,16 1.493,17 4.636,18 1.253,19 1.569,20 43.574,21 8.065,22 0.5,23 3.015,24 3.118,25 2.658,26 2.655,27 4.214,28 2.64,29 3.451,30 3.571,31 2.974,32 2.993,33 4.708,34 2.956,35 3.675,36 3.86,37 2.888,38 3.009,39 4.837,40 2.943,41 3.494,42 3.72,43 2.445,44 2.698,45 4.59,46 2.586,47 3.122,48 3.385,49 1.899,50 2.17,51 4.251,52 2.038,53 2.416,54 2.68,55 1.043,56 1.259,57 3.655,58 1.15,59 1.143,60 1.366,61 0.113,62 0.276,63 2.197,64 0.229,67 6.244}
{0 CHEMBL19,1 3.452,3 6.999,4 2.949,6 0.95,7 37.617,8 0.664,12 1.478,14 5.684,15 3,16 2.17,17 5.643,18 0.678,19 0.46,20 53.079,21 10.741,23 3.244,24 3.327,25 3.383,26 2.785,27 4.483,28 2.722,29 3.738,30 3.876,31 3.744,32 3.04,33 5.502,34 3.003,35 3.742,36 3.861,37 3.606,38 2.982,39 5.371,40 2.95,41 3.587,42 3.698,43 3.378,44 2.929,45 5.02,46 2.843,47 3.524,48 3.642,49 3.073,50 2.761,51 5.188,52 2.705,53 3.629,54 3.821,55 2.623,56 2.532,57 5.012,58 2.435,59 3.336,60 3.606,61 2.387,62 2.085,63 5.215,64 1.982,65 2.783,66 2.984,67 8.959}
{0 CHEMBL190447,1 3.784,3 4.89,4 3.038,6 0.8585,7 20.888,8 0.775,12 1.707,14 5.662,16 1.856,17 8.15,18 2.27,19 5.153,20 74.671,21 7.646,22 0.286,23 3.751,24 3.846,25 3.53,26 3.303,27 4.785,28 3.048,29 4.327,30 4.473,31 3.827,32 3.692,33 5.763,34 3.344,35 4.577,36 4.719,37 3.763,38 3.89,39 5.73,40 3.385,41 4.724,42 4.941,43 3.577,44 3.889,45 5.714,46 3.2655,47 4.552,48 4.832,49 3.422,50 3.6,51 5.553,52 3.079,53 4.219,54 4.413,55 3.197,56 3.514,57 5.319,58 2.9405,59 4.286,60 4.578,61 3.053,62 3.323,63 5.033,64 2.7935,65 3.988,66 4.258,67 5.057}
{0 CHEMBL1955873,1 3.237,3 4.399,4 2.566,6 0.704,7 3.186,8 0.218,12 1.164,14 4.642,16 1.563,17 4,18 2.379,19 5.658,20 40.68,21 9.213,22 0.667,23 2.795,24 2.869,25 2.529,26 2.5,27 4.07,28 2.434,29 3.144,30 3.24,31 2.861,32 2.775,33 4.494,34 2.684,35 3.318,36 3.494,37 2.731,38 2.795,39 4.496,40 2.626,41 3.151,42 3.336,43 2.439,44 2.469,45 4.423,46 2.246,47 2.661,48 2.875,49 1.784,50 1.86,51 3.899,52 1.604,53 1.788,54 2.041,55 0.361,56 0.905,57 2.686,58 0.643,59 0.635,60 0.899,61 0.007,62 0.135,63 0.693,64 0.067,67 5.228}
{0 CHEMBL1956578,1 3.136,3 4.087,4 2.386,6 1.031,7 13.244,8 0.349,12 1.234,14 4.957,16 1.607,17 4.3,18 1.371,19 1.879,20 39.678,21 7.325,23 3.051,24 3.152,25 2.578,26 2.488,27 4.352,28 2.487,29 3.461,30 3.64,31 2.835,32 2.75,33 4.59,34 2.735,35 3.561,36 3.7,37 2.753,38 2.784,39 4.787,40 2.744,41 3.582,42 3.831,43 2.489,44 2.621,45 4.593,46 2.521,47 3.352,48 3.58,49 1.951,50 2.226,51 4.531,52 2.121,53 3.145,54 3.476,55 0.752,56 1.628,57 4.111,58 1.371,59 1.975,60 2.417,61 0.048,62 0.7,63 2.079,64 0.396,67 6.149}
{0 CHEMBL1956579,1 3.36,3 4.419,4 2.717,6 0.773,7 13.244,8 0.193,12 1.418,14 5.117,16 1.607,17 5.333,18 1.987,19 3.947,20 45.031,21 8.483,22 0.462,23 3.103,24 3.177,25 2.773,26 2.659,27 4.452,28 2.674,29 3.478,30 3.576,31 3.052,32 2.972,33 4.711,34 2.971,35 3.682,36 3.831,37 3.043,38 2.984,39 4.923,40 2.967,41 3.542,42 3.717,43 2.646,44 2.715,45 4.704,46 2.67,47 3.236,48 3.461,49 2.219,50 2.33,51 4.367,52 2.252,53 2.804,54 3.052,55 1.721,56 1.735,57 4.031,58 1.681,59 2.259,60 2.487,61 1.043,62 1.128,63 3.526,64 1.084,65 1.603,66 1.885,67 6.319}
{0 CHEMBL19612,1 3.428,3 4.283,4 2.767,5 7.083,6 1.503,7 16.026,8 0.77,12 1.527,14 3.804,16 1.233,17 7,18 -1.169,19 1.367,20 44.968,21 5.01,23 3.377,24 3.58,25 2.512,26 2.709,27 4.266,28 2.619,29 3.929,30 4.207,31 2.542,32 3.026,33 4.64,34 2.839,35 4.197,36 4.552,37 2.445,38 3.064,39 4.773,40 2.812,41 4.064,42 4.422,43 2.321,44 2.915,45 4.687,46 2.665,47 3.903,48 4.262,49 2.157,50 2.764,51 4.525,52 2.513,53 3.731,54 4.085,55 1.966,56 2.615,57 4.324,58 2.36,59 3.582,60 3.943,61 1.768,62 2.432,63 4.208,64 2.166,65 3.382,66 3.757,67 4.939}
{0 CHEMBL20,1 3.453,3 6.999,4 2.485,6 0.812,7 36.483,8 0.248,12 1.46,14 5.547,15 3,16 2.234,17 5.692,18 -1.206,19 1.454,20 48.798,21 11.699,22 0.385,23 3.125,24 3.199,25 3.337,26 2.686,27 4.431,28 2.63,29 3.578,30 3.671,31 3.688,32 2.938,33 5.437,34 2.897,35 3.615,36 3.722,37 3.464,38 2.773,39 5.302,40 2.756,41 3.387,42 3.525,43 3.204,44 2.594,45 5.081,46 2.59,47 3.132,48 3.274,49 2.691,50 2.345,51 4.739,52 2.265,53 2.955,54 3.12,55 2.495,56 2.06,57 4.334,58 2.027,59 2.808,60 2.883,61 2.379,62 1.819,63 5.142,64 1.849,65 2.783,66 2.984,67 1.478}
{0 CHEMBL2019140,1 3.806,3 4.926,4 3.298,6 0.63,7 31.749,8 0.549,12 1.826,14 5.476,15 1,16 1.715,17 7.7,18 3.976,19 15.808,20 78.371,21 10.557,22 0.545,23 3.51,24 3.578,25 3.362,26 3.203,27 4.781,28 3.192,29 3.958,30 4.03,31 3.796,32 3.594,33 5.27,34 3.57,35 4.223,36 4.323,37 3.89,38 3.702,39 5.533,40 3.671,41 4.201,42 4.312,43 3.787,44 3.573,45 5.674,46 3.549,47 4.139,48 4.27,49 3.709,50 3.433,51 5.619,52 3.417,53 3.988,54 4.169,55 3.412,56 3.32,57 5.186,58 3.227,59 3.784,60 3.976,61 3.529,62 3.149,63 5.137,64 3.028,65 3.438,66 3.613,67 5.229}
{0 CHEMBL2019143,1 3.797,3 4.908,4 3.186,6 0.752,7 33.492,8 0.604,12 1.827,14 5.477,15 1,16 1.657,17 8.476,18 3.295,19 10.858,20 80.029,21 9.144,22 0.522,23 3.629,24 3.706,25 3.361,26 3.235,27 4.877,28 3.237,29 4.092,30 4.192,31 3.753,32 3.604,33 5.341,34 3.598,35 4.295,36 4.398,37 3.864,38 3.726,39 5.569,40 3.717,41 4.337,42 4.46,43 3.805,44 3.671,45 5.746,46 3.646,47 4.339,48 4.511,49 3.711,50 3.558,51 5.704,52 3.515,53 4.146,54 4.358,55 3.345,56 3.371,57 5.252,58 3.283,59 3.894,60 4.081,61 3.351,62 3.197,63 5.147,64 3.102,65 3.734,66 3.897,67 5.339}
{0 CHEMBL2019155,1 3.781,3 6.446,4 2.897,6 0.762,7 6.371,8 0.531,12 1.82,14 4.786,16 1.373,17 8.059,18 3.014,19 9.084,20 66.595,21 7.871,22 0.667,23 3.472,24 3.552,25 3.049,26 3.059,27 4.779,28 3.048,29 3.845,30 3.944,31 3.359,32 3.392,33 5.161,34 3.361,35 4.133,36 4.285,37 3.304,38 3.454,39 5.376,40 3.385,41 4.105,42 4.33,43 3.093,44 3.269,45 5.339,46 3.162,47 3.878,48 4.09,49 2.848,50 3.077,51 5.023,52 2.981,53 3.711,54 3.912,55 2.817,56 3.002,57 4.832,58 2.917,59 3.665,60 3.861,61 2.843,62 2.928,63 4.873,64 2.864,65 3.598,66 3.773,67 5.171}
{0 CHEMBL206452,1 3.791,3 6.449,4 2.999,5 0.147,6 0.752,7 14.149,8 0.805,9 2,10 3,11 2,12 1.829,13 -1.706,14 5.399,16 1.489,17 7.905,18 1.92,19 3.687,20 72.852,21 8.294,22 0.522,23 3.714,24 3.776,25 3.319,26 3.198,27 5.028,28 3.231,29 4.169,30 4.25,31 3.733,32 3.6,33 5.469,34 3.625,35 4.53,36 4.647,37 3.869,38 3.74,39 5.921,40 3.753,41 4.594,42 4.758,43 3.74,44 3.672,45 5.932,46 3.652,47 4.481,48 4.662,49 3.553,50 3.556,51 5.769,52 3.516,53 4.345,54 4.53,55 3.393,56 3.39,57 5.687,58 3.352,59 4.145,60 4.339,61 3.246,62 3.164,63 5.614,64 3.14,65 3.888,66 4.054,67 5.446}
{0 CHEMBL21,1 3.548,3 5.108,4 2.687,6 0.815,7 4.307,8 0.218,12 1.486,14 5.377,16 1.958,17 4.727,18 -0.088,19 0.008,20 44.1,21 9.065,22 0.545,23 3.067,24 3.165,25 3.082,26 2.658,27 4.263,28 2.595,29 3.507,30 3.609,31 3.206,32 2.955,33 5.292,34 2.894,35 3.696,36 3.847,37 3.074,38 2.978,39 5.132,40 2.883,41 3.661,42 3.875,43 2.697,44 2.686,45 5.056,46 2.571,47 3.324,48 3.602,49 2.215,50 2.136,51 4.522,52 2.017,53 2.556,54 2.789,55 1.811,56 1.516,57 4.409,58 1.408,59 2.339,60 2.571,61 0.61,62 0.972,63 3.807,64 0.937,65 1.515,66 1.922,67 6.005}
{0 CHEMBL2179304,1 3.946,3 5.007,4 3.558,5 0.814,6 0.788,7 50.433,8 0.886,12 1.879,14 5.684,15 1,16 1.845,17 9.25,18 2.661,19 7.08,20 96.985,21 9.434,22 0.63,23 3.783,24 3.869,25 3.753,26 3.467,27 4.898,28 3.404,29 4.297,30 4.411,31 4.058,32 3.853,33 5.732,34 3.791,35 4.475,36 4.617,37 4.086,38 3.959,39 5.697,40 3.88,41 4.554,42 4.732,43 4.011,44 3.922,45 5.752,46 3.833,47 4.433,48 4.622,49 3.72,50 3.8,51 5.521,52 3.691,53 4.285,54 4.484,55 3.652,56 3.687,57 5.281,58 3.546,59 4.272,60 4.503,61 3.642,62 3.583,63 5.399,64 3.427,65 4.054,66 4.245,67 5.102}
{0 CHEMBL2179305,1 3.939,3 5.011,4 3.522,5 0.814,6 0.754,7 47.677,8 0.795,12 1.865,14 5.684,15 1,16 1.883,17 8.696,18 2.378,19 5.656,20 92.393,21 9.841,22 0.654,23 3.716,24 3.795,25 3.725,26 3.41,27 4.855,28 3.352,29 4.218,30 4.316,31 4.019,32 3.797,33 5.694,34 3.738,35 4.401,36 4.538,37 4.043,38 3.893,39 5.634,40 3.815,41 4.46,42 4.631,43 3.937,44 3.827,45 5.695,46 3.753,47 4.325,48 4.509,49 3.65,50 3.689,51 5.46,52 3.603,53 4.201,54 4.411,55 3.581,56 3.588,57 5.213,58 3.447,59 4.095,60 4.303,61 3.546,62 3.454,63 5.294,64 3.294,65 3.883,66 4.069,67 5.194}
{0 CHEMBL2179306,1 3.978,3 7.999,4 3.636,5 0.499,6 0.759,7 51.291,8 0.883,12 1.922,14 5.685,16 2.054,17 10.111,18 3.932,19 15.461,20 100.21,21 10.55,22 0.567,23 3.831,24 3.903,25 3.848,26 3.496,27 5.046,28 3.465,29 4.382,30 4.472,31 4.235,32 3.898,33 6.264,34 3.872,35 4.54,36 4.66,37 4.225,38 4.016,39 5.929,40 3.967,41 4.668,42 4.835,43 4.172,44 3.966,45 6.07,46 3.928,47 4.533,48 4.71,49 4.057,50 3.832,51 5.835,52 3.79,53 4.359,54 4.54,55 3.86,56 3.724,57 5.563,58 3.644,59 4.382,60 4.581,61 3.881,62 3.624,63 5.812,64 3.545,65 4.185,66 4.349,67 4.544}
{0 CHEMBL2179307,1 3.974,3 5.013,4 3.688,5 0.817,6 0.708,7 51.606,8 0.849,12 1.912,14 5.684,16 1.954,17 9.25,18 3.654,19 13.353,20 99.041,21 10.497,22 0.63,23 3.738,24 3.808,25 3.786,26 3.474,27 4.869,28 3.406,29 4.245,30 4.33,31 4.107,32 3.882,33 5.72,34 3.807,35 4.454,36 4.575,37 4.145,38 3.993,39 5.691,40 3.895,41 4.504,42 4.661,43 4.125,44 3.929,45 5.736,46 3.832,47 4.387,48 4.573,49 3.781,50 3.779,51 5.494,52 3.681,53 4.256,54 4.444,55 3.75,56 3.691,57 5.302,58 3.543,59 4.146,60 4.335,61 3.775,62 3.579,63 5.381,64 3.416,65 3.965,66 4.138,67 4.495}
{0 CHEMBL2179308,1 3.969,3 4.999,4 3.565,5 0.824,6 0.802,7 53.349,8 0.855,12 1.911,14 5.685,16 1.832,17 9.88,18 2.973,19 8.841,20 100.7,21 9.337,22 0.607,23 3.834,24 3.911,25 3.785,26 3.499,27 4.957,28 3.442,29 4.348,30 4.453,31 4.075,32 3.89,33 5.766,34 3.83,35 4.511,36 4.634,37 4.125,38 4.011,39 5.723,40 3.932,41 4.606,42 4.767,43 4.068,44 3.98,45 5.8,46 3.898,47 4.549,48 4.755,49 3.805,50 3.879,51 5.588,52 3.77,53 4.398,54 4.592,55 3.73,56 3.777,57 5.38,58 3.628,59 4.292,60 4.482,61 3.721,62 3.649,63 5.455,64 3.505,65 4.212,66 4.421,67 4.644}
{0 CHEMBL218490,1 3.898,3 6.999,4 3.493,5 1.112,6 0.958,7 39.103,8 0.909,9 2,10 3,11 2,12 1.791,13 -0.679,14 5.957,16 1.93,17 6.421,18 0.269,19 0.072,20 75.599,21 9.271,22 0.25,23 3.668,24 3.742,25 3.771,26 3.338,27 4.628,28 3.21,29 4.278,30 4.406,31 4.148,32 3.785,33 5.804,34 3.632,35 4.551,36 4.711,37 4.191,38 3.892,39 5.798,40 3.751,41 4.603,42 4.779,43 4.005,44 3.84,45 5.843,46 3.698,47 4.457,48 4.647,49 3.937,50 3.736,51 5.462,52 3.529,53 4.457,54 4.623,55 3.781,56 3.568,57 6.193,58 3.418,59 4.349,60 4.577,61 2.999,62 3.224,63 5.632,64 3.008,65 3.954,66 4.232,67 5.097}
{0 CHEMBL2323134,1 3.732,2 4,3 7.431,4 3.499,5 -0.684,6 1.098,7 44.211,8 1.013,9 5,10 5,11 5,12 1.8,13 -6.159,14 5.257,15 4,16 1.49,17 11.429,18 0.926,19 0.858,20 117.69,21 7.818,22 0.167,23 4.233,24 4.31,25 3.8,26 3.656,27 5.459,28 3.682,29 4.79,30 4.919,31 4.175,32 3.973,33 6.109,34 4,35 5.071,36 5.2,37 4.228,38 4.119,39 6.302,40 4.138,41 5.092,42 5.234,43 4.342,44 4.23,45 6.271,46 4.23,47 5.29,48 5.446,49 4.533,50 4.336,51 6.634,52 4.35,53 5.4,54 5.563,55 4.512,56 4.374,57 6.73,58 4.386,59 5.358,60 5.529,61 4.476,62 4.36,63 6.852,64 4.35,65 5.323,66 5.506,67 4}
{0 CHEMBL2323135,1 3.732,2 4,3 7.431,4 3.5,5 -0.667,6 1.098,7 44.211,8 1.013,9 5,10 5,11 5,12 1.8,13 -6.127,14 5.257,15 4,16 1.49,17 12.143,18 0.926,19 0.858,20 117.69,21 7.818,22 0.167,23 4.233,24 4.31,25 3.8,26 3.656,27 5.459,28 3.682,29 4.79,30 4.919,31 4.175,32 3.973,33 6.109,34 4,35 5.071,36 5.2,37 4.228,38 4.119,39 6.306,40 4.138,41 5.092,42 5.234,43 4.327,44 4.229,45 6.26,46 4.225,47 5.286,48 5.447,49 4.53,50 4.332,51 6.619,52 4.344,53 5.392,54 5.552,55 4.512,56 4.371,57 6.732,58 4.384,59 5.358,60 5.529,61 4.458,62 4.36,63 6.819,64 4.348,65 5.32,66 5.506,67 4}
{0 CHEMBL2323136,1 3.732,2 4,3 7.431,4 3.499,5 -0.684,6 1.098,7 44.211,8 1.013,9 5,10 5,11 5,12 1.8,13 -6.159,14 5.257,15 4,16 1.49,17 11.429,18 0.926,19 0.858,20 117.69,21 7.818,22 0.167,23 4.233,24 4.31,25 3.8,26 3.656,27 5.459,28 3.682,29 4.79,30 4.919,31 4.175,32 3.973,33 6.109,34 4,35 5.071,36 5.2,37 4.228,38 4.119,39 6.302,40 4.138,41 5.092,42 5.234,43 4.342,44 4.23,45 6.271,46 4.23,47 5.29,48 5.446,49 4.533,50 4.336,51 6.634,52 4.35,53 5.4,54 5.563,55 4.512,56 4.374,57 6.73,58 4.386,59 5.358,60 5.529,61 4.476,62 4.36,63 6.852,64 4.35,65 5.323,66 5.506,67 4}
{0 CHEMBL2323137,1 3.732,2 4,3 7.431,4 3.5,5 -0.667,6 1.098,7 44.211,8 1.013,9 5,10 5,11 5,12 1.8,13 -6.127,14 5.257,15 4,16 1.49,17 12.143,18 0.926,19 0.858,20 117.69,21 7.818,22 0.167,23 4.233,24 4.31,25 3.8,26 3.656,27 5.459,28 3.682,29 4.79,30 4.919,31 4.175,32 3.973,33 6.109,34 4,35 5.071,36 5.2,37 4.228,38 4.119,39 6.306,40 4.138,41 5.092,42 5.234,43 4.327,44 4.229,45 6.26,46 4.225,47 5.286,48 5.447,49 4.53,50 4.332,51 6.619,52 4.344,53 5.392,54 5.552,55 4.512,56 4.371,57 6.732,58 4.384,59 5.358,60 5.529,61 4.458,62 4.36,63 6.819,64 4.348,65 5.32,66 5.506,67 4}
{0 CHEMBL2323138,1 3.709,3 6.47,4 3.215,5 -0.745,6 0.953,7 10.854,8 0.993,9 5,10 5,11 5,12 1.78,13 -6.406,14 5.165,15 1,16 1.471,17 9.696,18 -0.59,19 0.348,20 81.084,21 7.543,22 0.25,23 3.871,24 3.953,25 3.384,26 3.304,27 5.108,28 3.318,29 4.388,30 4.501,31 3.751,32 3.686,33 5.592,34 3.686,35 4.782,36 4.943,37 3.907,38 3.828,39 6.166,40 3.81,41 4.811,42 5.006,43 3.762,44 3.766,45 6.152,46 3.716,47 4.705,48 4.924,49 3.597,50 3.636,51 6.027,52 3.577,53 4.552,54 4.764,55 3.47,56 3.474,57 5.953,58 3.43,59 4.339,60 4.54,61 3.375,62 3.33,63 5.868,64 3.288,65 4.186,66 4.38,67 4}
{0 CHEMBL2323139,1 3.709,3 6.47,4 3.215,5 -0.745,6 0.953,7 10.854,8 0.993,9 5,10 5,11 5,12 1.78,13 -6.406,14 5.165,15 1,16 1.471,17 9.696,18 -0.59,19 0.348,20 81.084,21 7.543,22 0.25,23 3.871,24 3.953,25 3.384,26 3.304,27 5.108,28 3.318,29 4.388,30 4.501,31 3.751,32 3.686,33 5.592,34 3.686,35 4.782,36 4.943,37 3.907,38 3.828,39 6.166,40 3.81,41 4.811,42 5.006,43 3.762,44 3.766,45 6.152,46 3.716,47 4.705,48 4.924,49 3.597,50 3.636,51 6.027,52 3.577,53 4.552,54 4.764,55 3.47,56 3.474,57 5.953,58 3.43,59 4.339,60 4.54,61 3.375,62 3.33,63 5.868,64 3.288,65 4.186,66 4.38,67 4}
{0 CHEMBL2323140,1 3.708,3 6.471,4 3.217,5 -0.727,6 0.953,7 10.854,8 0.993,9 5,10 5,11 5,12 1.78,13 -6.373,14 5.164,15 1,16 1.471,17 10.348,18 -0.59,19 0.348,20 81.084,21 7.543,22 0.25,23 3.871,24 3.953,25 3.384,26 3.304,27 5.108,28 3.318,29 4.388,30 4.501,31 3.751,32 3.686,33 5.592,34 3.686,35 4.782,36 4.943,37 3.907,38 3.828,39 6.17,40 3.81,41 4.811,42 5.006,43 3.735,44 3.765,45 6.14,46 3.708,47 4.697,48 4.926,49 3.59,50 3.629,51 5.999,52 3.565,53 4.533,54 4.739,55 3.469,56 3.465,57 5.958,58 3.426,59 4.338,60 4.54,61 3.32,62 3.33,63 5.778,64 3.28,65 4.177,66 4.38,67 5.076}
{0 CHEMBL237251,1 4.043,3 7.726,4 3.946,6 0.808,7 22.773,8 0.902,12 1.957,14 5.67,15 2,16 2.044,17 11.971,18 0.716,19 0.512,20 126.191,21 10.678,22 0.459,23 4.094,24 4.131,25 4.23,26 3.684,27 5.37,28 3.666,29 4.585,30 4.636,31 4.431,32 4.028,33 6.533,34 4.035,35 4.811,36 4.904,37 4.494,38 4.175,39 6.335,40 4.167,41 4.925,42 5.039,43 4.554,44 4.16,45 6.52,46 4.167,47 4.92,48 5.04,49 4.52,50 4.109,51 6.591,52 4.119,53 4.853,54 4.96,55 4.52,56 4.076,57 6.566,58 4.078,59 4.849,60 4.943,61 4.55,62 4.023,63 6.568,64 4.041,65 4.83,66 4.931,67 5.638}
{0 CHEMBL24231,1 3.707,3 6.999,4 2.687,6 0.892,7 8,8 0.218,12 1.382,14 5.18,16 1.995,17 6.357,18 0.489,19 0.239,20 46.237,21 10.955,22 0.429,23 3.165,24 3.214,25 3.292,26 2.658,27 4.581,28 2.666,29 3.615,30 3.624,31 3.427,32 2.901,33 5.771,34 2.938,35 3.728,36 3.844,37 3.229,38 2.926,39 5.222,40 2.916,41 3.646,42 3.766,43 3.17,44 2.807,45 5.3,46 2.769,47 3.522,48 3.631,49 2.873,50 2.493,51 5.227,52 2.497,53 3.194,54 3.339,55 2.533,56 1.975,57 4.892,58 2.018,59 2.601,60 2.784,61 2.544,62 1.623,63 4.054,64 1.634,65 2.621,66 2.557,67 2.871}
{0 CHEMBL24261,1 3.642,3 4.836,4 3.003,5 6.804,6 1.438,7 19.8,8 0.872,12 1.642,14 5.551,16 1.579,17 8.077,18 2.081,19 4.331,20 53.519,21 6.542,23 3.498,24 3.621,25 3.209,26 2.927,27 4.35,28 2.835,29 4.109,30 4.31,31 3.185,32 3.211,33 5.538,34 3.066,35 4.309,36 4.602,37 2.862,38 3.263,39 5.069,40 3.039,41 4.214,42 4.507,43 2.789,44 3.175,45 5.015,46 2.95,47 4.141,48 4.44,49 2.704,50 3.064,51 4.959,52 2.836,53 4,54 4.292,55 2.608,56 2.907,57 4.869,58 2.689,59 3.834,60 4.119,61 2.502,62 2.721,63 4.77,64 2.517,65 3.636,66 3.908,67 5.041}
{0 CHEMBL25101,1 3.619,3 4.892,4 3.463,5 10.311,6 1.137,7 38.343,8 1.208,12 1.684,14 5.472,16 1.356,17 15.778,18 1.125,19 1.266,20 113.173,21 6.075,22 0.393,23 4.147,24 4.305,25 3.509,26 3.639,27 5.098,28 3.574,29 4.706,30 4.929,31 3.734,32 4.012,33 5.572,34 3.892,35 5.006,36 5.292,37 3.751,38 4.131,39 5.778,40 3.972,41 4.985,42 5.274,43 3.693,44 4.084,45 5.783,46 3.914,47 4.953,48 5.246,49 3.617,50 4.003,51 5.773,52 3.83,53 4.884,54 5.183,55 3.521,56 3.889,57 5.738,58 3.715,59 4.8,60 5.105,61 3.378,62 3.808,63 5.574,64 3.628,65 4.718,66 5.018,67 4.936}
{0 CHEMBL251680,1 3.879,2 1,3 4.876,4 3.225,5 0.767,6 0.955,7 36.735,8 0.93,12 1.597,14 5.439,15 1,16 1.855,17 8.682,18 3.893,19 15.159,20 90.465,21 9.547,22 0.261,23 3.736,24 3.806,25 3.749,26 3.376,27 4.842,28 3.279,29 4.302,30 4.416,31 4.064,32 3.661,33 5.618,34 3.599,35 4.401,36 4.528,37 4.182,38 3.855,39 5.635,40 3.728,41 4.43,42 4.516,43 4.079,44 3.898,45 5.726,46 3.734,47 4.511,48 4.636,49 3.839,50 3.753,51 5.711,52 3.617,53 4.3,54 4.466,55 3.692,56 3.594,57 5.479,58 3.44,59 4.314,60 4.545,61 3.587,62 3.539,63 5.241,64 3.341,65 4.248,66 4.484,67 5.335}
{0 CHEMBL255863,1 3.873,3 7.999,4 3.74,6 0.869,7 33.13,8 1.027,12 1.886,14 5.361,15 1,16 1.716,17 14.769,18 5.084,19 25.849,20 140.252,21 8.681,22 0.674,23 4.236,24 4.35,25 3.921,26 3.781,27 5.478,28 3.8,29 4.739,30 4.893,31 4.349,32 4.15,33 6.333,34 4.161,35 4.908,36 5.077,37 4.326,38 4.265,39 6.178,40 4.25,41 5.037,42 5.246,43 4.309,44 4.247,45 6.287,46 4.228,47 5.006,48 5.216,49 4.393,50 4.231,51 6.329,52 4.226,53 4.99,54 5.176,55 4.366,56 4.232,57 6.37,58 4.24,59 5.048,60 5.25,61 4.376,62 4.214,63 6.634,64 4.208,65 4.881,66 5.068,67 6.354}
{0 CHEMBL26,1 3.739,3 6.999,4 3.307,5 4.683,6 1.118,7 26.071,8 1.15,9 1,10 3,11 1,12 1.625,13 0.316,14 5.778,15 1,16 1.711,17 8.957,18 0.827,19 0.684,20 89.318,21 7.423,22 0.25,23 3.914,24 4.03,25 3.63,26 3.401,27 4.937,28 3.353,29 4.497,30 4.679,31 3.859,32 3.772,33 5.796,34 3.712,35 4.732,36 4.948,37 3.876,38 3.915,39 5.814,40 3.825,41 4.796,42 5.011,43 3.846,44 3.911,45 5.938,46 3.806,47 4.829,48 5.098,49 3.802,50 3.818,51 5.838,52 3.697,53 4.696,54 4.943,55 3.759,56 3.647,57 6.123,58 3.556,59 4.446,60 4.629,61 3.527,62 3.596,63 5.629,64 3.501,65 4.526,66 4.738,67 4.975}
{0 CHEMBL261219,1 2.748,3 6.464,4 2.051,6 0.763,7 18.242,12 0.841,14 4.699,16 1.738,17 3.889,18 1.974,19 3.895,20 28.185,21 10.008,22 0.667,23 2.729,24 2.797,25 2.473,26 2.241,27 4.245,28 2.301,29 3.094,30 3.181,31 2.808,32 2.472,33 4.76,34 2.554,35 3.339,36 3.486,37 2.791,38 2.308,39 5.235,40 2.43,41 3.015,42 3.221,43 2.161,44 1.627,45 4.92,46 1.757,47 2.134,48 2.384,49 1.347,50 0.726,51 4.419,52 0.779,53 0.635,54 0.899,55 0.007,56 0.135,57 0.693,58 0.067,67 4.967}
{0 CHEMBL266240,1 3.843,3 6.999,4 3.226,6 0.7,7 9.359,8 0.35,12 1.658,14 5.561,16 2.324,17 5.188,18 -0.596,19 0.355,20 62.247,21 11.907,22 0.375,23 3.34,24 3.397,25 3.629,26 2.965,27 4.579,28 2.898,29 3.825,30 3.876,31 3.802,32 3.302,33 5.838,34 3.26,35 4.037,36 4.111,37 3.95,38 3.448,39 5.61,40 3.373,41 4.114,42 4.215,43 4.011,44 3.355,45 5.963,46 3.295,47 4.032,48 4.195,49 3.772,50 3.078,51 5.407,52 2.982,53 3.732,54 3.85,55 3.502,56 2.538,57 6.197,58 2.589,59 3.3,60 3.52,61 1.288,62 1.779,63 4.83,64 1.692,65 2.091,66 2.539,67 5.013}
{0 CHEMBL268439,1 3.979,3 6.999,4 3.71,6 0.742,7 36.086,8 0.594,12 1.746,14 5.697,15 4,16 2.206,17 8.6,18 -0.113,19 0.013,20 79.029,21 11.567,22 0.524,23 3.548,24 3.61,25 3.807,26 3.188,27 4.783,28 3.118,29 4.023,30 4.083,31 4.105,32 3.516,33 5.871,34 3.457,35 4.178,36 4.282,37 4.08,38 3.529,39 5.76,40 3.448,41 4.178,42 4.32,43 3.887,44 3.36,45 5.803,46 3.318,47 3.932,48 4.099,49 3.662,50 3.151,51 5.477,52 3.084,53 3.686,54 3.785,55 3.698,56 3.087,57 5.194,58 3.001,59 3.81,60 3.915,61 3.464,62 2.96,63 5.94,64 2.943,65 3.471,66 3.604,67 4.742}
{0 CHEMBL280998,1 2.755,3 4.55,4 2.092,6 0.776,8 0.044,12 0.855,14 4.62,16 1.449,17 3.5,18 1.295,19 1.678,20 29.446,21 7.866,22 0.75,23 2.768,24 2.843,25 2.325,26 2.28,27 4.134,28 2.288,29 3.079,30 3.174,31 2.578,32 2.536,33 4.443,34 2.525,35 3.315,36 3.468,37 2.514,38 2.431,39 4.888,40 2.408,41 3.102,42 3.321,43 1.617,44 1.883,45 4.386,46 1.782,47 2.371,48 2.714,49 0.361,50 1.091,51 3.135,52 0.841,53 1.02,54 1.365,55 0.014,56 0.255,57 1.099,58 0.13,67 4.886}
{0 CHEMBL288114,1 3.027,3 6.446,4 2.605,6 0.618,7 4.095,8 0.023,12 1.13,14 4.971,16 1.572,17 4.833,18 0.632,19 0.4,20 37.899,21 9.452,22 0.5,23 3.069,24 3.105,25 2.726,26 2.462,27 4.628,28 2.554,29 3.364,30 3.394,31 3.096,32 2.766,33 5.122,34 2.853,35 3.658,36 3.716,37 3.191,38 2.799,39 5.505,40 2.899,41 3.696,42 3.816,43 2.876,44 2.507,45 5.394,46 2.615,47 3.365,48 3.512,49 2.578,50 2.004,51 5.442,52 2.104,53 2.807,54 2.969,55 1.688,56 1.294,57 4.815,58 1.358,59 1.876,60 2.116,61 0.3,62 0.593,63 3.091,64 0.533,65 0.635,66 0.899,67 5.126}
{0 CHEMBL303004,1 3.299,3 4.026,4 2.443,5 6.441,6 1.506,7 14.35,8 0.618,12 1.409,14 3.696,16 1.189,17 5.5,18 0.078,19 0.006,20 36.58,21 4.843,23 3.178,24 3.378,25 2.276,26 2.547,27 4.065,28 2.44,29 3.723,30 3.998,31 2.282,32 2.862,33 4.407,34 2.653,35 3.996,36 4.354,37 2.152,38 2.883,39 4.541,40 2.605,41 3.83,42 4.192,43 1.98,44 2.693,45 4.401,46 2.415,47 3.63,48 3.998,49 1.771,50 2.457,51 4.238,52 2.182,53 3.382,54 3.757,55 1.507,56 2.148,57 4.043,58 1.877,59 3.051,60 3.441,61 1.155,62 1.724,63 3.932,64 1.449,65 2.523,66 2.939,67 6.222}
{0 CHEMBL306195,1 3.615,3 5.097,4 3.503,6 0.545,7 10.418,8 0.14,12 1.491,14 5.413,16 2.3,17 4.923,18 1.408,19 1.984,20 59.346,21 17.369,22 0.462,23 3.088,24 3.152,25 3.553,26 2.832,27 4.301,28 2.737,29 3.534,30 3.592,31 3.931,32 3.203,33 5.328,34 3.099,35 3.741,36 3.816,37 4.164,38 3.324,39 5.27,40 3.181,41 3.718,42 3.838,43 4.696,44 3.287,45 5.125,46 3.007,47 3.399,48 3.559,49 4.104,50 2.613,51 5.057,52 2.529,53 2.621,54 2.74,55 2.119,56 1.889,57 4.491,58 1.642,59 2.339,60 2.571,61 0.61,62 0.972,63 3.807,64 0.937,65 1.515,66 1.922,67 4.971}
{0 CHEMBL32749,1 3.379,3 6.351,4 2.916,6 0.903,7 9.339,8 0.547,12 1.453,14 4.847,16 1.483,17 6.429,18 1.618,19 2.619,20 51.292,21 8.092,22 0.429,23 3.284,24 3.354,25 2.866,26 2.751,27 4.647,28 2.776,29 3.675,30 3.783,31 3.141,32 3.018,33 5.175,34 3.032,35 3.822,36 3.945,37 3.129,38 3.088,39 5.218,40 3.074,41 3.844,42 4.016,43 2.911,44 3.001,45 5.067,46 2.946,47 3.788,48 3.998,49 2.771,50 2.841,51 5.033,52 2.781,53 3.609,54 3.805,55 2.55,56 2.544,57 4.95,58 2.512,59 3.326,60 3.541,61 2.355,62 2.112,63 4.814,64 2.104,65 2.866,66 3.051,67 4.955}
{0 CHEMBL360356,1 3.826,3 5.04,4 3.288,6 0.664,7 38.893,8 0.328,12 1.736,14 5.474,15 2,16 2.266,17 6.438,18 1.722,19 2.964,20 65.66,21 12.535,22 0.647,23 3.266,24 3.315,25 3.509,26 3.013,27 4.513,28 2.933,29 3.716,30 3.764,31 3.879,32 3.352,33 5.451,34 3.271,35 3.839,36 3.939,37 3.846,38 3.326,39 5.362,40 3.235,41 3.697,42 3.808,43 3.719,44 3.182,45 5.246,46 3.067,47 3.388,48 3.517,49 3.268,50 2.887,51 4.721,52 2.771,53 3.152,54 3.232,55 3.224,56 2.676,57 4.627,58 2.571,59 3.256,60 3.329,61 3.175,62 2.451,63 5.197,64 2.457,65 3.042,66 3.231,67 4.836}
{0 CHEMBL40988,1 3.264,2 1,3 6.999,4 2.687,6 0.954,7 15.192,8 0.218,12 1.384,14 4.978,16 1.739,17 6.231,18 1.492,19 2.226,20 44.515,21 9.058,22 0.462,23 3.127,24 3.198,25 2.825,26 2.582,27 4.547,28 2.627,29 3.55,30 3.649,31 3.128,32 2.834,33 5.234,34 2.887,35 3.691,36 3.816,37 3.017,38 2.811,39 5.139,40 2.872,41 3.566,42 3.699,43 2.841,44 2.642,45 5.113,46 2.695,47 3.386,48 3.531,49 2.519,50 2.419,51 4.894,52 2.425,53 3.151,54 3.359,55 2.196,56 2.048,57 4.648,58 2.001,59 2.674,60 2.925,61 1.899,62 1.575,63 3.977,64 1.597,65 2.347,66 2.4,67 2.909}
{0 CHEMBL414,1 3.588,3 6.999,4 2.687,6 0.797,7 5.646,8 0.218,12 1.527,14 5.43,16 1.957,17 5.615,18 0.263,19 0.069,20 46.158,21 10.061,22 0.462,23 3.137,24 3.185,25 3.187,26 2.725,27 4.464,28 2.698,29 3.573,30 3.626,31 3.357,32 3.023,33 5.523,34 3.004,35 3.77,36 3.876,37 3.275,38 3.07,39 5.337,40 3.032,41 3.768,42 3.904,43 3.007,44 2.804,45 5.387,46 2.788,47 3.511,48 3.732,49 2.47,50 2.341,51 4.914,52 2.287,53 2.761,54 2.96,55 2.505,56 1.799,57 3.987,58 1.807,59 2.641,60 2.603,61 2.451,62 1.331,63 5.478,64 1.603,65 2.261,66 2.427,67 4.947}
{0 CHEMBL441343,1 3.025,3 6.351,4 2.601,6 0.751,7 4.095,8 0.134,12 1.126,14 4.706,16 1.505,17 4.6,18 1.167,19 1.362,20 34.511,21 8.633,22 0.6,23 2.904,24 2.964,25 2.53,26 2.419,27 4.341,28 2.449,29 3.238,30 3.31,31 2.83,32 2.697,33 4.903,34 2.708,35 3.457,36 3.591,37 2.737,38 2.673,39 4.935,40 2.668,41 3.371,42 3.547,43 2.323,44 2.272,45 4.845,46 2.263,47 2.898,48 3.129,49 1.747,50 1.623,51 4.253,52 1.63,53 2.102,54 2.225,55 1.554,56 0.902,57 4.435,58 0.989,59 1.558,60 1.683,61 0.29,62 0.418,63 2.996,64 0.448,65 0.635,66 0.899,67 5.18}
{0 CHEMBL455271,1 3.839,3 5.09,4 3.175,6 0.7,7 42.201,8 0.536,12 1.55,14 5.498,16 2.038,17 7.167,18 0.983,19 0.966,20 69.705,21 10.783,22 0.75,23 3.443,24 3.515,25 3.554,26 3.128,27 4.629,28 3.074,29 3.917,30 3.999,31 3.791,32 3.465,33 5.551,34 3.427,35 4.024,36 4.161,37 3.61,38 3.411,39 5.405,40 3.361,41 4.027,42 4.192,43 3.59,44 3.302,45 5.362,46 3.262,47 3.858,48 4.047,49 3.42,50 3.178,51 5.212,52 3.08,53 3.564,54 3.724,55 3.22,56 2.951,57 4.966,58 2.869,59 3.416,60 3.578,61 2.985,62 2.82,63 4.588,64 2.636,65 3.12,66 3.289,67 4.462}
{0 CHEMBL49732,1 3.359,2 1,3 4.542,4 2.826,6 0.893,7 20.864,8 0.536,12 1.431,14 5.156,15 1,16 1.441,17 5.615,18 1.883,19 3.547,20 48.087,21 8.39,22 0.429,23 3.185,24 3.247,25 2.853,26 2.729,27 4.43,28 2.752,29 3.652,30 3.751,31 3.177,32 3.03,33 4.977,34 3.054,35 3.75,36 3.863,37 3.139,38 3.076,39 4.987,40 3.081,41 3.682,42 3.829,43 2.843,44 2.904,45 4.891,46 2.849,47 3.534,48 3.767,49 2.489,50 2.566,51 4.618,52 2.491,53 3.127,54 3.315,55 2.135,56 2.029,57 4.479,58 2.021,59 2.519,60 2.68,61 1.422,62 1.698,63 3.75,64 1.596,65 2.414,66 2.68,67 4.018}
{0 CHEMBL50,1 3.787,3 6.492,4 3.024,6 0.614,7 21.991,8 0.483,12 1.824,14 5.508,15 1,16 1.516,17 7.909,18 1.504,19 2.261,20 75.428,21 9.445,22 0.5,23 3.653,24 3.689,25 3.355,26 3.153,27 5.103,28 3.218,29 4.032,30 4.068,31 3.775,32 3.526,33 5.509,34 3.594,35 4.365,36 4.421,37 3.954,38 3.633,39 6.023,40 3.716,41 4.422,42 4.517,43 3.873,44 3.534,45 6.107,46 3.61,47 4.282,48 4.39,49 3.634,50 3.406,51 5.853,52 3.461,53 4.126,54 4.237,55 3.499,56 3.263,57 5.787,58 3.306,59 3.986,60 4.108,61 3.344,62 3.087,63 5.728,64 3.127,65 3.824,66 3.947,67 5.092}
{0 CHEMBL537,1 2.761,3 4.475,4 2.113,6 0.776,8 0.01,12 0.866,14 4.478,16 1.449,17 3.75,18 1.295,19 1.678,20 29.446,21 7.866,22 0.75,23 2.768,24 2.843,25 2.325,26 2.28,27 4.133,28 2.288,29 3.079,30 3.174,31 2.578,32 2.536,33 4.481,34 2.525,35 3.31,36 3.468,37 2.38,38 2.431,39 4.686,40 2.39,41 3.069,42 3.32,43 1.574,44 1.874,45 4.205,46 1.742,47 2.299,48 2.612,49 1.094,50 1.043,51 3.836,52 0.898,53 1.253,54 1.366,55 0.202,56 0.297,57 2.565,58 0.32,59 0.635,60 0.899,61 0.007,62 0.135,63 0.693,64 0.067,67 5.086}
{0 CHEMBL550572,1 3.708,3 6.471,4 3.217,5 -0.727,6 0.953,7 10.854,8 0.993,9 5,10 5,11 5,12 1.78,13 -6.373,14 5.164,15 1,16 1.471,17 10.348,18 -0.59,19 0.348,20 81.084,21 7.543,22 0.25,23 3.871,24 3.953,25 3.384,26 3.304,27 5.108,28 3.318,29 4.388,30 4.501,31 3.751,32 3.686,33 5.592,34 3.686,35 4.782,36 4.943,37 3.907,38 3.828,39 6.17,40 3.81,41 4.811,42 5.006,43 3.735,44 3.765,45 6.14,46 3.708,47 4.697,48 4.926,49 3.59,50 3.629,51 5.999,52 3.565,53 4.533,54 4.739,55 3.469,56 3.465,57 5.958,58 3.426,59 4.338,60 4.54,61 3.32,62 3.33,63 5.778,64 3.28,65 4.177,66 4.38,67 4}
{0 CHEMBL560175,1 3.584,3 6.448,4 3.125,5 0.545,6 1.064,7 15.059,8 0.729,9 1,11 2,12 1.662,13 -0.441,14 5.263,16 1.406,17 7.9,18 2.623,19 6.881,20 76.2,21 7.009,22 0.3,23 3.755,24 3.854,25 3.209,26 3.208,27 4.972,28 3.192,29 4.245,30 4.406,31 3.53,32 3.552,33 5.503,34 3.512,35 4.496,36 4.676,37 3.608,38 3.718,39 5.648,40 3.652,41 4.657,42 4.88,43 3.644,44 3.744,45 5.808,46 3.661,47 4.618,48 4.824,49 3.579,50 3.705,51 5.767,52 3.631,53 4.612,54 4.814,55 3.536,56 3.625,57 5.992,58 3.544,59 4.541,60 4.784,61 3.186,62 3.475,63 5.585,64 3.354,65 4.324,66 4.57,67 8}
{0 CHEMBL567139,1 3.404,2 1,3 4.792,4 2.869,5 0.495,6 0.81,7 20.912,8 0.481,12 1.472,14 5.155,16 1.562,17 5.846,18 1.006,19 1.011,20 50.097,21 7.964,22 0.429,23 3.216,24 3.314,25 2.83,26 2.781,27 4.438,28 2.782,29 3.673,30 3.796,31 3.164,32 3.124,33 4.964,34 3.107,35 3.87,36 4.038,37 3.134,38 3.184,39 5.037,40 3.139,41 3.8,42 4.005,43 2.81,44 2.99,45 4.925,46 2.903,47 3.575,48 3.822,49 2.481,50 2.669,51 4.681,52 2.556,53 3.255,54 3.499,55 2.001,56 2.151,57 4.443,58 2.048,59 2.727,60 3.001,61 1.433,62 1.591,63 3.726,64 1.493,65 2.163,66 2.381,67 4.186}
{0 CHEMBL567544,1 3.828,2 1,3 4.742,4 3.123,5 1.933,6 0.86,7 27.061,8 0.864,12 1.866,14 5.169,16 1.263,17 8.737,18 4.331,19 18.754,20 75.962,21 7.585,22 0.571,23 3.588,24 3.677,25 3.185,26 3.246,27 4.71,28 3.212,29 4.081,30 4.205,31 3.511,32 3.61,33 5.236,34 3.552,35 4.332,36 4.518,37 3.471,38 3.697,39 5.334,40 3.599,41 4.307,42 4.53,43 3.221,44 3.561,45 5.232,46 3.423,47 4.193,48 4.443,49 3.081,50 3.396,51 5.091,52 3.263,53 3.956,54 4.165,55 3.012,56 3.261,57 4.96,58 3.155,59 3.881,60 4.085,61 2.908,62 3.17,63 4.915,64 3.06,65 3.759,66 3.977,67 5.046}
{0 CHEMBL567896,1 3.487,2 2,3 6.457,4 2.979,5 -0.122,6 0.884,7 29.183,8 0.577,12 1.55,14 5.351,15 4,16 1.501,17 7.059,18 1.111,19 1.234,20 59.208,21 8.675,22 0.333,23 3.435,24 3.49,25 3.1,26 2.933,27 4.751,28 2.974,29 3.911,30 4.004,31 3.446,32 3.267,33 5.323,34 3.301,35 4.03,36 4.129,37 3.542,38 3.366,39 5.424,40 3.399,41 4.165,42 4.289,43 3.441,44 3.244,45 5.76,46 3.269,47 3.877,48 4.028,49 3.161,50 3.036,51 5.242,52 3.041,53 3.843,54 4.003,55 2.892,56 2.749,57 5.243,58 2.779,59 3.373,60 3.497,61 2.622,62 2.468,63 4.733,64 2.49,65 3.382,66 3.536,67 4.313}
{0 CHEMBL568173,1 3.496,2 2,3 6.457,4 3.055,5 0.066,6 0.926,7 33.775,8 0.742,12 1.563,14 5.366,15 4,16 1.482,17 7.667,18 1.46,19 2.131,20 63.956,21 8.275,22 0.316,23 3.523,24 3.589,25 3.151,26 3.022,27 4.787,28 3.049,29 4.019,30 4.128,31 3.498,32 3.352,33 5.38,34 3.369,35 4.181,36 4.318,37 3.579,38 3.433,39 5.483,40 3.455,41 4.21,42 4.331,43 3.515,44 3.321,45 5.797,46 3.344,47 4.006,48 4.154,49 3.259,50 3.167,51 5.357,52 3.168,53 3.962,54 4.112,55 3.09,56 2.961,57 5.354,58 2.979,59 3.744,60 3.899,61 2.806,62 2.75,63 5.04,64 2.751,65 3.562,66 3.711,67 4.215}
{0 CHEMBL568348,1 3.448,2 1,3 6.351,4 3.072,6 0.836,7 24.959,8 0.562,12 1.509,14 5.381,15 2,16 1.516,17 6.063,18 1.448,19 2.097,20 54.086,21 9.175,22 0.353,23 3.337,24 3.38,25 3.046,26 2.834,27 4.712,28 2.892,29 3.785,30 3.855,31 3.412,32 3.154,33 5.332,34 3.214,35 3.92,36 3.992,37 3.514,38 3.237,39 5.375,40 3.306,41 4,42 4.081,43 3.441,44 3.114,45 5.742,46 3.184,47 3.843,48 3.985,49 3.054,50 2.935,51 5.262,52 2.947,53 3.581,54 3.749,55 2.65,56 2.606,57 5.01,58 2.584,59 3.316,60 3.513,61 2.245,62 2.036,63 4.899,64 2.034,65 2.49,66 2.645,67 4.752}
{0 CHEMBL568385,1 3.471,2 2,3 4.908,4 3.031,5 0.207,6 0.984,7 35.833,8 0.657,12 1.542,14 5.366,15 5,16 1.482,17 8.056,18 2.048,19 4.193,20 63.603,21 8.275,22 0.316,23 3.524,24 3.588,25 3.164,26 3.006,27 4.773,28 3.039,29 4.028,30 4.143,31 3.504,32 3.308,33 5.367,34 3.343,35 4.133,36 4.252,37 3.576,38 3.385,39 5.433,40 3.429,41 4.153,42 4.248,43 3.525,44 3.306,45 5.76,46 3.332,47 4.037,48 4.203,49 3.257,50 3.169,51 5.31,52 3.165,53 3.945,54 4.088,55 3.089,56 2.954,57 5.352,58 2.975,59 3.734,60 3.9,61 2.628,62 2.764,63 4.972,64 2.714,65 3.459,66 3.662,67 4.144}
{0 CHEMBL568416,1 3.45,2 1,3 6.351,4 2.956,6 0.836,7 24.959,8 0.554,12 1.512,14 5.329,15 2,16 1.516,17 6.438,18 1.448,19 2.097,20 54.086,21 9.175,22 0.353,23 3.337,24 3.38,25 3.046,26 2.834,27 4.711,28 2.892,29 3.785,30 3.855,31 3.412,32 3.154,33 5.34,34 3.214,35 3.917,36 3.992,37 3.467,38 3.237,39 5.352,40 3.298,41 3.986,42 4.081,43 3.358,44 3.107,45 5.717,46 3.146,47 3.789,48 3.967,49 2.985,50 2.874,51 5.134,52 2.867,53 3.482,54 3.628,55 2.712,56 2.493,57 4.918,58 2.537,59 3.273,60 3.407,61 2.492,62 2.111,63 4.952,64 2.17,65 2.786,66 2.94,67 5.046}
{0 CHEMBL568417,1 3.48,2 1,3 6.457,4 2.941,5 -0.155,6 0.759,7 22.901,8 0.464,12 1.539,14 5.329,15 2,16 1.516,17 6.438,18 0.86,19 0.739,20 54.439,21 9.175,22 0.353,23 3.336,24 3.382,25 3.031,26 2.854,27 4.726,28 2.904,29 3.773,30 3.834,31 3.405,32 3.205,33 5.354,34 3.244,35 3.976,36 4.077,37 3.471,38 3.293,39 5.404,40 3.328,41 4.055,42 4.179,43 3.36,44 3.124,45 5.771,46 3.155,47 3.746,48 3.909,49 2.979,50 2.841,51 5.159,52 2.854,53 3.513,54 3.649,55 2.725,56 2.466,57 5.06,58 2.526,59 3.151,60 3.274,61 2.429,62 2.084,63 4.693,64 2.176,65 3.042,66 3.151,67 5.066}
{0 CHEMBL571514,1 3.519,2 1,3 4.511,4 2.973,5 2.818,6 1.016,7 30.525,8 0.714,12 1.611,14 5.177,15 1,16 1.368,17 7.813,18 3.212,19 10.318,20 61.96,21 7.276,22 0.353,23 3.491,24 3.582,25 3.037,26 3.025,27 4.592,28 3.009,29 4.017,30 4.165,31 3.343,32 3.345,33 5.163,34 3.309,35 4.224,36 4.428,37 3.311,38 3.386,39 5.242,40 3.33,41 4.097,42 4.301,43 3.101,44 3.234,45 5.139,46 3.151,47 3.955,48 4.185,49 2.886,50 3.063,51 4.929,52 2.97,53 3.756,54 3.958,55 2.759,56 2.905,57 4.869,58 2.816,59 3.659,60 3.875,61 2.471,62 2.838,63 4.56,64 2.699,65 3.625,66 3.879,67 5.137}
{0 CHEMBL571738,1 3.395,2 1,3 4.824,4 2.866,5 -0.005,6 0.814,7 18.806,8 0.455,12 1.464,14 5.155,16 1.441,17 5.846,18 1.295,19 1.678,20 48.44,21 8.39,22 0.429,23 3.184,24 3.248,25 2.835,26 2.751,27 4.45,28 2.766,29 3.638,30 3.728,31 3.168,32 3.087,33 4.998,34 3.089,35 3.819,36 3.959,37 3.144,38 3.141,39 5.065,40 3.117,41 3.772,42 3.953,43 2.822,44 2.926,45 4.977,46 2.868,47 3.482,48 3.691,49 2.494,50 2.562,51 4.714,52 2.495,53 3.165,54 3.365,55 2.031,56 1.997,57 4.536,58 1.956,59 2.528,60 2.76,61 1.428,62 1.38,63 3.697,64 1.354,65 1.959,66 2.086,67 4.117}
{0 CHEMBL572366,1 3.595,2 1,3 4.886,4 3.066,5 0.651,6 1.047,7 26.584,8 0.745,9 1,11 2,12 1.672,13 -0.213,14 5.294,15 1,16 1.381,17 7.474,18 2.888,19 8.341,20 72.995,21 7.09,22 0.3,23 3.694,24 3.79,25 3.2,26 3.193,27 4.82,28 3.176,29 4.232,30 4.389,31 3.554,32 3.559,33 5.362,34 3.526,35 4.461,36 4.637,37 3.625,38 3.71,39 5.541,40 3.652,41 4.587,42 4.807,43 3.598,44 3.694,45 5.68,46 3.613,47 4.51,48 4.715,49 3.459,50 3.611,51 5.602,52 3.531,53 4.467,54 4.682,55 3.33,56 3.507,57 5.58,58 3.405,59 4.355,60 4.604,61 2.969,62 3.374,63 5.252,64 3.219,65 4.145,66 4.407,67 5.42}
{0 CHEMBL574,1 3.591,3 4.832,4 2.687,6 0.938,7 4.736,8 0.307,12 1.532,14 5.377,16 1.813,17 4.727,18 1.144,19 1.31,20 44.441,21 8.562,22 0.545,23 3.089,24 3.174,25 3.077,26 2.729,27 4.185,28 2.641,29 3.576,30 3.701,31 3.197,32 3.027,33 5.27,34 2.942,35 3.727,36 3.871,37 3.065,38 3.066,39 5.083,40 2.945,41 3.74,42 3.961,43 2.697,44 2.797,45 5.048,46 2.647,47 3.412,48 3.702,49 2.177,50 2.278,51 4.542,52 2.105,53 2.587,54 2.791,55 1.741,56 1.75,57 3.852,58 1.595,59 2.615,60 2.825,61 0.758,62 1.257,63 4.078,64 1.18,65 1.844,66 2.277,67 5.102}
{0 CHEMBL578167,1 3.741,2 1,3 4.554,4 3.156,5 7.759,6 1.043,7 30.973,8 0.88,12 1.81,14 5.481,16 1.584,17 8.727,18 0.384,19 0.148,20 79.972,21 7.302,22 0.231,23 3.87,24 3.995,25 3.458,26 3.322,27 4.825,28 3.332,29 4.513,30 4.717,31 3.893,32 3.823,33 5.463,34 3.816,35 4.782,36 4.965,37 3.878,38 4.061,39 5.624,40 3.96,41 4.998,42 5.335,43 3.574,44 3.919,45 5.649,46 3.766,47 4.43,48 4.63,49 3.438,50 3.715,51 5.308,52 3.588,53 4.581,54 4.885,55 3.355,56 3.615,57 5.3,58 3.476,59 4.23,60 4.448,61 3.292,62 3.459,63 5.054,64 3.361,65 4.269,66 4.519,67 4.159}
{0 CHEMBL58323,1 3.543,3 4.757,4 3.19,5 0.583,6 1.124,7 19.293,8 0.704,9 1,11 1,12 1.619,13 -0.656,14 4.91,15 1,16 1.561,17 8.111,18 0.128,19 0.016,20 67.643,21 6.954,22 0.333,23 3.643,24 3.771,25 3.115,26 3.086,27 4.78,28 3.068,29 4.161,30 4.352,31 3.36,32 3.386,33 5.278,34 3.338,35 4.353,36 4.561,37 3.379,38 3.478,39 5.485,40 3.404,41 4.421,42 4.662,43 3.354,44 3.424,45 5.555,46 3.348,47 4.362,48 4.598,49 3.371,50 3.359,51 5.697,52 3.296,53 4.343,54 4.587,55 3.127,56 3.29,57 5.494,58 3.216,59 4.125,60 4.343,61 2.952,62 3.223,63 5.236,64 3.107,65 4.144,66 4.45,67 6.427}
{0 CHEMBL609,1 3.338,3 4.324,4 2.7,5 5.136,6 1.503,7 12.634,8 0.88,12 1.447,14 3.804,16 1.287,17 7,18 -2.271,19 5.157,20 43.317,21 5.224,23 3.361,24 3.572,25 2.533,26 2.621,27 4.301,28 2.558,29 3.892,30 4.178,31 2.558,32 2.911,33 4.668,34 2.758,35 4.128,36 4.487,37 2.468,38 2.954,39 4.822,40 2.726,41 3.965,42 4.317,43 2.299,44 2.832,45 4.564,46 2.603,47 3.854,48 4.207,49 2.172,50 2.693,51 4.508,52 2.466,53 3.728,54 4.095,55 2.013,56 2.517,57 4.46,58 2.279,59 3.484,60 3.849,61 1.742,62 2.307,63 4.115,64 2.071,65 3.253,66 3.61,67 4.319}
{0 CHEMBL6246,1 3.65,3 6.534,4 3.192,6 0.513,7 37.612,8 0.154,12 1.687,14 5.702,16 1.493,17 6.818,18 1.483,19 2.199,20 68.465,21 10.793,22 0.48,23 3.588,24 3.593,25 3.399,26 3.091,27 5.072,28 3.196,29 4.013,30 4.006,31 3.882,32 3.518,33 5.599,34 3.626,35 4.317,36 4.321,37 4.108,38 3.676,39 6.045,40 3.803,41 4.42,42 4.458,43 4.053,44 3.588,45 6.037,46 3.742,47 4.297,48 4.324,49 3.982,50 3.355,51 6.271,52 3.532,53 3.99,54 4.032,55 3.516,56 2.935,57 6.042,58 3.09,59 3.592,60 3.697,61 2.742,62 2.382,63 5.447,64 2.476,65 2.976,66 3.107,67 4.979}
{0 CHEMBL6466,1 3.349,2 1,3 4.242,4 2.632,6 0.796,7 15.62,8 0.187,12 1.415,14 5.103,16 1.379,17 4.636,18 1.9,19 3.609,20 41.624,21 8.597,22 0.5,23 2.977,24 3.038,25 2.674,26 2.614,27 4.226,28 2.619,29 3.414,30 3.49,31 3.001,32 2.923,33 4.788,34 2.919,35 3.588,36 3.737,37 2.897,38 2.908,39 4.799,40 2.881,41 3.365,42 3.536,43 2.44,44 2.569,45 4.559,46 2.507,47 2.957,48 3.171,49 1.885,50 2.064,51 4.192,52 1.973,53 2.333,54 2.575,55 1.04,56 1.217,57 3.629,58 1.128,59 1.143,60 1.366,61 0.113,62 0.276,63 2.197,64 0.229,67 5.252}
{0 CHEMBL66381,1 3.035,3 4.569,4 2.541,6 0.736,7 3.186,8 0.069,12 1.082,14 4.584,16 1.574,17 4.444,18 1.442,19 2.078,20 33.49,21 8.509,22 0.667,23 2.741,24 2.821,25 2.393,26 2.377,27 4.182,28 2.372,29 3.058,30 3.16,31 2.609,32 2.636,33 4.415,34 2.607,35 3.279,36 3.445,37 2.505,38 2.593,39 4.677,40 2.535,41 3.064,42 3.308,43 1.915,44 2.098,45 4.433,46 2,47 2.319,48 2.614,49 1.337,50 1.257,51 3.777,52 1.228,53 1.247,54 1.327,55 0.97,56 0.51,57 3.676,58 0.591,59 0.738,60 0.939,61 0.094,62 0.213,63 1.946,64 0.182,67 5.174}
{0 CHEMBL66879,1 3.375,3 6.351,4 2.687,6 0.804,7 4.095,8 0.218,12 1.448,14 4.607,16 1.458,17 6.25,18 1.635,19 2.673,20 44.829,21 8.209,22 0.5,23 3.097,24 3.169,25 2.69,26 2.639,27 4.485,28 2.646,29 3.442,30 3.532,31 2.959,32 2.91,33 5.039,34 2.894,35 3.669,36 3.83,37 2.794,38 2.923,39 4.994,40 2.861,41 3.564,42 3.779,43 2.464,44 2.693,45 4.724,46 2.59,47 3.299,48 3.528,49 2.441,50 2.398,51 4.609,52 2.358,53 3.105,54 3.239,55 2.276,56 2.043,57 4.725,58 2.108,59 2.817,60 2.992,61 1.763,62 1.57,63 4.3,64 1.626,65 2.205,66 2.372,67 5.121}
{0 CHEMBL69813,1 3.767,3 6.999,4 2.773,6 0.573,7 15.088,8 0.116,12 1.487,14 5.413,16 2.405,17 4.923,18 0.695,19 0.483,20 56.725,21 16.637,22 0.462,23 3.094,24 3.168,25 3.52,26 2.826,27 4.4,28 2.714,29 3.541,30 3.612,31 3.885,32 3.195,33 5.407,34 3.067,35 3.753,36 3.853,37 4.104,38 3.313,39 5.451,40 3.136,41 3.732,42 3.88,43 4.351,44 3.193,45 5.3,46 2.925,47 3.419,48 3.61,49 4.027,50 2.598,51 5.501,52 2.458,53 2.638,54 2.798,55 2.095,56 1.877,57 4.589,58 1.606,59 2.339,60 2.571,61 0.61,62 0.972,63 3.807,64 0.937,65 1.515,66 1.922,67 4.721}
{0 CHEMBL71611,1 3.982,3 7.716,4 3.934,6 0.664,7 48.708,8 0.562,12 1.746,14 5.712,15 4,16 2.513,17 8.727,18 0.757,19 0.573,20 84.05,21 13.374,22 0.478,23 3.571,24 3.617,25 3.899,26 3.221,27 4.892,28 3.17,29 4.052,30 4.092,31 4.24,32 3.562,33 5.956,34 3.53,35 4.229,36 4.299,37 4.295,38 3.597,39 5.985,40 3.558,41 4.241,42 4.341,43 4.251,44 3.458,45 5.995,46 3.45,47 4.007,48 4.122,49 4.026,50 3.214,51 6.026,52 3.211,53 3.726,54 3.799,55 3.809,56 3.136,57 5.318,58 3.074,59 3.851,60 3.927,61 3.885,62 3.049,63 6.054,64 3.06,65 3.526,66 3.622,67 4.42}
{0 CHEMBL73962,1 3.979,3 6.999,4 3.668,6 0.789,7 33.329,8 0.605,12 1.746,14 5.693,15 4,16 2.208,17 7.947,18 0.634,19 0.402,20 74.329,21 11.867,22 0.55,23 3.476,24 3.519,25 3.778,26 3.158,27 4.683,28 3.078,29 3.964,30 4.012,31 4.066,32 3.474,33 5.83,34 3.406,35 4.105,36 4.207,37 4.034,38 3.462,39 5.678,40 3.372,41 4.048,42 4.163,43 3.853,44 3.268,45 5.732,46 3.239,47 3.815,48 3.951,49 3.58,50 3.074,51 5.457,52 3.018,53 3.611,54 3.726,55 3.577,56 3.009,57 4.865,58 2.912,59 3.626,60 3.713,61 3.405,62 2.878,63 5.83,64 2.845,65 3.333,66 3.441,67 4.845}
{0 CHEMBL77517,1 4.019,3 6.999,4 3.562,6 0.753,7 14.076,8 0.739,12 1.905,14 5.711,16 2.084,17 9.417,18 2.576,19 6.637,20 93.904,21 10.719,22 0.615,23 3.738,24 3.797,25 3.878,26 3.416,27 4.887,28 3.362,29 4.248,30 4.318,31 4.124,32 3.797,33 5.957,34 3.748,35 4.479,36 4.595,37 4.181,38 3.903,39 5.892,40 3.822,41 4.521,42 4.656,43 4.064,44 3.801,45 5.981,46 3.731,47 4.444,48 4.622,49 3.95,50 3.653,51 5.843,52 3.55,53 4.163,54 4.295,55 3.993,56 3.512,57 5.478,58 3.448,59 4.137,60 4.23,61 3.832,62 3.403,63 6.184,64 3.387,65 4.004,66 4.196,67 4.983}
{0 CHEMBL83294,1 3.445,2 1,3 6.351,4 2.824,6 0.739,7 19.716,8 0.188,12 1.504,14 5.308,15 2,16 1.485,17 5.5,18 1.464,19 2.144,20 47.623,21 9.508,22 0.4,23 3.161,24 3.201,25 2.901,26 2.731,27 4.561,28 2.778,29 3.579,30 3.623,31 3.276,32 3.06,33 5.212,34 3.1,35 3.783,36 3.882,37 3.299,38 3.096,39 5.222,40 3.141,41 3.765,42 3.861,43 3.155,44 2.841,45 5.603,46 2.897,47 3.369,48 3.514,49 2.649,50 2.489,51 4.86,52 2.52,53 3.004,54 3.118,55 2.264,56 2.001,57 4.688,58 2.077,59 2.611,60 2.76,61 1.501,62 1.401,63 4.2,64 1.442,65 1.827,66 2.085,67 5.18}
{0 CHEMBL865,1 3.893,3 5.214,4 3.53,6 0.828,7 19.313,8 0.833,12 1.871,14 5.508,16 1.724,17 8.591,18 2.723,19 7.415,20 85.583,21 8.733,22 0.708,23 3.706,24 3.784,25 3.588,26 3.353,27 4.874,28 3.309,29 4.184,30 4.291,31 3.824,32 3.706,33 5.67,34 3.664,35 4.377,36 4.518,37 3.804,38 3.793,39 5.614,40 3.73,41 4.43,42 4.596,43 3.747,44 3.751,45 5.687,46 3.696,47 4.403,48 4.583,49 3.617,50 3.676,51 5.561,52 3.615,53 4.291,54 4.491,55 3.453,56 3.605,57 5.302,58 3.481,59 4.206,60 4.428,61 3.481,62 3.479,63 5.216,64 3.331,65 4.102,66 4.302,67 4.108}
{0 CHEMBL926,1 3.842,3 6.402,4 3.231,5 3.61,6 0.993,7 16.08,8 1.03,9 1,11 1,12 1.881,13 0.388,14 5.143,16 1.406,17 11.682,18 3.625,19 13.141,20 87.529,21 6.698,22 0.522,23 3.872,24 3.991,25 3.309,26 3.388,27 4.994,28 3.347,29 4.366,30 4.542,31 3.612,32 3.756,33 5.409,34 3.68,35 4.688,36 4.914,37 3.626,38 3.878,39 5.767,40 3.76,41 4.744,42 5.013,43 3.358,44 3.814,45 5.596,46 3.633,47 4.665,48 4.969,49 3.263,50 3.7,51 5.395,52 3.51,53 4.524,54 4.792,55 3.261,56 3.616,57 5.414,58 3.461,59 4.476,60 4.739,61 3.172,62 3.593,63 5.356,64 3.423,65 4.423,66 4.699,67 5.131}
{0 CHEMBL941,1 3.852,3 4.842,4 3.684,5 5.237,6 0.972,7 38.145,8 1.125,12 1.886,14 5.315,15 1,16 1.468,17 16.73,18 4.221,19 17.813,20 146.651,21 7.26,22 0.585,23 4.309,24 4.443,25 3.863,26 3.85,27 5.388,28 3.826,29 4.838,30 5.033,31 4.197,32 4.233,33 5.866,34 4.187,35 5.077,36 5.286,37 4.239,38 4.395,39 6.061,40 4.31,41 5.205,42 5.466,43 4.145,44 4.367,45 6.139,46 4.247,47 5.13,48 5.402,49 4.135,50 4.291,51 6.073,52 4.196,53 4.967,54 5.186,55 4.111,56 4.268,57 6.004,58 4.179,59 5.016,60 5.264,61 4.026,62 4.248,63 5.971,64 4.136,65 4.9,66 5.125,67 6.277}
