"molecule_id","nC","Sp","nH","nCsp3","Sv","Se","nAT","nBT","Si","SCBO","nBO","nSK","MW","nCsp2","nDB","pXC50"
{1 35,2 61.279,3 45,4 12,5 58.765,6 96.778,7 96,8 99,9 109.587,10 70.5,11 54,12 51,13 699.91,14 23,15 6,16 4}
{0 CHEMBL102688,1 36,2 62.279,3 45,4 13,5 59.765,6 97.778,7 97,8 101,9 110.587,10 72.5,11 56,12 52,13 711.92,14 23,15 6,16 5.449}
{0 CHEMBL103817,1 38,2 64.279,3 45,4 11,5 61.765,6 99.778,7 99,8 103,9 112.587,10 77,11 58,12 54,13 735.94,14 27,15 6,16 8.109}
{0 CHEMBL104010,1 31,2 57.006,3 41,4 11,5 55.227,6 91.33,7 90,8 93,9 103.338,10 68,11 52,12 49,13 675.85,14 20,15 6,16 4}
{0 CHEMBL104052,1 33,2 58.762,3 42,4 11,5 56.733,6 93.112,7 92,8 95,9 105.255,10 69.5,11 53,12 50,13 686.87,14 22,15 6,16 4}
{0 CHEMBL104397,1 38,2 64.279,3 45,4 11,5 61.765,6 99.778,7 99,8 103,9 112.587,10 77,11 58,12 54,13 735.94,14 27,15 6,16 4}
{0 CHEMBL104880,1 34,2 59.972,3 43,4 11,5 57.953,6 95.221,7 94,8 97,9 107.381,10 70.5,11 54,12 51,13 701.88,14 23,15 6,16 4}
{0 CHEMBL105113,1 34,2 59.972,3 43,4 11,5 57.953,6 95.221,7 94,8 97,9 107.381,10 70.5,11 54,12 51,13 701.88,14 23,15 6,16 5.62}
{0 CHEMBL106959,1 40,2 67.04,3 47,4 11,5 64.292,6 103.661,7 103,8 107,9 117.002,10 79.5,11 60,12 56,13 761.98,14 29,15 6,16 5.301}
{0 CHEMBL1093304,1 34,2 55.41,3 44,4 20,5 51.677,6 85.748,7 86,8 90,9 97.672,10 54,11 46,12 42,13 600.26,14 14,15 2,16 7.658}
{0 CHEMBL1209788,1 33,2 52.58,3 38,4 19,5 49.812,6 80.425,7 80,8 85,9 90.635,10 56,11 47,12 42,13 598.19,14 13,15 1,16 8.469}
{0 CHEMBL138212,1 35,2 61.279,3 45,4 12,5 58.765,6 96.778,7 96,8 99,9 109.587,10 70.5,11 54,12 51,13 699.91,14 23,15 6,16 6.194}
{0 CHEMBL138771,1 37,2 62.029,3 45,4 11,5 59.249,6 96.458,7 96,8 99,9 109.005,10 71,11 54,12 51,13 695.91,14 26,15 6,16 6.585}
{0 CHEMBL140324,1 36,2 61.79,3 47,4 14,5 58.776,6 97.341,7 97,8 100,9 110.421,10 68.5,11 53,12 50,13 685.92,14 22,15 5,16 4.565}
{0 CHEMBL140847,1 35,2 61.279,3 45,4 12,5 58.765,6 96.778,7 96,8 99,9 109.587,10 70.5,11 54,12 51,13 699.91,14 23,15 6,16 6.056}
{0 CHEMBL151906,1 34,2 60.16,3 42,4 11,5 57.404,6 92.869,7 92,8 95,9 104.593,10 69.5,11 53,12 50,13 702.93,14 23,15 6,16 6.845}
{0 CHEMBL152555,1 38,2 64.035,3 46,4 11,5 61.27,6 99.559,7 99,8 102,9 112.504,10 73.5,11 56,12 53,13 722.94,14 27,15 6,16 4.936}
{0 CHEMBL152612,1 34,2 59.518,3 43,4 11,5 57.238,6 93.894,7 93,8 96,9 106.172,10 69.5,11 53,12 50,13 685.88,14 23,15 6,16 7.764}
{0 CHEMBL152986,1 32,2 56.512,3 42,4 11,5 54.217,6 89.792,7 89,8 91,9 101.673,10 63.5,11 49,12 47,13 646.84,14 21,15 6,16 5.108}
{0 CHEMBL153420,1 34,2 59.273,3 44,4 13,5 56.744,6 93.676,7 93,8 96,9 106.088,10 66.5,11 52,12 49,13 672.88,14 21,15 6,16 5.259}
{0 CHEMBL154153,1 36,2 61.273,3 44,4 11,5 58.744,6 95.676,7 95,8 98,9 108.088,10 71,11 54,12 51,13 696.9,14 25,15 6,16 6.585}
{0 CHEMBL154251,1 32,2 56.512,3 42,4 11,5 54.217,6 89.792,7 89,8 91,9 101.673,10 63.5,11 49,12 47,13 646.84,14 21,15 6,16 6}
{0 CHEMBL1688104,1 77,2 137.046,3 94,4 28,5 131.203,6 211.868,7 209,8 217,9 237.229,10 156.5,11 123,12 115,13 1636.12,14 49,15 14,16 6.456}
{0 CHEMBL1688105,1 77,2 137.046,3 94,4 28,5 131.203,6 211.868,7 209,8 217,9 237.229,10 156.5,11 123,12 115,13 1636.12,14 49,15 14,16 5.514}
{0 CHEMBL1688106,1 77,2 137.046,3 94,4 28,5 131.203,6 211.868,7 209,8 217,9 237.229,10 156.5,11 123,12 115,13 1636.12,14 49,15 14,16 5.493}
{0 CHEMBL1688107,1 72,2 126.654,3 87,4 24,5 121.699,6 196.712,7 194,8 201,9 220.356,10 146.5,11 114,12 107,13 1506.92,14 48,15 13,16 9.67}
{0 CHEMBL1688108,1 39,2 69.91,3 50,4 15,5 66.742,6 109.05,7 108,8 112,9 123.045,10 79.5,11 62,12 58,13 815.08,14 24,15 7,16 6.187}
{0 CHEMBL1688109,1 77,2 137.046,3 94,4 28,5 131.203,6 211.868,7 209,8 217,9 237.229,10 156.5,11 123,12 115,13 1636.12,14 49,15 14,16 5.564}
{0 CHEMBL1688110,1 77,2 137.046,3 94,4 28,5 131.203,6 211.868,7 209,8 217,9 237.229,10 156.5,11 123,12 115,13 1636.12,14 49,15 14,16 7.071}
{0 CHEMBL1688111,1 77,2 137.046,3 94,4 28,5 131.203,6 211.868,7 209,8 217,9 237.229,10 156.5,11 123,12 115,13 1636.12,14 49,15 14,16 6.415}
{0 CHEMBL190366,1 45,2 78.893,3 65,4 22,5 74.033,6 125.614,7 126,8 129,9 143.739,10 80.5,11 64,12 61,13 840.21,14 23,15 6,16 7.686}
{0 CHEMBL191303,1 40,2 70.086,3 55,4 17,5 66.399,6 111.196,7 111,8 114,9 126.663,10 75.5,11 59,12 56,13 770.06,14 23,15 6,16 8.599}
{0 CHEMBL191304,1 49,2 85.939,3 73,4 26,5 80.14,6 137.148,7 138,8 141,9 157.4,10 84.5,11 68,12 65,13 896.33,14 23,15 6,16 7.67}
{0 CHEMBL193151,1 47,2 82.416,3 69,4 24,5 77.087,6 131.381,7 132,8 135,9 150.569,10 82.5,11 66,12 63,13 868.27,14 23,15 6,16 7.879}
{0 CHEMBL194217,1 43,2 75.37,3 61,4 20,5 70.979,6 119.846,7 120,8 123,9 136.908,10 78.5,11 62,12 59,13 812.15,14 23,15 6,16 7.721}
{0 CHEMBL195439,1 41,2 71.847,3 57,4 18,5 67.926,6 114.079,7 114,8 117,9 130.078,10 76.5,11 60,12 57,13 784.09,14 23,15 6,16 8.943}
{0 CHEMBL195468,1 44,2 77.439,3 65,4 22,5 72.318,6 123.286,7 124,8 127,9 141.529,10 77.5,11 62,12 59,13 812.2,14 22,15 5,16 7.631}
{0 CHEMBL2096693,1 33,2 57.512,3 42,4 12,5 55.217,6 90.792,7 90,8 93,9 102.673,10 65.5,11 51,12 48,13 658.85,14 21,15 6,16 5.071}
{0 CHEMBL2096710,1 64,2 112.654,3 79,4 22,5 107.845,6 175.21,7 173,8 178,9 196.323,10 126,11 99,12 94,13 1330.72,14 42,15 12,16 6.681}
{0 CHEMBL2096712,1 50,2 89.734,3 69,4 23,5 85.978,6 144.33,7 143,8 147,9 163.57,10 98.5,11 78,12 74,13 1024.34,14 27,15 10,16 10.276}
{0 CHEMBL2096713,1 73,2 125.268,3 87,4 24,5 121.755,6 198.213,7 195,8 202,9 221.935,10 148.5,11 115,12 108,13 1486.79,14 49,15 14,16 9.886}
{0 CHEMBL2096714,1 76,2 127.779,3 89,4 24,5 123.765,6 200.777,7 198,8 205,9 224.769,10 150,11 116,12 109,13 1496.82,14 52,15 14,16 9.194}
{0 CHEMBL2096715,1 78,2 130.541,3 91,4 26,5 126.292,6 204.661,7 202,8 210,9 229.184,10 153,11 119,12 111,13 1522.86,14 52,15 14,16 6.939}
{0 CHEMBL2096716,1 67,2 117.501,3 84,4 26,5 114.206,6 188.228,7 185,8 191,9 211.021,10 135.5,11 107,12 101,13 1397.69,14 41,15 14,16 5.143}
{0 CHEMBL2096717,1 75,2 127.024,3 88,4 24,5 123.26,6 199.995,7 197,8 204,9 223.852,10 150,11 116,12 109,13 1497.81,14 51,15 14,16 9.569}
{0 CHEMBL2096718,1 75,2 127.024,3 88,4 24,5 123.26,6 199.995,7 197,8 204,9 223.852,10 150,11 116,12 109,13 1497.81,14 51,15 14,16 9.174}
{0 CHEMBL2096719,1 77,2 129.785,3 90,4 24,5 125.787,6 203.879,7 201,8 208,9 228.267,10 152.5,11 118,12 111,13 1523.85,14 53,15 14,16 7.371}
{0 CHEMBL2096720,1 72,2 123.262,3 86,4 25,5 119.733,6 195.112,7 192,8 199,9 218.437,10 144.5,11 113,12 106,13 1459.76,14 47,15 14,16 6.585}
{0 CHEMBL2096721,1 70,2 120.257,3 85,4 24,5 116.712,6 191.01,7 188,8 194,9 213.938,10 140,11 109,12 103,13 1420.72,14 46,15 14,16 9.444}
{0 CHEMBL2096722,1 67,2 117.745,3 83,4 24,5 114.701,6 188.446,7 185,8 191,9 211.105,10 138.5,11 108,12 102,13 1410.69,14 43,15 14,16 4.833}
{0 CHEMBL2096723,1 70,2 117.728,3 80,4 22,5 114.637,6 185.141,7 182,8 189,9 206.61,10 141.5,11 109,12 102,13 1401.66,14 48,15 13,16 7.488}
{0 CHEMBL2096724,1 65,2 114.739,3 82,4 24,5 111.68,6 184.344,7 181,8 186,9 206.606,10 132.5,11 104,12 99,13 1371.65,14 41,15 14,16 6.149}
{0 CHEMBL2096725,1 72,2 123.018,3 87,4 26,5 119.239,6 194.893,7 192,8 199,9 218.354,10 143,11 112,12 105,13 1446.76,14 46,15 14,16 9.201}
{0 CHEMBL2096726,1 69,2 120.507,3 85,4 26,5 117.228,6 192.33,7 189,8 196,9 215.52,10 141.5,11 111,12 104,13 1436.73,14 43,15 14,16 4.777}
{0 CHEMBL2096729,1 79,2 132.791,3 91,4 24,5 128.808,6 207.981,7 205,8 213,9 232.765,10 158.5,11 122,12 114,13 1562.89,14 55,15 14,16 9.244}
{0 CHEMBL2096730,1 72,2 120.489,3 82,4 24,5 117.164,6 189.024,7 186,8 194,9 211.025,10 144.5,11 112,12 104,13 1427.7,14 48,15 13,16 5.367}
{0 CHEMBL2096731,1 73,2 124.018,3 87,4 25,5 120.239,6 195.893,7 193,8 200,9 219.354,10 145.5,11 113,12 106,13 1458.77,14 48,15 13,16 5.066}
{0 CHEMBL2096745,1 33,2 57.512,3 42,4 12,5 55.217,6 90.792,7 90,8 93,9 102.673,10 65.5,11 51,12 48,13 658.85,14 21,15 6,16 4.405}
{0 CHEMBL2096818,1 77,2 130.029,3 89,4 24,5 126.281,6 204.097,7 201,8 209,9 228.35,10 156,11 120,12 112,13 1536.85,14 53,15 14,16 9.244}
{0 CHEMBL2096819,1 73,2 125.268,3 87,4 24,5 121.755,6 198.213,7 195,8 202,9 221.935,10 148.5,11 115,12 108,13 1486.79,14 49,15 14,16 9.18}
{0 CHEMBL2112213,1 26,2 40.313,3 27,4 4,5 38.331,6 59.883,7 60,8 63,9 67.478,10 49,11 36,12 33,13 441.58,14 22,15 2,16 6.398}
{0 CHEMBL214332,1 77,2 141.905,3 109,4 38,5 136.397,6 230.311,7 227,8 232,9 259.632,10 152.5,11 123,12 118,13 1665.14,14 39,15 16,16 8.553}
{0 CHEMBL216295,1 50,2 90.188,3 69,4 23,5 86.693,6 145.657,7 144,8 148,9 164.779,10 99.5,11 79,12 75,13 1040.34,14 27,15 10,16 10.06}
{0 CHEMBL224277,1 53,2 95.166,3 73,4 25,5 91.461,6 153.752,7 152,8 156,9 173.819,10 104.5,11 83,12 79,13 1096.41,14 28,15 11,16 10.398}
{0 CHEMBL2304246,1 107,2 197.933,3 152,4 53,5 189.935,6 320.624,7 316,8 322,9 361.189,10 209,11 170,12 164,13 2327.01,14 54,15 24,16 4.668}
{0 CHEMBL2304247,1 107,2 197.933,3 152,4 53,5 189.935,6 320.624,7 316,8 322,9 361.189,10 209,11 170,12 164,13 2327.01,14 54,15 24,16 8.172}
{0 CHEMBL2304248,1 107,2 197.933,3 152,4 53,5 189.935,6 320.624,7 316,8 322,9 361.189,10 209,11 170,12 164,13 2327.01,14 54,15 24,16 4.424}
{0 CHEMBL2304249,1 107,2 197.933,3 152,4 53,5 189.935,6 320.624,7 316,8 322,9 361.189,10 209,11 170,12 164,13 2327.01,14 54,15 24,16 5.319}
{0 CHEMBL2304250,1 107,2 197.933,3 152,4 53,5 189.935,6 320.624,7 316,8 322,9 361.189,10 209,11 170,12 164,13 2327.01,14 54,15 24,16 5.081}
{0 CHEMBL2304320,1 107,2 197.933,3 152,4 53,5 189.935,6 320.624,7 316,8 322,9 361.189,10 209,11 170,12 164,13 2327.01,14 54,15 24,16 5.079}
{0 CHEMBL2323529,1 69,2 126.518,3 89,4 28,5 121.128,6 197.999,7 195,8 201,9 221.901,10 140.5,11 112,12 106,13 1520.98,14 41,15 14,16 6.678}
{0 CHEMBL2323785,1 79,2 138.802,3 95,4 28,5 132.708,6 213.65,7 211,8 219,9 239.146,10 158,11 124,12 116,13 1647.14,14 51,15 14,16 6.658}
{0 CHEMBL2323786,1 79,2 138.802,3 95,4 28,5 132.708,6 213.65,7 211,8 219,9 239.146,10 158,11 124,12 116,13 1647.14,14 51,15 14,16 7.301}
{0 CHEMBL2323787,1 81,2 141.563,3 97,4 28,5 135.235,6 217.533,7 215,8 223,9 243.562,10 160.5,11 126,12 118,13 1673.18,14 53,15 14,16 6.009}
{0 CHEMBL2323788,1 74,2 132.035,3 92,4 28,5 126.16,6 204.664,7 202,8 209,9 229.233,10 148,11 117,12 110,13 1570.05,14 46,15 14,16 6.152}
{0 CHEMBL2323789,1 80,2 139.558,3 96,4 28,5 133.214,6 214.432,7 212,8 220,9 240.063,10 158,11 124,12 116,13 1646.15,14 52,15 14,16 6.538}
{0 CHEMBL2323790,1 76,2 134.796,3 94,4 30,5 128.687,6 208.548,7 206,8 214,9 233.648,10 151,11 120,12 112,13 1596.09,14 46,15 14,16 6.62}
{0 CHEMBL2323791,1 73,2 132.285,3 92,4 30,5 126.676,6 205.984,7 203,8 211,9 230.814,10 149.5,11 119,12 111,13 1586.06,14 43,15 14,16 5.268}
{0 CHEMBL2323792,1 71,2 129.524,3 90,4 28,5 124.149,6 202.101,7 199,8 206,9 226.399,10 146.5,11 116,12 109,13 1560.02,14 43,15 14,16 4.697}
{0 CHEMBL2323793,1 81,2 141.808,3 96,4 28,5 135.73,6 217.752,7 215,8 224,9 243.645,10 164,11 128,12 119,13 1686.18,14 53,15 14,16 6.886}
{0 CHEMBL2323794,1 81,2 141.808,3 96,4 28,5 135.73,6 217.752,7 215,8 224,9 243.645,10 164,11 128,12 119,13 1686.18,14 53,15 14,16 6.721}
{0 CHEMBL2323795,1 77,2 139.706,3 93,4 28,5 132.52,6 211.937,7 209,8 217,9 236.95,10 157.5,11 124,12 116,13 1762.01,14 49,15 14,16 7.699}
{0 CHEMBL2323796,1 83,2 144.569,3 98,4 28,5 138.256,6 221.635,7 219,8 228,9 248.06,10 166.5,11 130,12 121,13 1712.22,14 55,15 14,16 6.119}
{0 CHEMBL2323797,1 74,2 129.507,3 87,4 26,5 124.085,6 198.795,7 196,8 204,9 221.904,10 149.5,11 117,12 109,13 1550.99,14 48,15 13,16 5.886}
{0 CHEMBL2323798,1 77,2 135.796,3 94,4 29,5 129.687,6 209.548,7 207,8 215,9 234.648,10 153.5,11 121,12 113,13 1608.1,14 48,15 13,16 6.377}
{0 CHEMBL2323799,1 78,2 138.808,3 96,4 29,5 132.73,6 214.752,7 212,8 220,9 240.645,10 157.5,11 124,12 116,13 1650.15,14 49,15 14,16 6.015}
{0 CHEMBL2323800,1 75,2 129.501,3 86,4 27,5 124.064,6 197.694,7 195,8 204,9 220.406,10 150.5,11 118,12 109,13 1547.98,14 48,15 13,16 5.896}
{0 CHEMBL264190,1 34,2 59.518,3 43,4 11,5 57.238,6 93.894,7 93,8 96,9 106.172,10 69.5,11 53,12 50,13 685.88,14 23,15 6,16 7.971}
{0 CHEMBL264536,1 47,2 84.66,3 64,4 20,5 81.618,6 136.788,7 135,8 138,9 154.45,10 94.5,11 74,12 71,13 985.25,14 27,15 10,16 9.027}
{0 CHEMBL265236,1 48,2 84.177,3 71,4 25,5 78.613,6 134.264,7 135,8 138,9 153.984,10 83.5,11 67,12 64,13 882.3,14 23,15 6,16 7.575}
{0 CHEMBL266288,1 217,2 444.895,3 327,4 128,5 421.648,6 705.266,7 692,8 705,9 790.083,10 451.5,11 378,12 365,13 5512.56,14 89,15 56,16 8.144}
{0 CHEMBL266647,1 30,2 51.876,3 42,4 16,5 47.706,6 79.381,7 80,8 82,9 90.604,10 48,11 40,12 38,13 561.66,14 14,15 2,16 7.745}
{0 CHEMBL267794,1 45,2 80.438,3 61,4 19,5 77.355,6 129.476,7 128,8 131,9 146.327,10 89.5,11 70,12 67,13 928.19,14 26,15 9,16 9.347}
{0 CHEMBL269274,1 176,2 354.11,3 251,4 93,5 337.107,6 557.125,7 546,8 559,9 622.867,10 375,11 308,12 295,13 4418.94,14 83,15 45,16 8.836}
{0 CHEMBL269837,1 19,2 28.773,3 20,4 5,5 27.214,6 42.811,7 43,8 45,9 48.152,10 33,11 25,12 23,13 308.41,14 14,15 2,16 4.456}
{0 CHEMBL270270,1 20,2 32.398,3 22,4 6,5 30.589,6 48.12,7 48,8 50,9 54.01,10 36,11 28,12 26,13 371.9,14 14,15 2,16 6.62}
{0 CHEMBL270689,1 20,2 30.534,3 22,4 6,5 28.74,6 45.694,7 46,8 48,9 51.567,10 34,11 26,12 24,13 322.44,14 14,15 2,16 4}
{0 CHEMBL270923,1 47,2 77.234,3 53,4 13,5 74.302,6 118.967,7 118,8 123,9 133.666,10 92,11 70,12 65,13 884.11,14 34,15 8,16 6.824}
{0 CHEMBL271586,1 46,2 78.518,3 59,4 18,5 74.882,6 123.617,7 123,8 127,9 139.912,10 87,11 68,12 64,13 878.16,14 28,15 8,16 8.301}
{0 CHEMBL272437,1 29,2 41.398,3 22,4 3,5 39.589,6 57.12,7 57,8 62,9 63.01,10 55.5,11 40,12 35,13 479.99,14 26,15 2,16 4}
{0 CHEMBL272660,1 44,2 74.995,3 55,4 16,5 71.829,6 117.85,7 117,8 121,9 133.082,10 85,11 66,12 62,13 850.1,14 28,15 8,16 8.398}
{0 CHEMBL272662,1 20,2 32.79,3 23,4 5,5 31.278,6 50.116,7 50,8 52,9 56.647,10 38,11 29,12 27,13 365.48,14 15,15 3,16 4}
{0 CHEMBL272843,1 25,2 35.779,3 21,4 3,5 34.235,6 50.912,7 51,8 55,9 56.651,10 47,11 34,12 30,13 395.49,14 22,15 2,16 4}
{0 CHEMBL273044,1 29,2 40.296,3 24,4 3,5 38.267,6 56.578,7 57,8 61,9 62.983,10 51,11 37,12 33,13 432.55,14 26,15 2,16 5.706}
{0 CHEMBL275303,1 38,2 63.029,3 45,4 12,5 60.249,6 97.458,7 97,8 101,9 110.005,10 73,11 56,12 52,13 707.92,14 26,15 6,16 4.932}
{0 CHEMBL287895,1 15,2 27.352,3 14,4 4,5 24.76,6 35.189,7 35,8 37,9 38.631,10 29.5,11 23,12 21,13 357.35,14 11,15 1,16 5.658}
{0 CHEMBL289532,1 17,2 26.625,3 16,4 4,5 25.211,6 38.374,7 38,8 40,9 42.918,10 31,11 24,12 22,13 318.42,14 13,15 1,16 4.801}
{0 CHEMBL291870,1 22,2 36.83,3 30,4 8,5 34.364,6 57.549,7 58,8 59,9 65.81,10 37,11 29,12 28,13 382.56,14 14,15 2,16 4}
{0 CHEMBL293673,1 22,2 36.313,3 27,4 6,5 34.331,6 55.883,7 56,8 58,9 63.478,10 41,11 31,12 29,13 393.54,14 16,15 2,16 4}
{0 CHEMBL302703,1 34,2 59.518,3 43,4 11,5 57.238,6 93.894,7 93,8 96,9 106.172,10 69.5,11 53,12 50,13 685.88,14 23,15 6,16 5.179}
{0 CHEMBL303283,1 25,2 41.597,3 33,4 9,5 38.912,6 64.534,7 65,8 67,9 73.723,10 44,11 34,12 32,13 435.63,14 16,15 2,16 4}
{0 CHEMBL305132,1 28,2 47.126,3 38,4 12,5 43.987,6 73.403,7 74,8 77,9 84.052,10 49,11 39,12 36,13 490.72,14 16,15 2,16 5.553}
{0 CHEMBL305391,1 24,2 39.836,3 31,4 8,5 37.385,6 61.65,7 62,8 64,9 70.308,10 43,11 33,12 31,13 421.6,14 16,15 2,16 4}
{0 CHEMBL305559,1 23,2 38.074,3 29,4 7,5 35.858,6 58.767,7 59,8 61,9 66.893,10 42,11 32,12 30,13 407.57,14 16,15 2,16 4.625}
{0 CHEMBL307457,1 39,2 69.171,3 50,4 14,5 66.984,6 110.628,7 109,8 112,9 124.544,10 80.5,11 62,12 59,13 815.01,14 25,15 8,16 8.366}
{0 CHEMBL317210,1 28,2 51.995,3 39,4 11,5 50.185,6 84.127,7 83,8 85,9 95.341,10 59.5,11 46,12 44,13 609.78,14 17,15 6,16 4}
{0 CHEMBL317228,1 33,2 57.756,3 41,4 10,5 55.711,6 91.01,7 90,8 93,9 102.756,10 68.5,11 52,12 49,13 671.85,14 23,15 6,16 4.393}
{0 CHEMBL317968,1 36,2 61.273,3 44,4 11,5 58.744,6 95.676,7 95,8 98,9 108.088,10 71,11 54,12 51,13 696.9,14 25,15 6,16 6.893}
{0 CHEMBL317969,1 36,2 61.273,3 44,4 11,5 58.744,6 95.676,7 95,8 98,9 108.088,10 71,11 54,12 51,13 696.9,14 25,15 6,16 6.052}
{0 CHEMBL318119,1 33,2 57.756,3 41,4 10,5 55.711,6 91.01,7 90,8 93,9 102.756,10 68.5,11 52,12 49,13 671.85,14 23,15 6,16 4}
{0 CHEMBL319871,1 40,2 67.04,3 47,4 11,5 64.292,6 103.661,7 103,8 107,9 117.002,10 79.5,11 60,12 56,13 761.98,14 29,15 6,16 7.165}
{0 CHEMBL319922,1 38,2 64.279,3 45,4 11,5 61.765,6 99.778,7 99,8 103,9 112.587,10 77,11 58,12 54,13 735.94,14 27,15 6,16 4}
{0 CHEMBL320157,1 33,2 57.268,3 43,4 13,5 54.722,6 90.574,7 90,8 93,9 102.59,10 64,11 50,12 47,13 645.85,14 20,15 6,16 5.824}
{0 CHEMBL321870,1 38,2 64.279,3 45,4 11,5 61.765,6 99.778,7 99,8 103,9 112.587,10 77,11 58,12 54,13 735.94,14 27,15 6,16 6.519}
{0 CHEMBL322610,1 34,2 62.177,3 42,4 11,5 58.555,6 93.963,7 93,8 96,9 105.892,10 70.5,11 54,12 51,13 811.77,14 23,15 6,16 7.602}
{0 CHEMBL322889,1 36,2 62.523,3 44,4 11,5 60.26,6 97.996,7 97,8 101,9 110.67,10 75.5,11 57,12 53,13 724.92,14 25,15 6,16 4}
{0 CHEMBL327479,1 37,2 62.029,3 45,4 11,5 59.249,6 96.458,7 96,8 99,9 109.005,10 71,11 54,12 51,13 695.91,14 26,15 6,16 7.151}
{0 CHEMBL329490,1 41,2 66.79,3 47,4 11,5 63.776,6 102.341,7 102,8 106,9 115.421,10 78.5,11 59,12 55,13 745.97,14 30,15 6,16 5.824}
{0 CHEMBL329847,1 37,2 62.029,3 45,4 11,5 59.249,6 96.458,7 96,8 99,9 109.005,10 71,11 54,12 51,13 695.91,14 26,15 6,16 5.664}
{0 CHEMBL330233,1 31,2 54.506,3 41,4 11,5 52.195,6 86.69,7 86,8 88,9 98.175,10 61,11 47,12 45,13 619.81,14 20,15 6,16 6}
{0 CHEMBL330561,1 35,2 60.915,3 43,4 11,5 57.909,6 93.65,7 93,8 96,9 105.51,10 69.5,11 53,12 50,13 701.94,14 24,15 6,16 7.04}
{0 CHEMBL333283,1 32,2 51.466,3 34,4 10,5 48.782,6 76.061,7 76,8 81,9 85.664,10 60.5,11 47,12 42,13 584.18,14 22,15 2,16 7.42}
{0 CHEMBL339053,1 33,2 54.506,3 41,4 17,5 50.868,6 82.494,7 83,8 88,9 93.826,10 57.5,11 47,12 42,13 589.25,14 16,15 2,16 8.119}
{0 CHEMBL340355,1 32,2 51.466,3 34,4 10,5 48.782,6 76.061,7 76,8 81,9 85.664,10 60.5,11 47,12 42,13 584.18,14 22,15 2,16 7.229}
{0 CHEMBL343094,1 34,2 59.518,3 43,4 11,5 57.238,6 93.894,7 93,8 96,9 106.172,10 69.5,11 53,12 50,13 685.88,14 23,15 6,16 5.959}
{0 CHEMBL346925,1 36,2 61.273,3 44,4 11,5 58.744,6 95.676,7 95,8 98,9 108.088,10 71,11 54,12 51,13 696.9,14 25,15 6,16 5.268}
{0 CHEMBL347216,1 36,2 61.273,3 44,4 11,5 58.744,6 95.676,7 95,8 98,9 108.088,10 71,11 54,12 51,13 696.9,14 25,15 6,16 7.335}
{0 CHEMBL347364,1 38,2 64.035,3 46,4 11,5 61.27,6 99.559,7 99,8 102,9 112.504,10 73.5,11 56,12 53,13 722.94,14 27,15 6,16 5.569}
{0 CHEMBL348901,1 38,2 64.035,3 46,4 11,5 61.27,6 99.559,7 99,8 102,9 112.504,10 73.5,11 56,12 53,13 722.94,14 27,15 6,16 5.824}
{0 CHEMBL349795,1 30,2 55.398,3 40,4 11,5 52.877,6 86.985,7 86,8 88,9 98.178,10 62,11 48,12 46,13 652.87,14 19,15 6,16 5.09}
{0 CHEMBL350012,1 29,2 54,3 40,4 11,5 52.206,6 87.229,7 86,8 88,9 98.839,10 62,11 48,12 46,13 636.81,14 18,15 6,16 4.559}
{0 CHEMBL357558,1 36,2 61.273,3 44,4 11,5 58.744,6 95.676,7 95,8 98,9 108.088,10 71,11 54,12 51,13 696.9,14 25,15 6,16 7.801}
{0 CHEMBL358833,1 38,2 64.035,3 46,4 11,5 61.27,6 99.559,7 99,8 102,9 112.504,10 73.5,11 56,12 53,13 722.94,14 27,15 6,16 5.108}
{0 CHEMBL359318,1 26,2 48.989,3 38,4 11,5 47.163,6 80.025,7 79,8 80,9 90.843,10 53.5,11 42,12 41,13 570.74,14 15,15 6,16 4.36}
{0 CHEMBL364346,1 34,2 57.597,3 51,4 25,5 53.256,6 92.108,7 93,8 97,9 105.926,10 52,11 46,12 42,13 582.89,14 9,15 3,16 5.373}
{0 CHEMBL364726,1 50,2 88.007,3 77,4 28,5 81.479,6 140.588,7 142,8 145,9 162.021,10 83.5,11 68,12 65,13 896.38,14 22,15 5,16 7.873}
{0 CHEMBL370254,1 32,2 56.302,3 41,4 10,5 53.997,6 88.683,7 88,8 91,9 100.547,10 65.5,11 50,12 47,13 643.84,14 22,15 5,16 7.733}
{0 CHEMBL370261,1 46,2 80.654,3 67,4 23,5 75.56,6 128.497,7 129,8 132,9 147.154,10 81.5,11 65,12 62,13 854.24,14 23,15 6,16 7.979}
{0 CHEMBL384224,1 52,2 93.455,3 68,4 21,5 91.245,6 152.192,7 149,8 152,9 170.328,10 106,11 84,12 81,13 1129.34,14 31,15 13,16 4}
{0 CHEMBL386081,1 68,2 123.768,3 95,4 31,5 119.577,6 202.075,7 199,8 203,9 227.805,10 135.5,11 108,12 104,13 1450.82,14 37,15 14,16 9.357}
{0 CHEMBL386583,1 50,2 89.183,3 68,4 23,5 85.671,6 143.555,7 142,8 146,9 162.281,10 98.5,11 78,12 74,13 1025.32,14 27,15 10,16 10.06}
{0 CHEMBL386729,1 66,2 113.58,3 82,4 23,5 109.734,6 180.37,7 178,8 183,9 202.606,10 129,11 101,12 96,13 1323.64,14 43,15 13,16 6.98}
{0 CHEMBL393576,1 30,2 52.057,3 40,4 16,5 48.584,6 80.112,7 80,8 83,9 91.027,10 51,11 43,12 40,13 592.65,14 14,15 2,16 9.149}
{0 CHEMBL398929,1 33,2 55.478,3 46,4 20,5 51.316,6 86.337,7 87,8 91,9 98.83,10 52,11 45,12 41,13 585.28,14 13,15 1,16 9.222}
{0 CHEMBL402258,1 66,2 113.972,3 79,4 21,5 111.131,6 181.359,7 178,8 183,9 202.693,10 134,11 104,12 99,13 1366.62,14 45,15 15,16 5.495}
{0 CHEMBL40233,1 19,2 30.432,3 21,4 6,5 28.051,6 43.596,7 44,8 46,9 49.2,10 32,11 25,12 23,13 373.32,14 13,15 1,16 6.658}
{0 CHEMBL405087,1 51,2 92.506,3 65,4 19,5 88.298,6 143.716,7 142,8 147,9 161.579,10 104.5,11 82,12 77,13 1096.45,14 32,15 9,16 9.699}
{0 CHEMBL405174,1 39,2 63.268,3 43,4 9,5 60.722,6 96.574,7 96,8 100,9 108.59,10 76.5,11 57,12 53,13 717.91,14 30,15 6,16 7.676}
{0 CHEMBL405335,1 52,2 94.262,3 74,4 25,5 90.053,6 152.199,7 151,8 155,9 172.898,10 101.5,11 81,12 77,13 1067.42,14 27,15 10,16 9.347}
{0 CHEMBL406032,1 73,2 126.211,3 85,4 23,5 123.459,6 199.977,7 196,8 204,9 223.311,10 153.5,11 119,12 111,13 1528.79,14 50,15 15,16 6.403}
{0 CHEMBL406550,1 68,2 117.433,3 80,4 21,5 114.868,6 186.788,7 183,8 189,9 208.4,10 141,11 109,12 103,13 1421.66,14 47,15 15,16 5.338}
{0 CHEMBL406651,1 23,2 32.773,3 20,4 3,5 31.214,6 46.811,7 47,8 50,9 52.152,10 41,11 30,12 27,13 356.45,14 20,15 2,16 4}
{0 CHEMBL406842,1 51,2 93.364,3 64,4 19,5 89.126,6 144.039,7 142,8 147,9 161.523,10 105.5,11 83,12 78,13 1130.89,14 32,15 9,16 9.174}
{0 CHEMBL406891,1 52,2 94.268,3 67,4 20,5 89.825,6 146.599,7 145,8 150,9 164.994,10 105.5,11 83,12 78,13 1110.48,14 32,15 9,16 7.292}
{0 CHEMBL406985,1 44,2 74.995,3 55,4 16,5 71.829,6 117.85,7 117,8 121,9 133.082,10 85,11 66,12 62,13 850.1,14 28,15 8,16 7.745}
{0 CHEMBL40711,1 18,2 28.608,3 18,4 5,5 26.907,6 41.225,7 41,8 43,9 46.124,10 32,11 25,12 23,13 377.28,14 13,15 1,16 6.796}
{0 CHEMBL407346,1 64,2 112.103,3 78,4 22,5 107.539,6 174.435,7 172,8 177,9 195.034,10 126,11 99,12 94,13 1331.7,14 42,15 12,16 6.81}
{0 CHEMBL408398,1 43,2 73.234,3 53,4 15,5 70.302,6 114.967,7 114,8 118,9 129.666,10 84,11 65,12 61,13 836.07,14 28,15 8,16 8.398}
{0 CHEMBL40857,1 17,2 27.546,3 16,4 4,5 25.655,6 38.185,7 38,8 40,9 42.522,10 31,11 24,12 22,13 334.87,14 13,15 1,16 5.569}
{0 CHEMBL408600,1 50,2 89.183,3 68,4 23,5 85.671,6 143.555,7 142,8 146,9 162.281,10 98.5,11 78,12 74,13 1025.32,14 27,15 10,16 10.222}
{0 CHEMBL409190,1 65,2 118.41,3 80,4 22,5 112.956,6 181.792,7 179,8 184,9 202.871,10 132,11 104,12 99,13 1437.89,14 43,15 13,16 6.8}
{0 CHEMBL409495,1 116,2 217.717,3 166,4 60,5 207.942,6 349.936,7 345,8 352,9 393.935,10 227,11 186,12 179,13 2573.4,14 56,15 26,16 7.5}
{0 CHEMBL410091,1 68,2 117.433,3 80,4 21,5 114.868,6 186.788,7 183,8 189,9 208.4,10 141,11 109,12 103,13 1421.66,14 47,15 15,16 5}
{0 CHEMBL410404,1 51,2 92.506,3 65,4 19,5 88.298,6 143.716,7 142,8 147,9 161.579,10 104.5,11 82,12 77,13 1096.45,14 32,15 9,16 8.854}
{0 CHEMBL410435,1 33,2 46.824,3 29,4 5,5 44.342,6 66.447,7 67,8 72,9 74.311,10 59,11 43,12 38,13 499.65,14 28,15 2,16 4}
{0 CHEMBL410763,1 60,2 107.274,3 80,4 25,5 103.922,6 173.814,7 171,8 175,9 195.4,10 120.5,11 95,12 91,13 1265.56,14 35,15 12,16 9.108}
{0 CHEMBL411378,1 52,2 94.268,3 67,4 20,5 89.825,6 146.599,7 145,8 150,9 164.994,10 105.5,11 83,12 78,13 1110.48,14 32,15 9,16 8.051}
{0 CHEMBL411400,1 53,2 96.029,3 69,4 21,5 91.352,6 149.483,7 148,8 153,9 168.41,10 106.5,11 84,12 79,13 1124.51,14 32,15 9,16 7.699}
{0 CHEMBL411775,1 73,2 126.211,3 85,4 23,5 123.459,6 199.977,7 196,8 204,9 223.311,10 153.5,11 119,12 111,13 1528.79,14 50,15 15,16 9.585}
{0 CHEMBL413465,1 68,2 117.433,3 80,4 21,5 114.868,6 186.788,7 183,8 189,9 208.4,10 141,11 109,12 103,13 1421.66,14 47,15 15,16 4.893}
{0 CHEMBL414900,1 71,2 123.205,3 84,4 23,5 120.437,6 195.875,7 192,8 199,9 218.812,10 147.5,11 115,12 108,13 1489.75,14 48,15 15,16 4}
{0 CHEMBL414965,1 55,2 96.955,3 72,4 22,5 93.241,6 154.643,7 153,8 158,9 174.692,10 109.5,11 86,12 81,13 1117.43,14 33,15 10,16 9.42}
{0 CHEMBL415200,1 50,2 89.495,3 63,4 19,5 85.256,6 138.512,7 137,8 142,9 155.583,10 100.5,11 79,12 74,13 1054.4,14 31,15 8,16 6.745}
{0 CHEMBL416244,1 18,2 30.319,3 19,4 5,5 27.711,6 41.789,7 42,8 44,9 46.704,10 32,11 25,12 23,13 391.36,14 13,15 1,16 7.174}
{0 CHEMBL426282,1 42,2 73.609,3 59,4 19,5 69.453,6 116.963,7 117,8 120,9 133.493,10 77.5,11 61,12 58,13 798.12,14 23,15 6,16 7.842}
{0 CHEMBL427860,1 30,2 51.018,3 43,4 16,5 46.879,6 79.058,7 80,8 82,9 90.66,10 47,11 39,12 37,13 527.22,14 14,15 2,16 8.495}
{0 CHEMBL428134,1 169,2 340.865,3 244,4 92,5 323.759,6 536.405,7 526,8 537,9 599.751,10 354.5,11 293,12 282,13 4241.75,14 77,15 44,16 8.392}
{0 CHEMBL429236,1 63,2 115.183,3 92,4 33,5 110.169,6 187.781,7 186,8 190,9 213.054,10 121.5,11 98,12 94,13 1309.73,14 30,15 13,16 9.495}
{0 CHEMBL430239,1 50,2 89.734,3 69,4 23,5 85.978,6 144.33,7 143,8 147,9 163.57,10 98.5,11 78,12 74,13 1024.34,14 27,15 10,16 10.06}
{0 CHEMBL430489,1 33,2 58.762,3 42,4 11,5 56.733,6 93.112,7 92,8 95,9 105.255,10 69.5,11 53,12 50,13 686.87,14 22,15 6,16 4.613}
{0 CHEMBL430843,1 35,2 61.279,3 45,4 12,5 58.765,6 96.778,7 96,8 99,9 109.587,10 70.5,11 54,12 51,13 699.91,14 23,15 6,16 4.955}
{0 CHEMBL431092,1 39,2 65.677,3 45,4 11,5 62.436,6 99.534,7 99,8 103,9 111.925,10 77,11 58,12 54,13 752,14 28,15 6,16 6.676}
{0 CHEMBL431242,1 36,2 62.523,3 44,4 11,5 60.26,6 97.996,7 97,8 101,9 110.67,10 75.5,11 57,12 53,13 724.92,14 25,15 6,16 4.465}
{0 CHEMBL431523,1 24,2 39.836,3 31,4 8,5 37.385,6 61.65,7 62,8 64,9 70.308,10 43,11 33,12 31,13 421.6,14 16,15 2,16 4}
{0 CHEMBL432018,1 40,2 67.04,3 47,4 11,5 64.292,6 103.661,7 103,8 107,9 117.002,10 79.5,11 60,12 56,13 761.98,14 29,15 6,16 4}
{0 CHEMBL432027,1 39,2 65.035,3 46,4 11,5 62.27,6 100.559,7 100,8 104,9 113.504,10 77,11 58,12 54,13 734.95,14 28,15 6,16 5.208}
{0 CHEMBL432201,1 39,2 65.035,3 46,4 11,5 62.27,6 100.559,7 100,8 104,9 113.504,10 77,11 58,12 54,13 734.95,14 28,15 6,16 6.277}
{0 CHEMBL432895,1 28,2 48.523,3 36,4 9,5 46.406,6 76.494,7 76,8 78,9 86.637,10 55,11 42,12 40,13 548.72,14 19,15 5,16 5.635}
{0 CHEMBL433296,1 34,2 59.518,3 43,4 11,5 57.238,6 93.894,7 93,8 96,9 106.172,10 69.5,11 53,12 50,13 685.88,14 23,15 6,16 6.812}
{0 CHEMBL433522,1 31,2 55.756,3 41,4 11,5 53.711,6 89.01,7 88,8 90,9 100.756,10 63.5,11 49,12 47,13 647.83,14 20,15 6,16 4.523}
{0 CHEMBL435368,1 18,2 28.671,3 19,4 5,5 26.524,6 40.712,7 41,8 43,9 45.784,10 31,11 24,12 22,13 359.29,14 13,15 1,16 7.409}
{0 CHEMBL438890,1 65,2 111.268,3 79,4 22,5 107.901,6 176.712,7 174,8 179,9 197.902,10 128,11 100,12 95,13 1310.59,14 43,15 13,16 6.32}
{0 CHEMBL439490,1 78,2 142.018,3 111,4 39,5 136.737,6 232.119,7 229,8 234,9 262.127,10 152.5,11 123,12 118,13 1647.1,14 39,15 16,16 9.699}
{0 CHEMBL439560,1 29,2 48.307,3 36,4 15,5 45.975,6 75.828,7 75,8 78,9 85.849,10 50,11 42,12 39,13 565.14,14 14,15 2,16 8.26}
{0 CHEMBL440242,1 66,2 113.58,3 82,4 23,5 109.734,6 180.37,7 178,8 183,9 202.606,10 129,11 101,12 96,13 1323.64,14 43,15 13,16 5.84}
{0 CHEMBL440633,1 68,2 117.433,3 80,4 21,5 114.868,6 186.788,7 183,8 189,9 208.4,10 141,11 109,12 103,13 1421.66,14 47,15 15,16 5.212}
{0 CHEMBL441988,1 28,2 48.523,3 36,4 9,5 46.406,6 76.494,7 76,8 78,9 86.637,10 55,11 42,12 40,13 548.72,14 19,15 5,16 4}
{0 CHEMBL444219,1 34,2 59.455,3 42,4 11,5 57.621,6 94.407,7 93,8 96,9 106.511,10 70.5,11 54,12 51,13 703.87,14 23,15 6,16 9.347}
{0 CHEMBL448536,1 35,2 60.762,3 42,4 11,5 58.733,6 95.112,7 94,8 97,9 107.255,10 73.5,11 55,12 52,13 710.89,14 23,15 6,16 8.547}
{0 CHEMBL451423,1 34,2 60.671,3 42,4 11,5 59.162,6 96.767,7 95,8 98,9 108.673,10 74.5,11 56,12 53,13 730.88,14 23,15 8,16 7.886}
{0 CHEMBL454736,1 38,2 64.279,3 45,4 11,5 61.765,6 99.778,7 99,8 103,9 112.587,10 77,11 58,12 54,13 735.94,14 27,15 6,16 7.721}
{0 CHEMBL455826,1 41,2 68.802,3 49,4 12,5 65.819,6 106.545,7 106,8 110,9 120.417,10 80.5,11 61,12 57,13 776.01,14 29,15 6,16 7.195}
{0 CHEMBL488355,1 38,2 66.563,3 51,4 15,5 63.345,6 105.428,7 105,8 108,9 119.832,10 73.5,11 57,12 54,13 742,14 23,15 6,16 5.361}
{0 CHEMBL491870,1 34,2 60.375,3 42,4 11,5 58.066,6 94.218,7 93,8 96,9 106.116,10 70.5,11 54,12 51,13 720.32,14 23,15 6,16 9.398}
{0 CHEMBL497746,1 29,2 49.194,3 40,4 15,5 45.735,6 76.687,7 77,8 79,9 87.585,10 47,11 39,12 37,13 531.18,14 14,15 2,16 8.456}
{0 CHEMBL500516,1 34,2 60.523,3 44,4 11,5 58.26,6 95.996,7 95,8 98,9 108.67,10 70.5,11 54,12 51,13 700.9,14 23,15 6,16 6.658}
{0 CHEMBL50056,1 34,2 59.518,3 43,4 11,5 57.238,6 93.894,7 93,8 96,9 106.172,10 69.5,11 53,12 50,13 685.88,14 23,15 6,16 5.676}
{0 CHEMBL501394,1 34,2 61.233,3 41,4 11,5 58.893,6 94.541,7 93,8 96,9 106.06,10 71.5,11 55,12 52,13 754.76,14 23,15 6,16 8.469}
{0 CHEMBL501679,1 35,2 61.091,3 42,4 12,5 59.915,6 98.316,7 96,8 99,9 110.606,10 73.5,11 57,12 54,13 753.88,14 23,15 6,16 7.893}
{0 CHEMBL502093,1 34,2 60.87,3 42,4 11,5 58.263,6 94.123,7 93,8 96,9 106.013,10 70.5,11 54,12 51,13 764.77,14 23,15 6,16 8.971}
{0 CHEMBL503449,1 35,2 61.279,3 45,4 12,5 58.765,6 96.778,7 96,8 99,9 109.587,10 70.5,11 54,12 51,13 699.91,14 23,15 6,16 8.248}
{0 CHEMBL510687,1 34,2 60.375,3 42,4 11,5 58.066,6 94.218,7 93,8 96,9 106.116,10 70.5,11 54,12 51,13 720.32,14 23,15 6,16 8.063}
{0 CHEMBL565474,1 27,2 49.779,3 37,4 10,5 47.943,6 79.916,7 79,8 81,9 90.717,10 57,11 44,12 42,13 579.75,14 17,15 5,16 4.412}
{0 CHEMBL565688,1 31,2 53.29,3 39,4 9,5 50.954,6 83.479,7 83,8 85,9 94.55,10 60.5,11 46,12 44,13 601.79,14 22,15 6,16 5.299}
{0 CHEMBL565900,1 31,2 53.228,3 36,4 8,5 51.636,6 83.141,7 82,8 84,9 93.428,10 64.5,11 48,12 46,13 628.77,14 22,15 6,16 4.369}
{0 CHEMBL565927,1 31,2 53.745,3 39,4 9,5 51.669,6 84.807,7 84,8 86,9 95.76,10 61.5,11 47,12 45,13 617.79,14 22,15 6,16 4.219}
{0 CHEMBL566150,1 30,2 51.466,3 36,4 8,5 49.81,6 81.109,7 80,8 82,9 91.475,10 60.5,11 46,12 44,13 605.75,14 22,15 6,16 4.833}
{0 CHEMBL566162,1 30,2 52.387,3 36,4 8,5 50.254,6 80.92,7 80,8 82,9 91.079,10 60.5,11 46,12 44,13 622.2,14 22,15 6,16 5.397}
{0 CHEMBL566545,1 31,2 53.745,3 39,4 9,5 51.669,6 84.807,7 84,8 86,9 95.76,10 61.5,11 47,12 45,13 617.79,14 22,15 6,16 4.863}
{0 CHEMBL566764,1 32,2 55.75,3 40,4 9,5 53.69,6 87.909,7 87,8 89,9 99.258,10 64.5,11 49,12 47,13 644.82,14 23,15 7,16 4.693}
{0 CHEMBL567233,1 31,2 53.745,3 39,4 9,5 51.669,6 84.807,7 84,8 86,9 95.76,10 61.5,11 47,12 45,13 617.79,14 22,15 6,16 4.939}
{0 CHEMBL567240,1 30,2 51.983,3 37,4 8,5 50.142,6 81.923,7 81,8 83,9 92.345,10 60.5,11 46,12 44,13 603.76,14 22,15 6,16 4.895}
{0 CHEMBL567634,1 32,2 54.29,3 39,4 8,5 51.954,6 84.479,7 84,8 86,9 95.55,10 62.5,11 47,12 45,13 613.8,14 24,15 7,16 5.327}
{0 CHEMBL568409,1 30,2 52.228,3 36,4 8,5 50.636,6 82.141,7 81,8 84,9 92.428,10 63.5,11 48,12 45,13 616.76,14 22,15 5,16 4.764}
{0 CHEMBL568577,1 30,2 52.387,3 36,4 8,5 50.254,6 80.92,7 80,8 82,9 91.079,10 60.5,11 46,12 44,13 622.2,14 22,15 6,16 5.284}
{0 CHEMBL568836,1 31,2 53.682,3 38,4 10,5 52.052,6 85.319,7 84,8 86,9 96.099,10 62.5,11 48,12 46,13 635.78,14 21,15 6,16 4.907}
{0 CHEMBL568940,1 31,2 53.438,3 37,4 9,5 51.857,6 84.25,7 83,8 86,9 94.554,10 63.5,11 49,12 46,13 631.77,14 22,15 6,16 4.627}
{0 CHEMBL568965,1 33,2 56.199,3 39,4 9,5 54.383,6 88.134,7 87,8 90,9 98.969,10 66.5,11 51,12 48,13 657.81,14 24,15 7,16 4.998}
{0 CHEMBL569076,1 30,2 51.404,3 35,4 8,5 50.194,6 81.621,7 80,8 82,9 91.815,10 61.5,11 47,12 45,13 623.74,14 22,15 6,16 4.629}
{0 CHEMBL569086,1 29,2 50.676,3 35,4 9,5 49.33,6 80.367,7 79,8 82,9 90.139,10 60.5,11 47,12 44,13 605.73,14 20,15 5,16 4.509}
{0 CHEMBL569220,1 30,2 51.466,3 36,4 8,5 49.81,6 81.109,7 80,8 82,9 91.475,10 60.5,11 46,12 44,13 605.75,14 22,15 6,16 4.717}
{0 CHEMBL569221,1 31,2 53.745,3 39,4 10,5 51.669,6 84.807,7 84,8 86,9 95.76,10 61.5,11 47,12 45,13 617.79,14 21,15 6,16 4.643}
{0 CHEMBL569693,1 43,2 71.319,3 52,4 14,5 67.851,6 110.21,7 110,8 114,9 124.749,10 81,11 62,12 58,13 789.05,14 29,15 8,16 9.268}
{0 CHEMBL569694,1 31,2 54.052,3 41,4 11,5 51.481,6 85.363,7 85,8 87,9 96.966,10 59.5,11 46,12 44,13 603.81,14 20,15 5,16 4.82}
{0 CHEMBL569695,1 30,2 51.529,3 37,4 8,5 49.427,6 80.596,7 80,8 82,9 91.135,10 59.5,11 45,12 43,13 587.76,14 22,15 6,16 4.276}
{0 CHEMBL569696,1 31,2 53.103,3 36,4 9,5 52.104,6 85.018,7 83,8 85,9 95.569,10 63.5,11 49,12 47,13 655.76,14 22,15 6,16 5.432}
{0 CHEMBL569697,1 30,2 51.983,3 37,4 8,5 50.142,6 81.923,7 81,8 83,9 92.345,10 60.5,11 46,12 44,13 603.76,14 22,15 6,16 4.742}
{0 CHEMBL570903,1 31,2 54.199,3 39,4 11,5 52.383,6 86.134,7 85,8 88,9 96.969,10 62.5,11 49,12 46,13 633.79,14 20,15 5,16 4.593}
{0 CHEMBL589308,1 41,2 70.472,3 51,4 13,5 67.775,6 111.083,7 110,8 113,9 125.251,10 81,11 62,12 59,13 810.03,14 28,15 8,16 7.979}
{0 CHEMBL589468,1 44,2 74.995,3 55,4 16,5 71.829,6 117.85,7 117,8 121,9 133.082,10 85,11 66,12 62,13 850.1,14 28,15 8,16 6.194}
{0 CHEMBL589515,1 35,2 58.813,3 43,4 10,5 56.007,6 91.247,7 91,8 94,9 103.381,10 67,11 51,12 48,13 653.87,14 25,15 5,16 7.151}
{0 CHEMBL589516,1 43,2 73.234,3 53,4 15,5 70.302,6 114.967,7 114,8 118,9 129.666,10 84,11 65,12 61,13 836.07,14 28,15 8,16 5.417}
{0 CHEMBL589517,1 45,2 76.756,3 57,4 17,5 73.355,6 120.734,7 120,8 124,9 136.497,10 86,11 67,12 63,13 864.13,14 28,15 8,16 5.481}
{0 CHEMBL602299,1 45,2 76.756,3 57,4 17,5 73.355,6 120.734,7 120,8 124,9 136.497,10 86,11 67,12 63,13 864.13,14 28,15 8,16 5.77}
{0 CHEMBL602650,1 41,2 70.472,3 51,4 13,5 67.775,6 111.083,7 110,8 113,9 125.251,10 81,11 62,12 59,13 810.03,14 28,15 8,16 5.008}
{0 CHEMBL602651,1 41,2 70.472,3 51,4 13,5 67.775,6 111.083,7 110,8 113,9 125.251,10 81,11 62,12 59,13 810.03,14 28,15 8,16 8.056}
{0 CHEMBL602652,1 43,2 73.234,3 53,4 15,5 70.302,6 114.967,7 114,8 118,9 129.666,10 84,11 65,12 61,13 836.07,14 28,15 8,16 5.863}
{0 CHEMBL602653,1 43,2 73.234,3 53,4 15,5 70.302,6 114.967,7 114,8 118,9 129.666,10 84,11 65,12 61,13 836.07,14 28,15 8,16 5.708}
{0 CHEMBL602852,1 44,2 74.995,3 55,4 16,5 71.829,6 117.85,7 117,8 121,9 133.082,10 85,11 66,12 62,13 850.1,14 28,15 8,16 5.648}
{0 CHEMBL602853,1 45,2 76.756,3 57,4 17,5 73.355,6 120.734,7 120,8 124,9 136.497,10 86,11 67,12 63,13 864.13,14 28,15 8,16 7.31}
{0 CHEMBL607103,1 35,2 60.518,3 43,4 12,5 58.238,6 94.894,7 94,8 98,9 107.172,10 71.5,11 55,12 51,13 697.89,14 23,15 6,16 4}
{0 CHEMBL607104,1 35,2 60.518,3 43,4 12,5 58.238,6 94.894,7 94,8 98,9 107.172,10 71.5,11 55,12 51,13 697.89,14 23,15 6,16 4}
{0 CHEMBL61681,1 27,2 41.069,3 28,4 5,5 38.837,6 60.665,7 61,8 64,9 68.394,10 49,11 36,12 33,13 440.59,14 22,15 2,16 4}
{0 CHEMBL62228,1 25,2 41.841,3 32,4 9,5 39.406,6 64.752,7 65,8 68,9 73.806,10 46,11 36,12 33,13 448.63,14 16,15 2,16 5.469}
{0 CHEMBL63850,1 28,2 47.126,3 38,4 12,5 43.987,6 73.403,7 74,8 77,9 84.052,10 49,11 39,12 36,13 490.72,14 16,15 2,16 4}
{0 CHEMBL63867,1 28,2 44.807,3 34,4 8,5 42.132,6 68.643,7 69,8 71,9 77.849,10 48,11 37,12 35,13 474.66,14 20,15 2,16 4}
{0 CHEMBL64954,1 23,2 38.074,3 29,4 7,5 35.858,6 58.767,7 59,8 61,9 66.893,10 42,11 32,12 30,13 407.57,14 16,15 2,16 4.625}
{0 CHEMBL64967,1 26,2 42.597,3 33,4 10,5 39.912,6 65.534,7 66,8 69,9 74.723,10 46,11 36,12 33,13 447.64,14 16,15 2,16 4}
{0 CHEMBL65339,1 28,2 48.523,3 36,4 9,5 46.406,6 76.494,7 76,8 78,9 86.637,10 55,11 42,12 40,13 548.72,14 19,15 5,16 4.951}
{0 CHEMBL94369,1 41,2 66.79,3 47,4 11,5 63.776,6 102.341,7 102,8 106,9 115.421,10 78.5,11 59,12 55,13 745.97,14 30,15 6,16 5.538}
{0 CHEMBL94391,1 34,2 59.518,3 43,4 11,5 57.238,6 93.894,7 93,8 96,9 106.172,10 69.5,11 53,12 50,13 685.88,14 23,15 6,16 6.296}
{0 CHEMBL96531,1 39,2 64.79,3 47,4 13,5 61.776,6 100.341,7 100,8 104,9 113.421,10 74,11 57,12 53,13 721.95,14 26,15 6,16 6.146}
{0 CHEMBL96871,1 38,2 63.029,3 45,4 12,5 60.249,6 97.458,7 97,8 101,9 110.005,10 73,11 56,12 52,13 707.92,14 26,15 6,16 5.538}
